##TITLE=Acido oxalico $$ Begin of the data block
##JCAMP-DX=5.00 $$ ACD/SpecManager v 10.08
##SPECTROMETER/DATA SYSTEM=Alpha
##DATE=08 Jul 2016 10:14:48
##DATA TYPE=INFRARED SPECTRUM
##DATA CLASS=XYDATA
##ORIGIN=
##OWNER=
##NPOINTS=1765
##FIRSTX=399.76428223
##LASTX=3997.64306641
##MAXX=3997.64306641
##MINX=399.76428223
##MAXY=0.34093538
##MINY=0.01670593
##XFACTOR=1.0000000000
##YFACTOR=1.000000000000000e-9
##FIRSTY=0.25554401
##DELTAX=2.03961372
##XUNITS=1/CM
##YUNITS=ARBITRARY UNITS
##XYDATA=(X++(Y..Y))
399.8B55544007P80523O9111o04391j155734j842558k273709k174735k100691k336487
418.1B43905336k202586j802355j820624j661807j447126j793951k229318k319664
434.4B28627905k696424l175557k958954k723842l073812l322020l168061k968014
450.8B04541221k768501k420307k356901k509952k291977k245993k699032l316283
467.1A83932275l936559m929498o004438n862027m891023l373385q91641J670197L273979
485.4A58987880L774479L470346K535597J438289P37727J92195l48538k30491Q21412
503.8A71378896K414778M192084N322247N357743M830747M225761L469005K416954
520.1B03608215J417935P19994P3820o38723j170725j652732k175480k451167k589702
$$ plain form
399.8 255544007 256324530 256393641 255789250 254633516 252790958 250517249 248342514 246241823 243905336
418.1 243905336 241702750 239900395 238079771 236417964 234970838 233176887 230947569 228627905
434.4 228627905 225931481 222755924 219796970 217073128 213999316 210677296 207509235 204541221
450.8 204541221 201772720 199352413 196995512 194485560 192193583 189947590 187248558 183932275
467.1 183932275 179995716 175066218 169061780 163199753 158308730 154935345 154043704 155713901 158987880
485.4 158987880 162762359 166232705 168768302 170206591 170944318 171136513 170787975 170557484 171378896
503.8 171378896 173793674 177985758 183308005 188665748 193496495 197722256 201191261 203608215
520.1 203608215 205026150 205746144 205819964 205181241 204010516 202357784 200182304 197731137 195141435
538.5A95141435k865285l078505l122300l188372l260821l184959l092319l040746
554.8A70308128k743021k320304k087161j853794j397878r95025q09327n60268k62261
573.1A57279089k06113k07215M1440K69383K23458J30951J56626R3788k0697L3825
593.5A57794535L3632o5729N4345L30597M68224N12198O46591P98493R02981J099125
613.9A62574992J305416J351118J392841J535654J538605J338616J204341J122386
630.2A73363969R48429Q31947P34537N17533L17245K25276J36182m0502j19179m6089
650.6A76869348m7922j10269j26347j59845j67489n1871K26125M03956k09764p69093
671A75856829q05199r39131q95590p49588p96512j002162j362056j954004k530888
$$ plain form
538.5 195141435 192276150 189197645 186075345 182886973 179626152 176441193 173348874 170308128
554.8 170308128 167565107 165244803 163157642 161303848 159905970 158910945 158101618 157541350 157279089
573.1 157279089 157072976 156865761 156907201 157176584 157400042 157530993 157687619 157781407 157760710 157794535
593.5 157794535 157828167 157762438 157816783 158147380 158615604 159127802 159774393 160572886 161475867 162574992
613.9 162574992 163880408 165231526 166624367 168160021 169698626 171037242 172241583 173363969
630.2 173363969 174312398 175144345 175878882 176396415 176713660 176938936 177075118 177034616 176915437 176869348
650.6 176869348 176821426 176711157 176584810 176424965 176257476 176205605 176431730 176835686 176625922 175856829
671 175856829 175051630 174112499 173216909 172467321 171670809 170668647 169306591 167352587 164821699
689.4A64821699k825990k971754l260567l788576m473433n306720o390676p749483
705.7A28054500r216376j0420345j0923989j0435797q662954n879462k803937N28723
722G0240363M908264J1036791J9130394K8148629L4930855L6049485L1819135K5873408
738.3B62137324K0723223J6284943J1903286P547170L701120N54920j605243k089798
754.7C19156945j135916q0764K01642j60962r11713j761972k361596k594531k758026
773C07593107k846688k657026k393633k146006j767337j371115j113683p86424m33981
791.4B92077214l05534k72810j14799m470n5909n6804l6448j76817l84331n01185o18667
813.8B89549440q23408j043767j225531j504660j757800j730174j661271j854449k229393
$$ plain form
689.4 164821699 161995709 159023955 155763388 151974812 147501379 142194659 135803983 128054500
705.7 128054500 118838124 108417779 97493790 87057993 78395039 72515577 69711640 70240363
722 70240363 75148627 86185418 105315812 133464441 168395296 204444781 236263916 262137324
738.3 262137324 282860547 299145490 311048776 318595946 322297066 322851986 321246743 319156945
754.7 319156945 318021029 317940265 318141907 317980945 317069232 315307260 312945664 310351133 307593107
773 307593107 304746419 302089393 299695760 297549754 295782417 294411302 293297619 292511195 292077214
791.4 292077214 291771680 291498870 291384071 291379601 291323692 291266888 291230440 291053623 290669292 290168107 289549440
813.8 289549440 288726032 287682265 286456734 284952074 283194274 281464100 279802829 277948380 275718987
832.2B75718987k588391k833098k887279k911836l176540l669203m589438o390393
848.5B46672809p158756n042240l127352l584250m381121m448250m237562l896147
864.8B10797131l510222l441795l462956k736792j206562M33833J717895K560243K994314
883.2B04145089L085777K885610K473518J882672J157299M20094k95148j026824j751631
901.5B12976456k428770k991230l316641l340736l065764k554775j799538p82133L72783
919.9A93069652J521706K553389L353193L821552L981128L941372L711418L252715
936.2B19206125K723366K270519J828730J364381R37715N85854K76297p90k19091l85896
956.6B28587210n12674o15999p13379q00520q62673q74489q73372r09209r39340r77784
$$ plain form
832.2 275718987 273130596 270297498 267410219 264498383 261321843 257652640 253063202 246672809
848.5 246672809 239514053 234471813 231344461 227760211 223379090 218930840 214693278 210797131
864.8 210797131 207286909 203845114 200382158 197645366 196438804 196872637 198590532 201150775 204145089
883.2 204145089 207230866 210116476 212589994 214472666 215629965 216050059 215754911 214728087 212976456
901.5 212976456 210547686 207556456 204239815 200899079 197833315 195278540 193479002 192696869 193069652
919.9 193069652 194591358 197144747 200497940 204319492 208300620 212241992 215953410 219206125
936.2 219206125 221929491 224200010 226028740 227393121 228330836 228916690 229192987 229192197 228973106 228587210
956.6 228587210 228074536 227458537 226745158 225944638 225081965 224207476 223334104 222424895 221485555 220507771
977B20507771j071036j182944j276627j360401j449883j535192j606480j678630j737550
995.3B07609028j767740j821697j891345j920506j934200j970649j999438k014503
1011.6A92288950k038911k036124k019138k036601k069309k072990k055079k064079
1028A75896719k042189j934052j867562j893282j886532j833916j840770j899674j925156
1046.3A58773586j933545j951202j934633j905278j926437j942738j871095j790612
1062.6A43518046j774833j755104j710921j692608j682803j652584j635119j631781
1079A29982293j611993j589835j583218j579658j575380j603223j663052j714192j744151
1097.3A15317591j777545j834199j884207j893602j882606j869984j818284j700997
$$ plain form
977 220507771 219436735 218253791 216977164 215616763 214166880 212631688 211025208 209346578 207609028
995.3 207609028 205841288 204019591 202128246 200207740 198273540 196302891 194303453 192288950
1011.6 192288950 190250039 188213915 186194777 184158176 182088867 180015877 177960798 175896719
1028 175896719 173854530 171920478 170052916 168159634 166273102 164439186 162598416 160698742 158773586
1046.3 158773586 156840041 154888839 152954206 151048928 149122491 147179753 145308658 143518046
1062.6 143518046 141743213 139988109 138277188 136584580 134901777 133249193 131614074 129982293
1079 129982293 128370300 126780465 125197247 123617589 122042209 120438986 118775934 117061742 115317591
1097.3 115317591 113540046 111705847 109821640 107928038 106045432 104175448 102357164 100656167
1113.6A00656167j539015j365594j157001q79206n70818k57738O1355L87781O97098
1132I6033029R11989J019425J078725J091063J049802R73128Q76881P54617N82382
1150.3A04371041L84279J82010l2976k72163n29483p83085j022101j247242j450255
1168.7I9600025j624026j764081j843043j846775j767166j632490j524180j474865
1185H6123399j468144j486853j540556j671635j840897j926623j868352j742356j716666
1203.4G0861317j888089k254605k774432l373463m011683m658826n182158n358983
1219.7D1359078n010743m150170l015394j938956j122523n86465k31677M4571K64117
1238.1B5611838M93313P91331J076570J187964J050829P62998M75932K40907Q4806
$$ plain form
1113.6 100656167 99117152 97751558 96594557 95715351 95144533 94886795 94948150 95335931 96033029
1132 96033029 96945018 97964443 99043168 100134231 101184033 102157161 103034042 103788659 104371041
1150.3 104371041 104755320 104937330 104904354 104632191 104102708 103319623 102297522 101050280 99600025
1168.7 99600025 97975999 96211918 94368875 92522100 90754934 89122444 87598264 86123399
1185 86123399 84655255 83168402 81627846 79956211 78115314 76188691 74320339 72577983 70861317
1203.4 70861317 68973228 66718623 63944191 60570728 56559045 51900219 46718061 41359078
1219.7 41359078 36348335 32198165 29182771 27243815 26121292 25534827 25303150 25347721 25611838
1238.1 25611838 26105151 26896482 27973052 29161016 30211845 30974843 31450775 31691682 31776488
1256.4C1776488M8462J24529L19839O53945J145787J812242K709054L888879N353439
1274.8D7832664P086076Q994330J0851711J2299172J2917303J2440063J0849431Q501053
1291.1A31771803O127551M312053L181428K543718K118528J768097J580074J656026
1307.4A55059278J942754K294272K545983K585575K479761K310425K052725J724616
1323.7A72995389J361995R76637N93454K31400j16437m07413n83410n64695l07858
1342.1A74179062M4063L85419P16224J006260J246408J483396J689821J818881J867160
1360.4A84436694J794264J488134J043781N46992n6728p82863j621470k336815l032520
1378.8A81479469l811881m292071m388615m622743m757970m446105m610166n163908
$$ plain form
1256.4 31776488 31824950 31949479 32269318 32923263 34069050 35881292 38590346 42479225 47832664
1274.8 47832664 54918740 63913070 74764781 87063953 99981256 112421319 123270750 131771803
1291.1 131771803 137899354 142211407 145392835 147936553 150055081 151823178 153403252 155059278
1307.4 155059278 157002032 159296304 161842287 164427862 166907623 169218048 171270773 172995389
1323.7 172995389 174357384 175334021 175927475 176158875 176042438 175635025 175051615 174486920 174179062
1342.1 174179062 174223125 174608544 175324768 176331028 177577436 179060832 180750653 182569534 184436694
1360.4 184436694 186230958 187719092 188762873 189309865 189253137 188470274 186848804 184511989 181479469
1378.8 181479469 177667588 173375517 168986902 164364159 159606189 155160084 150549918 145386010
1395.1A45386010n017235m446388l374606j759127j15424J402840K523914L163472
1411.4A37763456L261119K982959K683535K262875J524181J002922O54400L00586k2844
1429.8A52413189k07260k14904l58627m93168j87487J30534L30359N75662Q21545R83581
1450.2A53793424J099244J218468J277268R66474N67243M58300K76402L6686P1735
1468.5A59765244J34408j64092n94347p63744q14334p47204m59462J02564O91340J043782
1488.9A58194155J048013Q43287O07475J86771k40504l27930k14160m43712j271233
1507.3A58382162j293614r34511r37924j035363j140490j187205j453236j549631j362905
1525.6A47487283j361951j197145j217544j574308j345679j024514j657412k071470
$$ plain form
1395.1 145386010 140368775 135922387 132547781 130788654 130673230 132076070 134599984 137763456
1411.4 137763456 141024575 144007534 146691069 148953944 150478125 151481047 152135447 152436033 152413189
1429.8 152413189 152205929 151991025 151632398 151139230 150951743 151082277 151412636 151988298 152809843 153793424
1450.2 153793424 154892668 156111136 157388404 158354878 158922121 159380421 159656823 159693509 159765244
1468.5 159765244 159899652 159735560 159141213 158377469 157563135 156815931 156356469 156459033 157150373 158194155
1488.9 158194155 159242168 160085455 160692930 160879701 160639197 160311267 160097107 159653395 158382162
1507.3 158382162 157088548 156154037 155216113 154180750 153040260 151853055 150399819 148850188 147487283
1525.6 147487283 146125332 144928187 143710643 142136335 140790656 139766142 138108730 136037260
1542A36037260j592874j388833j351446j433805j432895j356081j220464j737327k404071
1560.3A22119464j547031j247183j391977j547686j763657j520336j517273k100617
1576.6A09483704j991384j709997j904235k070076k145909k268441k369359k380528
1593I2643775k409421k417624k392642k384432k323448k145648j982205j836114j557283
1611.3G3194958j212261j086817j077227o77019m54970n78828o12319o03497o60859
1629.7F6231161o29894p44529j205944j299236j122269j168292j323503j795631k024926
1648E4916937j522519j969948k973628k050410j527295j735702k036125k000141j657825
1666.4C7443344j728349j896288j568955j473266j500257j179982r41356r31528j022113
$$ plain form
1542 136037260 134444386 133055553 131704107 130270302 128837407 127481326 126260862 124523535 122119464
1560.3 122119464 120572433 119325250 117933273 116385587 114621930 113101594 111584321 109483704
1576.6 109483704 107492320 105782323 103878088 101808012 99662103 97393662 95024303 92643775
1593 92643775 90234354 87816730 85424088 83039656 80716208 78570560 76588355 74752241 73194958
1611.3 73194958 71982697 70895880 69818653 69141634 68686664 68107836 67495517 66892020 66231161
1629.7 66231161 65601267 64856738 63650794 62351558 61229289 60060997 58737494 56941863 54916937
1648 54916937 53394418 51424470 48450842 46400432 44873137 43137435 41101310 39101169 37443344
1666.4 37443344 35714995 33818707 32249752 30776486 29276229 28096247 27154891 26223363 25201250
1684.7B5201250o79501l56102k47015j06200N4749J70543q7922o34417p02538l73531
1705.1B2239316k2134J87049J25967q6477m47061r66802j153182r77742q99516p60896
1725.5A7238522m35052r7542K07216N08485O95544O41314O50743P15474P97093R76184
1745.9B1897981J180671J414551J540714J464658J428237J386833J217979J116876
1762.2C2648500R97260R31908J036357J248419J648203J866873J832087J953523K215822
1780.6D6378952K395134K557099K679765K633326K739843K951160K714608K328708
1796.9F7378595K160654K060041J935132J782402J675822J615234J532279J401394
1813.2H1541553J279473J203828J128390J038455R51037R08956Q50320P98039P87042
$$ plain form
1684.7 25201250 24521749 24165647 23918632 23812432 23867181 24037724 23949802 23315385 22612847 22239316
1705.1 22239316 22217182 22404231 22530198 22443721 21996660 21029858 19876676 18898934 17999418 17238522
1725.5 17238522 16803470 16705928 16913144 17421629 18117173 18758487 19409230 20124704 20921797 21897981
1745.9 21897981 23078652 24493203 26033917 27498575 28926812 30313645 31531624 32648500
1762.2 32648500 33645760 34577668 35614025 36862444 38510647 40377520 42209607 44163130 46378952
1780.6 46378952 48774086 51331185 54010950 56644276 59384119 62335279 65049887 67378595
1796.9 67378595 69539249 71599290 73534422 75316824 76992646 78607880 80140159 81541553
1813.2 81541553 82821026 84024854 85153244 86191699 87142736 88051692 88902012 89700051 90487093
1831.6I0487093P63848P11732O64815O47791N84118N15513N56909O04309N62317N22390
1852I6620835N04040M75846M55245M42155M28527M03211L35924K80798L37563L97533
1872.4A00681677L74757L23184K93233K80231K70851K56069K29560J91152J77882J94401
1892.8A03272997J68383J53445J66274J56783J40935J32591J06789Q6456J00881J05545
1913.2A04591079R2395N7824N4545Q7858J05500J22987J22562J08428J15201J23888
1933.6A05582267J24879J44273J41628J19552J43350J87955K01404K14421K36548K41623
1954A07337900K57335K74792K68825K71275K89485K96004L07575L36327L53008L52987
1974.4A10345513L53239L58008L58976L54454L55274L66188L63790L47271L42556L59602
$$ plain form
1831.6 90487093 91250941 91962673 92627488 93275279 93859397 94374910 94931819 95536128 96098445 96620835
1852 96620835 97124875 97600721 98055966 98498121 98926648 99329859 99665783 99946581 100284144 100681677
1872.4 100681677 101056434 101379618 101672851 101953082 102223933 102480002 102709562 102900714 103078596 103272997
1892.8 103272997 103441380 103594825 103761099 103917882 104058817 104191408 104298197 104384653 104485534 104591079
1913.2 104591079 104683474 104741298 104795843 104883701 104989201 105112188 105234750 105343178 105458379 105582267
1933.6 105582267 105707146 105851419 105993047 106112599 106255949 106443904 106645308 106859729 107096277 107337900
1954 107337900 107595235 107870027 108138852 108410127 108699612 108995616 109303191 109639518 109992526 110345513
1974.4 110345513 110698752 111056760 111415736 111770190 112125464 112491652 112855442 113202713 113545269 113904871
1994.8A13904871L74146L78132L86104L98256M18096M31538M34451M45410M64194M69923
2015.2A18105121M67233M74744M94294N01290N22226O15477O82652O58028O38664O64622
2035.6A23824351O82309O79068P04303P52122P68304P71150Q04156Q38309Q55878Q73998
2056A31553948Q88854Q93220Q94934R13322R45032R33588Q97869R18314R44942R49875
2076.4A40733898R87276J027212J035511J053974J105383J133964J111671J091331
2092.7A49280220J083151J067951J066581J072332J073748J080751J080006J073629
2109A57878369J075640J079262J074493J047253J016334J019254J026348J002982R76637
2127.3A67196572R65193R39250R00790Q84130Q69006Q50693Q50618Q51884Q35985Q07419
$$ plain form
1994.8 113904871 114279017 114657149 115043253 115441509 115859605 116291143 116725594 117171004 117635198 118105121
2015.2 118105121 118572354 119047098 119541392 120042682 120564908 121180385 121863037 122521065 123159729 123824351
2035.6 123824351 124506660 125185728 125890031 126642153 127410457 128181607 128985763 129824072 130679950 131553948
2056 131553948 132442802 133336022 134230956 135144278 136089310 137022898 137920767 138839081 139784023 140733898
2076.4 140733898 141721174 142748386 143783897 144837871 145943254 147077218 148188889 149280220
2092.7 149280220 150363371 151431322 152497903 153570235 154643983 155724734 156804740 157878369
2109 157878369 158954009 160033271 161107764 162155017 163171351 164190605 165216953 166219935 167196572
2127.3 167196572 168161765 169101015 170001805 170885935 171754941 172605634 173456252 174308136 175144121 175951540
2147.7A75951540P93607P85529P69064P72178P78303P51659P21961P12827O89775O62207
2168.1A83388650O73294O91116O74233O59034O60777O52030O35624O19590O05062O05211
2188.5A89864621O21333O27846O05762N86733O07967O15046N85615N61774N37038N12257
2208.9A95725992N04837N09679N01692M81591M51222M06295L82826L71620L38077L02539
2229.3A99976370K65226K26885K27749K46465K47926K47627K54139K46749K35438K43485
2249.7B02418059K47806K26334K05323K25649K44110K18228J94773J83612J71125J77562
2270.1B04512581J73286J49101J56030J69009J36748J03041J20953J37255J26049J29506
2290.5B05913559J36494J45287J79305J92508J59741J61677K18243K57134K66269K78011
$$ plain form
2147.7 175951540 176745147 177530676 178299740 179071918 179850221 180601880 181323841 182036668 182726443 183388650
2168.1 183388650 184061944 184753060 185427293 186086327 186747104 187399134 188034758 188654348 189259410 189864621
2188.5 189864621 190485954 191113800 191719562 192306295 192914262 193529308 194114923 194676697 195213735 195725992
2208.9 195725992 196230829 196740508 197242200 197723791 198175013 198581308 198964134 199335754 199673831 199976370
2229.3 199976370 200241596 200468481 200696230 200942695 201190621 201438248 201692387 201939136 202174574 202418059
2249.7 202418059 202665865 202892199 203097522 203323171 203567281 203785509 203980282 204163894 204335019 204512581
2270.1 204512581 204685867 204834968 204990998 205160007 205296755 205399796 205520749 205658004 205784053 205913559
2290.5 205913559 206050053 206195340 206374645 206567153 206726894 206888571 207106814 207363948 207630217 207908228
2310.9B07908228K83629K86624K68891J86041J30489J55673J58429J57625J70409Q7425
2331.3B09793463m410K563r373o7950j01789k25321m37200k58237K21655M72471L64631
2353.7B09750503J86593P8514r8318l04490m04418m07860m29540m74677m65438m41581
2374.1B06989288m46066m13224l39970k81259k57165k44841k33665k44334k68340k81140
2394.5B03979284k81245k75984k72140k84314k97219k94849l07441l24056l06710k78041
2414.9B01057285k77206k88591k90334l07203l36900l40253l24681l34070l58864l73021
2435.3A97826162l90515m20183m53427m73544m92528n23567n40659n52744n79700n74097
2455.7A92825198n36263n35294n61089n88282o24210o38768o22586o08921o15760o48067
$$ plain form
2310.9 207908228 208191857 208478481 208747372 208933413 209063902 209219575 209378004 209535629 209706038 209793463
2331.3 209793463 209789053 209791616 209782243 209714293 209612504 209387183 208949983 208691746 208913401 209385872 209750503
2353.7 209750503 209937096 210015610 209917292 209612802 209208384 208800524 208370984 207896307 207430869 206989288
2374.1 206989288 206543222 206129998 205790028 205508769 205251604 205006763 204773098 204528764 204260424 203979284
2394.5 203979284 203698039 203422055 203149915 202865601 202568382 202273533 201966092 201642036 201335326 201057285
2414.9 201057285 200780079 200491488 200201154 199893951 199557051 199216798 198892117 198558047 198199183 197826162
2435.3 197826162 197435647 197015464 196562037 196088493 195595965 195072398 194531739 193978995 193399295 192825198
2455.7 192825198 192288935 191753641 191192552 190604270 189980060 189341292 188718706 188109785 187494025 186845958
2476.1A86845958o80208o92084p10383p34911p64355q24273r05677r83268j055703
2494.5A79495096j127481j203716j289308j376554j456902j513079j524329j495913
2510.8A68507814j416966j238182r47639n72801j47358K88651O84425J006573J262114
2529.1A67426631J440406J522362J508996J390159J204088J040921R08017P67261O34745
2547.5A77843586N17979M17411L38480K67282K15680J82956J44765J14277R0271O3047
2567.9A80195734M7550N3167O1542M7579J6362j3203l6597p7889j29625j75133k39059
2590.3A79750428l10630l62307m09692m54441m81859n26920n85273o16699o46889o75336
2610.7A74680382o69911o57723o63087o63668o49884o43641o55055o57782o55800o76363
$$ plain form
2476.1 186845958 186165750 185473666 184763283 184028372 183264017 182439744 181534067 180550799 179495096
2494.5 179495096 178367615 177163899 175874591 174498037 173041135 171528056 170003727 168507814
2510.8 168507814 167090848 165852666 164905027 164332226 164184868 164473519 165157944 166164517 167426631
2529.1 167426631 168867037 170389399 171898395 173288554 174492642 175533563 176441580 177208841 177843586
2547.5 177843586 178361565 178778976 179117456 179384738 179600418 179783374 179928139 180042416 180132687 180195734
2567.9 180195734 180243284 180296451 180357993 180405572 180421934 180408731 180372134 180294245 180164620 179989487 179750428
2590.3 179750428 179439798 179077491 178667799 178213358 177731499 177204579 176619306 176002607 175355718 174680382
2610.7 174680382 174010471 173352748 172689661 172025993 171376109 170732468 170077413 169419631 168763831 168087468
2631.1A68087468o97703o95496o99401p36311p74473p79614p72953p96259q47101q78841
2651.5A60409316q74713q52733q26955q17567q05095p47338o58259n66378m61445l25098
2671.9A53473735j64867M0010L07322O10858R39145J283735J637638J977936K257883
2690.3A62363395K430037K453401K354876K187922J950562J662269J379386J135230
2706.6A77917078R51544Q22380P53641P40826P16105O87137O76006O34745N80594N51090
2727A85031146N20378M58345L89710L57822L52203L35992L03075K70485K52083K61441
2747.4A88532680K74375K50012K13996J97902J77860J53721J41680R6127k518q0869
2767.8A89954966j19462j83448k62887l18318l84376m60341n00009n21675n73173o29648
$$ plain form
2631.1 168087468 167389765 166694269 165994868 165258557 164484084 163704470 162931517 162135258 161288157 160409316
2651.5 160409316 159534603 158681870 157854915 157037348 156232253 155484915 154826656 154260278 153798833 153473735
2671.9 153473735 153308868 153348878 153656200 154267058 155206203 156489938 158127576 160105512 162363395
2690.3 162363395 164793432 167246833 169601709 171789631 173740193 175402462 176781848 177917078
2706.6 177917078 178868622 179691002 180444643 181185469 181901574 182588711 183264717 183899462 184480056 185031146
2727 185031146 185551524 186009869 186399579 186757401 187109604 187445596 187748671 188019156 188271239 188532680
2747.4 188532680 188807055 189057067 189271063 189468965 189646825 189800546 189942226 190038353 190035835 189954966
2767.8 189954966 189835504 189652056 189389169 189070851 188686475 188226134 187726125 187204450 186631277 186001629
2788.2A86001629o55041o82398p16552p26968p28652p58678q06585q19758q25524q57442
2808.6A78424031q74758q78215q89599r13382r33930r32917r37015r50888r56952r54807
2828.9A69201568r46015r48489r54092r34615r12920r24915r57713r47982q76099q31157
2849.3A59967571q46371q33079p57217o67274n95838n47618n13911m77269m31314l84540
2869.7A53913140l43054l03343k69503k61664k60532k22549j79723j67429j30519o0484
2890.1A51714340k9981k0922K6361R4160J54138K06068K36153K36899K67804L34412
2910.5A53219432L38539L00273L38465M14238M12702L71144L72439M14565M41760M24952
2930.9A57048509M03448L78803L37884L20196L11375K62171K14994K18540K19017J79082
$$ plain form
2788.2 186001629 185346588 184664190 183947638 183220670 182492018 181733340 180926755 180106997 179281473 178424031
2808.6 178424031 177549273 176671058 175781459 174868077 173934147 173001230 172064215 171113327 170156375 169201568
2828.9 169201568 168255553 167307064 166352972 165418357 164505437 163580522 162622809 161674827 160798728 159967571
2849.3 159967571 159121200 158288121 157530904 156863630 156267792 155720174 155206263 154728994 154297680 153913140
2869.7 153913140 153570086 153266743 152997240 152735576 152475044 152252495 152072772 151905343 151774824 151714340
2890.1 151714340 151684359 151663437 151689798 151783958 151938096 152144164 152380317 152617216 152885020 153219432
2910.5 153219432 153557971 153858244 154196709 154610947 155023649 155394793 155767232 156181797 156623557 157048509
2930.9 157048509 157451957 157830760 158168644 158488840 158800215 159062386 159277380 159495920 159714937 159894019
2951.3A59894019J45927J32576J09658J05187J08212Q4579P1362P0080O7964P6965
2971.7A60866529J01790J10149O1586J6898K6629J3500p5206j47477j49727j92314
2992.1A60632357l00825l62694l54588l27632l00467k69770k17989j48640j20729j20491
3012.5A58108532q5875n3182k1950M2037J10566J51977J63674K01166K49401K60144
3032.9A59126490K78518K93434L05310L46601L58581L48702L70383L86894L82364L89233
3053.3A62586510L78043L44991L62471M01184L59967K85954K97233L28004K88591K49565
3073.7A65882513K53916K67073K40907J74642J49697J62482J40146J05813P6249N9798
3094.1A67513236Q4401O1497k6495m8875j5840j9715n4285q2567q1137p6785r9063
$$ plain form
2951.3 159894019 160039946 160172522 160282180 160387367 160495579 160580158 160651520 160721600 160789564 160866529
2971.7 160866529 160968319 161078468 161140054 161156952 161183581 161197081 161121875 160974398 160824671 160632357
2992.1 160632357 160331532 159968838 159614250 159286618 158986151 158716381 158498392 158349752 158229023 158108532
3012.5 158108532 158022657 157969475 157947525 157989562 158100128 158252105 158415779 158616945 158866346 159126490
3032.9 159126490 159405008 159698442 160003752 160350353 160708934 161057636 161428019 161814913 162197277 162586510
3053.3 162586510 162964553 163309544 163672015 164073199 164433166 164719120 165016353 165344357 165632948 165882513
3073.7 165882513 166136429 166403502 166644409 166819051 166968748 167131230 167271376 167377189 167453438 167513236
3094.1 167513236 167597637 167659134 167632639 167583764 167567924 167548209 167493924 167411357 167330220 167253435 167154372
3116.5A67154372q8036j9178L5494L4750N558J19J1280j3649l7342j7345k787k8625
3141A67034611q0138j16855j18479j27137j44377j33694j29327j50248j74806k03490
3161.4A65656060k29269k47583k57790k50668k51382k89992l28481l33890l36737l56420
3181.8A62773848l85553m26814m69595m86344m97282n51730o23003o65530p00117p24673
3202.2A57243207p21052p23690p53835p84069q13976q41841q29131q30754q82447r09388
3222.6A49153024q89421q48755q18983q13812p97733p65145p35462p02291o67632o42359
3243A41471431n98878n12108m35159m06474l87311l52442l04788k55138k29344k10717
3263.4A37779072j75372j64196j68904j36137j00375j10075j14247r8571j40458k09511
$$ plain form
3116.5 167154372 167066336 167047158 167082652 167117402 167122960 167123079 167134359 167120710 167083368 167066023 167063236 167034611
3141 167034611 166954473 166837618 166719139 166592002 166447625 166313931 166184604 166034356 165859550 165656060
3161.4 165656060 165426791 165179208 164921418 164670750 164419368 164129376 163800895 163467005 163130268 162773848
3181.8 162773848 162388295 161961481 161491886 161005542 160508260 159956530 159333527 158667997 157967880 157243207
3202.2 157243207 156522155 155798465 155044630 154260561 153446585 152604744 151775613 150944859 150062412 149153024
3222.6 149153024 148263603 147414848 146595865 145782053 144984320 144219175 143483713 142781422 142113790 141471431
3243 141471431 140872553 140360445 139925286 139518812 139131501 138779059 138474271 138219133 137989789 137779072
3263.4 137779072 137603700 137439504 137270600 137134463 137034088 136924013 136809766 136711195 136570737 136361226
3283.8A36361226k16171j89677j98558k41607k82049k83152k63765k85641l18885l43278
3304.2A33738443l84107l85538l44664l79175m88668n30377n17309n52013o16044o88926
3324.6A28851622p41094p28622p30753q11219q80510r03353r63204j044303j078963
3342.9A20969601j076087j095862j200862j316562j354985j401581j521930j659393
3359.2A10342339j772054j866773j979000k131917k257511k301343k331748k403528
3375.5I3298465k457544k447635k377801k250649k094701j931533j778208j640774
3391.9G6319620j500167j363888j256913j166426j103081j092963j091458j086510
3408.2F6658214j081206j061812r98467q96216q46818p97428o12028l27639m1448J64699
$$ plain form
3283.8 136361226 136145055 135955378 135756820 135515213 135233164 134950012 134686247 134400606 134081721 133738443
3304.2 133738443 133354336 132968798 132624134 132244959 131756291 131225914 130708605 130156592 129540548 128851622
3324.6 128851622 128110528 127381906 126651153 125839934 124959424 124056071 123092867 122048564 120969601
3342.9 120969601 119893514 118797652 117596790 116280228 114925243 113523662 112001732 110342339
3359.2 110342339 108570285 106703512 104724512 102592595 100335084 98033741 95701993 93298465
3375.5 93298465 90840921 88393286 86015485 83764836 81670135 79738602 77960394 76319620
3391.9 76319620 74819453 73455565 72198652 71032226 69929145 68836182 67744724 66658214
3408.2 66658214 65577008 64515196 63516729 62620513 61773695 60976267 60364239 60036600 59995152 60159851
3428.6F0159851K69160M03028O05680P82221R26204J066022J109905J119882J209028
3446.9F7650981J219593J183920J220397J237676J207523J179643J139954J128681
3463.2G7168368J158938J184582J243137J282618J251317J200743J203150J224331
3479.6H6917184J225248J275309J336462J332686J305714J264826J228399J272783
3495.9I7158611J338497J351013J339317J363016J376093J354799J333981J302928
3512.2A07918255J292884J284361J271889J281366J326322J378544J343272J255982
3528.5A18352875J250759J269661J236550J191035J203038J273580J270831J227602
3544.8A28275931J235202J270383J291886J330048J367376J320734J256988J291424
$$ plain form
3428.6 60159851 60429011 60832039 61437719 62219940 63146144 64212166 65322071 66441953 67650981
3446.9 67650981 68870574 70054494 71274891 72512567 73720090 74899733 76039687 77168368
3463.2 77168368 78327306 79511888 80755025 82037643 83288960 84489703 85692853 86917184
3479.6 86917184 88142432 89417741 90754203 92086889 93392603 94657429 95885828 97158611
3495.9 97158611 98497108 99848121 101187438 102550454 103926547 105281346 106615327 107918255
3512.2 107918255 109211139 110495500 111767389 113048755 114375077 115753621 117096893 118352875
3528.5 118352875 119603634 120873295 122109845 123300880 124503918 125777498 127048329 128275931
3544.8 128275931 129511133 130781516 132073402 133403450 134770826 136091560 137348548 138639972
3561.1A38639972J399859J413107J306773J297503J425550J491516J508505J544416
3577.5A50027201J549795J555338J615912J663134J617670J614809J678317J709462
3593.8A63031638J715868J745269J796082J838714J858428J861453J889080J911997
3610.1A77648529J913920J957104K045482K043158J986563K056912K195269K231300
3626.4A94078237K084061J980633K074584K133370K141058K184048K213136K239987
3642.7B11129114K282873K212331J900151J768634K013325K013505J791447J766026
3659B26877406J832754J828134J871422J884937J678929J545608J582578J245528J092747
3677.4B41440043J405746J506298J580537J707643J536310J129821J100003J263887
$$ plain form
3561.1 138639972 140039831 141452938 142759711 144057214 145482764 146974280 148482785 150027201
3577.5 150027201 151576996 153132334 154748246 156411380 158029050 159643859 161322176 163031638
3593.8 163031638 164747506 166492775 168288857 170127571 171985999 173847452 175736532 177648529
3610.1 177648529 179562449 181519553 183565035 185608193 187594756 189651668 191846937 194078237
3626.4 194078237 196162298 198142931 200217515 202350885 204491943 206675991 208889127 211129114
3642.7 211129114 213411987 215624318 217524469 219293103 221306428 223319933 225111380 226877406
3659 226877406 228710160 230538294 232409716 234294653 235973582 237519190 239101768 240347296 241440043
3677.4 241440043 242845789 244352087 245932624 247640267 249176577 250306398 251406401 252670288
3693.7B52670288J320094J388371J337588J110047J089513J304090J361698J084477
3710B62666166P13616Q88855J220196J273990J221508J136630J008660R06915J064598
3728.4B72101134J258731J129895P40350M43220P28845J348377J318872O03825P40975
3746.7B80414224J031756L52621K71171J017601J135915P38055O55532Q90970R03428
3765.1B87411273P85648O30439N41180P62224R68427R11236O76095N69254O11544O20961
3785.5B94488281O50108O81758P93904Q86142P44552P51733P08729L05176N17637P62254
3805.9C01290274N02288O43194J000076R13978M81129M75317M19229K50429O79851
3824.3C06655765Q01205O78808O58214N67674O81371O50316L12895L48926M38213L74138
$$ plain form
3693.7 252670288 253990382 255378753 256716341 257826388 258915901 260219991 261581689 262666166
3710 262666166 263379782 264268637 265488833 266762823 267984331 269120961 270129621 271036536 272101134
3728.4 272101134 273359865 274489760 275230110 275673330 276402175 277750552 279069424 279673249 280414224
3746.7 280414224 281445980 281798601 282069772 283087373 284223288 284961343 285616875 286507845 287411273
3765.1 287411273 288196921 288827360 289368540 290130764 291099191 292010427 292686522 293255776 293867320 294488281
3785.5 294488281 295138389 295820147 296614051 297500193 298244745 298996478 299705207 300010383 300528020 301290274
3805.9 301290274 301792562 302435756 303435832 304349810 304830939 305306256 305725485 305975914 306655765
3824.3 306655765 307456970 308135778 308793992 309361666 310043037 310693353 311006248 311355174 311793387 312167525
3844.6C12167525O61075J202614J281857Q8185p88897L23623R80914Q12203M14967
3863C17144066K64585M89473L72589J76281L77059N59240P14034N33343L01808L99202
3883.4C21331680K17140K83688N16087K32249K74420P18266O64979K53767K6345k6941
3903.8C24491680K30640O03437N86629M56661M70877L42756J59443K56598L79681K87325
3924.2C28265727K38508L53068L19600J44541J86861L63439M40955L87848K30669K07574
3944.6C31138790K90393K66791K80142L37481L42399L15130K93165L15428L53575L74168
3965C34307462L82036L75241L44723L46065M03643M38898M14938M04358M08322M06444
3985.4C38232130M39584M63277M48138M43071M58509M50670
$$ plain form
3844.6 312167525 312828600 314031214 315313071 315401256 314612359 314935982 315916896 316729099 317144066
3863 317144066 317408651 317898124 318270713 318446994 318824053 319383293 320097327 320630670 320932478 321331680
3883.4 321331680 321548820 321832508 322348595 322580844 322855264 323573530 324238509 324492276 324518621 324491680
3903.8 324491680 324722320 325325757 325912386 326369047 326839924 327182680 327342123 327598721 327978402 328265727
3924.2 328265727 328504235 328857303 329176903 329321444 329508305 329871744 330312699 330700547 330931216 331138790
3944.6 331138790 331429183 331695974 331976116 332313597 332655996 332971126 333264291 333579719 333933294 334307462
3965 334307462 334689498 335064739 335409462 335755527 336159170 336598068 337013006 337417364 337825686 338232130
3985.4 338232130 338671714 339134991 339583129 340026200 340484709 340935379
3997.6C40935379
$$ plain form
3997.6 340935379
##END=$$ End of the data block
