##TITLE=Acido Hipurico (Ni) $$ Begin of the data block
##JCAMP-DX=5.00 $$ ACD/SpecManager v 10.08
##SPECTROMETER/DATA SYSTEM=Alpha
##DATE=12 Nov 2014 09:25:08
##DATA TYPE=INFRARED SPECTRUM
##DATA CLASS=XYDATA
##ORIGIN=
##OWNER=
##NPOINTS=1765
##FIRSTX=399.76428223
##LASTX=3997.64306641
##MAXX=3997.64306641
##MINX=399.76428223
##MAXY=0.83004367
##MINY=0.09665894
##XFACTOR=1.0000000000
##YFACTOR=1.000000000000000e-9
##FIRSTY=0.80244756
##DELTAX=2.03961372
##XUNITS=1/CM
##YUNITS=ARBITRARY UNITS
##XYDATA=(X++(Y..Y))
$$ plain form
399.8 802447557 802975118 796552956 788776398 790271938 797220528 797720850 792674482 791204393 793835461
418.1 793835461 791595221 784058034 778665423 775253952 766331851 748938262 730823696 722750366
434.4 722750366 729302168 745587409 764346302 781696737 792179763 793277919 791199148 792609870
450.8 792609870 795294344 793787599 789469302 788103938 789289534 787030518 780916154 776707351
467.1 776707351 776392639 774829865 768858492 764337122 766345382 770927548 772651911 772951543 775187433
485.4 775187433 777039051 774993360 771280229 770389438 771290839 769411504 764980078 762439609 762424886
503.8 762424886 760545254 755499780 751266599 749685705 747421086 741916776 735565543 731232524
520.1 731232524 726693451 718270719 706452310 694025993 678886592 655380964 623450518 593948245
$$ packed form
399.8H02447557N27561o422162p776558J495540O948590N00322n046368j470089K631068
418.1G93835461k240240p537187n392611l411471q922101j7393589j8114566q073330
434.4G22750366O551802J6285241J8758893J7350435J0483026J098156k078771J410722
450.8G92609870K684474j506745m318297j365364J185596k259016o114364m208803
467.1G76707351l14712j562774n971373m521370K008260M582166J724363K99632K235890
485.4G75187433J851618k045691l713131q90791R01401j879335m431426k540469j4723
503.8G62424886j879632n045474m233181j580894k264619n504310o351233m333019
520.1G31232524m539073q422732j1818409j2426317j5139401k3505628l1930446k9502273
$$ plain form
536.4 593948245 581257284 582660019 577081680 556444883 541535258 555652618 595809400 642989695
552.7 642989695 684967697 716548622 734953225 743032455 747343004 750422060 750186980 746727467
569.1 746727467 743994117 743471563 742024302 737992823 734311938 733005524 731437624 727151752 722094059
587.4 722094059 718985081 716220319 710857630 703908682 698139429 692985654 685594261 675751269
603.7 675751269 665792346 656344414 645474494 632167339 621466875 623215377 632682621 631882071
620 631882071 620206416 609216392 602069974 597593248 597157896 603225589 615676165 631203949
636.4 631203949 646759033 661657333 674829543 682992160 683325469 675099373 656912923 624521792
652.7 624521792 575972974 522205353 488449544 494550407 532385826 575394571 615619659 652140796
$$ packed form
536.4E93948245j2690961J402735n578339k0636797j4909625J4117360M0156782M7180295
552.7F42989695M1978002L1580925J8404603Q079230M310549L079056k35080l459513
569.1G46727467k733350n22554j447261m031479l680885j306414j567900m285872n057693
587.4G22094059l108978k764762n362689o948948n769253n153775p391393r842992
603.7F75751269r958923r447932j0869920j3307155j0700464J748502R467244q00550
620F31882071j1675655j0990024p146418m476726m35352O067693J2450576J5527784
636.4F31203949J5555084J4898300J3172210Q162617L33309q226096j8186450l2391131
652.7F24521792m8548818n3767621l3755809O100863L7835419M3008745M0225088L6521137
$$ plain form
669 652140796 669691801 676379561 682098925 687032640 685160339 669028640 633741438 581525028
685.3 581525028 529012024 497722685 488912672 491898030 511609435 551754594 594083786 621179521
701.6 621179521 631569266 628851712 615142405 591700852 558134735 512480497 452916414 379200816
717.9 379200816 302301347 251454592 248100057 285110027 348271906 429547131 514365792 584372163
734.3 584372163 633624256 667243898 690534234 705927730 715729594 722546637 727340877 730002463
750.6 730002463 731755257 734448969 737964571 740466058 741163969 741334438 742015004 742456913 741608322
768.9 741608322 740110993 739268482 738796175 737400293 735059679 732939243 731122553 728365362 724139690
787.3 724139690 719406486 714425683 707533777 696951091 682570159 663922668 636641860 597574174
$$ packed form
669F52140796J7551005O687760N719364M933715j872301j6131699l5287202n2216410
685.3E81525028n2513004l1289339q810013K985358J9711405M0145159M2329192K7095735
701.6F21179521J0389745k717554j3709307k3441553l3566117m5654238n9564083p3715598
717.9C79200816p6899469n0846755l354535L7009970O3161879Q1275225Q4818661P0006371
734.3E84372163M9252093L3619642K3290336J5393496R801864O817043M794240K661586
750.6G30002463J752794K693712L515602K501487O97911J70469O80566M41909q48591
768.9G41608322j497329q42511m72307j395882k340614k120436j816690k757191m225672
787.3G24139690m733204m980803o891906j0582686j4380932j8647491k7280808l9067686
$$ plain form
803.6 597574174 564290226 574411750 631929517 690133154 716818571 720176041 714204252 703425705
819.9 703425705 688659608 671779931 656649470 646561503 640900552 635513484 626033366 610521197
836.2 610521197 590213060 568070233 547256708 530025244 517680049 511425853 512740433 522363663
852.6 522363663 538679063 556511819 569465160 576699674 583625019 593989909 606257915 617366850
868.9 617366850 624880850 627103031 624912739 623335242 628797174 644068658 667085707 693452179
885.2 693452179 718762219 739093542 752168179 758921742 762719810 765943229 768266678 769046545
901.5 769046545 769395173 770759106 772385240 772652209 771948874 772050142 772939742 772978723 771894038
919.9 771894038 771164954 771391332 771057725 769180179 766828835 764770627 760476232 749065995 725902677
$$ packed form
803.6E97574174l3283948J0121524N7517767N8203637K6685417L357470n971789j0778547
819.9G03425705j4766097j6879677j5130461j0087967n660951n387068r480118j5512169
836.2F10521197k0308137k2142827k0813525j7231464j2345195o254196J314580R623230
852.6E22363663J6315400J7832756J2953341P234514O925345J0364890J2268006J1108935
868.9F17366850P514000K222181k190292j577497N461932J5271484K3017049K6366472
885.2F93452179K5310040K0331323J3074637O753563L798068L223419K323449P79867
901.5G69046545L48628J363933J626134K66969p03335J01268Q89600L8981j084685
919.9G71894038p29084K26378l33607j877546k351344k058208m294395j1410237k3163318
$$ plain form
938.2 725902677 693625927 672055244 681282938 711785257 739582837 756231606 764257550 766972601
954.5 766972601 767716110 768708587 769342422 768306971 766306043 764927804 764007032 761763275 758135498
972.9 758135498 754568696 751348734 746128261 736380756 722545147 711341321 707460999 703208029
989.2 703208029 688549876 657576621 602251709 530769885 482771605 484807193 537454069 624487042
1005.5 624487042 698849559 733574808 744642913 747242272 745240688 740266502 733478487 723811924
1021.8 723811924 708149016 680522025 644257367 633185744 670690417 720960259 745738447
1036.1 745738447 750514090 749491632 746457696 742392063 738905013 736223340 733013630 728618085
1052.4 728618085 723850787 719033718 712573588 702470481 687696099 669739246 653945923 645683825
$$ packed form
938.2G25902677l2276750k1570683R227694L0502319K7797580J6648769Q025944K715051
954.5G66972601P43509R92477O33835j035451k000928j378239r20772k243757l627777
972.9G58135498l566802l219962n220473r747505j3835609j1203826l880322m252970
989.2G03208029j4658153l0973255n5324912p1481824m7998280K035588N2646876Q7032973
1005.5F24487042P4362517L4725249J1068105K599359k001584m974186o788015r666563
1021.8G23811924j5662908k7626991l6264658j1071623L7504673N0269842K4778188
1036.1G45738447M775643j022458l033936m065633l487050k681673l209710m395545
1052.4G28618085m767298m817069o460130j0103107j4774382j7956853j5793323q262098
$$ plain form
1068.8 645683825 641205132 629565418 603317916 565970302 538207531 545905828 586230814 628290772
1085.1 628290772 652536452 661997080 664934218 665066183 663088024 659824491 656576872 653577983
1101.4 653577983 649809659 645150959 641811848 642300189 645290494 647002816 646018386 643544614 640227199
1119.8 640227199 635577142 629703820 623587191 617638230 611105263 603523791 595370412 586960971
1136.1 586960971 577500224 566066802 552641988 537469983 519872367 498608351 473276764
1150.3 473276764 444592088 414471298 385809511 361654758 345573515 338753790 335434824 327915907
1166.7 327915907 313011199 290371418 259980828 223553210 187036350 159127221 146383926
1180.9 146383926 150654644 170596257 202764511 242312297 285653889 332217783 382069945
$$ packed form
1068.8F45683825m478693j1639714k6247502l7347614k7762771P698297M0324986M2059958
1085.1F28290772K4245680R460628K937138J31965j978159l263533l247619k998889
1101.4F53577983l768324m658700l339111M88341K990305J712322r84430k473772l317415
1119.8F40227199m650057n873322o116629n948961o532967p581472q153379q409441
1136.1E86960971r460747j1433422j3424814j5172005j7597616k1264016k5331587
1150.3D73276764k8684676l0120790k8661787k4154753j6081243o819725l318966p518917
1166.7C27915907j4904708k2639781l0390590l6427618l6516860k7909129j2743295
1180.9A46383926M270718J9941613L2168254L9547786M3341592M6563894M9852162
$$ plain form
1195.2 382069945 432238132 477917880 516294360 547238827 572219491 593397379 612152874
1209.5 612152874 628592193 642835796 655851424 668337703 679596901 688548923 695317566 700663388
1225.8 700663388 704417288 705933452 705672264 704890013 703873992 701783538 698258460 693902910 688704848
1244.2 688704848 681220174 669803917 653360307 630605459 602158785 577646315 575021923 601518154
1260.5 601518154 640949130 671996415 688115835 693513989 692784846 687897205 679953158 670623124
1276.8 670623124 661505103 652989089 644737065 636585832 628191233 618198931 604753137 586764812
1293.1 586764812 564278603 538284659 511725008 491134852 484581858 494882256 515756071
1307.4 515756071 534923971 538761079 517851830 479692191 458493590 487276435 549100220
$$ packed form
1195.2C82069945N0168187M5679748L8376480L0944467K4980664K1177888J8755495
1209.5F12152874J6439319J4243603J3015628J2486279J1259198Q952022O768643N345822
1225.8G00663388L753900J516164k61188p82251j016021k090454l525078m355550n198062
1244.2F88704848p484674j1416257j6443610k2754848k8446674k4512470k624392K6496231
1260.5F01518154L9430976L1047285J6119420N398154p29143m887641p944047r330034
1276.8F70623124r118021q516014q252024q151233q394599r992302j3445794j7988325
1293.1E86764812k2486209k5993944k6559651k0590156o552994J0300398K0873815
1307.4E15756071J9167900L837108k0909249l8159639k1198601K8782845O1823785
$$ plain form
1321.7 549100220 596519470 607677519 589150906 554183006 515670061 487567276 483147264
1336 483147264 509747386 561290145 616965294 660581172 688197374 700999796 703501821 702764452
1352.3 702764452 706523776 716559291 727147758 733215332 733706295 730068564 724839151 718718410
1368.6 718718410 711143076 701312363 688926578 675732493 661734879 645140171 626027644 604946613
1384.9 604946613 579500556 549637914 520481944 495289207 481084466 487114310 510139167
1399.2 510139167 534781158 548688173 547179997 526889563 486128151 427093446 367250234
1413.5 367250234 331325054 334889412 383691728 453950584 524189413 585306406 629075706
1427.7 629075706 660757303 683557272 698258698 708332896 713892579 712641299 701591909 683240592
$$ packed form
1321.7E49100220M7419250J1158049j8526613l4967900l8512945k8102785m420012
1336D83147264K6600122N1542759N5675149M3615878K7616202J2802422K502025p37369
1352.3G02764452L759324J0035515J0588467O067574M90963l637731n229413o120741
1368.6G18718410p575334r830713j2385785j3194085j3997614j6594708j9112527k1081031
1384.9F04946613k5446057k9862642k9155970k5192737j4204741O029844K3024857
1399.2E10139167K4641991J3907015j508176k0290434m0761412n9034705n9843212
1413.5C67250234l5925180L564358M8802316P0258856P0238829O1116993M3769300
1427.7F29075706L1681597K2799969J4701426J0074198N559683j251280j1049390j8351317
$$ plain form
1444.1 683240592 674843729 687607348 705395639 713009417 713240743 709331334 701390147 693086922
1460.4 693086922 684810936 673998237 661251426 649446607 637377501 622514784 607611418
1474.7 607611418 594422340 580092788 561965048 538626552 509861529 473130703 433101475
1488.9 433101475 420816839 458050102 529951274 604091406 641969681 649182916 646590412 639165699
1505.2 639165699 624489903 609857619 597730637 585034966 570674896 554617047 537866473
1519.5 537866473 517807841 496517539 476343900 454696774 433887422 412521720 387356609
1533.8 387356609 365576088 347641289 322762966 293972164 268438786 242143914 213147655
1548.1 213147655 179219708 144487724 115093142 96658938 99802114 131925672 168173090
$$ packed form
1444.1F83240592q396863J2763619J7788291P613778K31326l909409p941187q303225
1460.4F93086922q275986j0812699j2746811j1804819j2069106j4862717j4903366
1474.7F07611418j3189078j4329552j8127740k3338496k8765023l6730826m0029228
1488.9D33101475j2284636L7233263P1901172P4140132L7878275P213235k592504p424713
1505.2F39165699j4675796j4632284j2126982j2695671j4360070j6057849j6750574
1519.5E37866473k0058632k1290302k0173639k1647126k0809352k1365702k5165111
1533.8C87356609k1780521j7934799k4878323k8790802k5533378k6294872k8996259
1548.1B13147655l3927947l4731984k9394582j8434204L143176L2123558L6247418
$$ plain form
1562.4 168173090 202438846 224597782 220995396 204704255 208757386 252356321 339473248 422851741
1578.7 422851741 482007533 530084550 563080907 573741674 560576975 524901807 463565439
1593 463565439 376025528 285248667 229130924 219322875 230420053 235994861 235582143 240953341
1609.3 240953341 258056521 283803165 312131554 331735075 334049374 334312320 350933641 384116620
1625.6 384116620 421910524 456517458 482619017 504172444 527040958 545348465 557352662
1639.9 557352662 567714512 577795208 588920355 599689543 606965721 614904344 625579476 633027613
1656.2 633027613 640149772 649873018 662370086 674648523 684316218 693689466 703622103 711647213
1672.5 711647213 718706369 725169420 729871035 733577967 736464381 737459362 736346900 734385371
$$ packed form
1562.4A68173090L4265756K2158936l602386j6291141M053131M3598935Q7116927Q3378493
1578.7D22851741N9155792M8077017L2996357J0660767j3164699l5675168o1336368
1593D63565439q7539911r0776861n6117743r808049J1097178N574808m12718N371198
1609.3B40953341J7103180K5746644K8328389J9603521K314299K62946J6621321L3182979
1625.6C84116620L7793904L4606934K6101559K1553427K2868514J8307507J2004197
1639.9E57352662J0361850J0080696J1125147J0769188P276178P938623J0675132P448137
1656.2F33027613P122159R723246J2497068J2278437R667695R373248R932637Q025110
1672.5G11647213P059156O463051M701615L706932K886414R94981j112462j961529
$$ plain form
1688.8 734385371 731257915 727034867 720339656 711049616 700988948 690048277 682294428 676554739
1705.1 676554739 669493914 660876155 650832355 639279366 625328898 605954289 584370792 564196348
1721.5 564196348 540565550 511062205 476786494 438100010 397493839 351081699 308721185
1735.7 308721185 281706035 259832680 243012875 235799640 237128988 244911507 255754948 264174402
1752 264174402 266917437 264717907 261055321 262651056 278104842 310091048 356806695 415331990
1768.4 415331990 476243079 535879552 584794939 619461596 647976041 673029125 693277299
1782.6 693277299 709469855 722517788 732623816 740915358 747956991 753125370 757191479 761105955
1799 761105955 764812589 768171310 771092236 773705363 775791943 777413011 778698206 779848754 780902922
$$ packed form
1688.8G34385371l127456m223048o695211r290040j0060668j0940671p753849n739689
1705.1F76554739p060825q617759j0043800j1552989j3950468j9374609k1583497k0174444
1721.5E64196348k3630798k9503345l4275711l8686484m0606171m6412140m2360514
1735.7C08721185k7015150k1873355j6819805p213235J329348P782519J0843441Q419454
1752B64174402K743035k199530l662586J595735J5453786L1986206M6715647N8525295
1768.4D15331990O0911089N9636473M8915387L4666657K8514445K5053084K0248174
1782.6F93277299J6192556J3047933J0106028Q291542P041633N168379M066109L914476
1799G61105955L706634L358721K920926K613127K086580J621068J285195J150548J054168
$$ plain form
1817.3 780902922 781893730 783005714 784151614 785057783 785473466 785562515 785220802 784596562 783848941
1835.7 783848941 783436060 784129143 786508381 790651798 795188427 798911214 802044988 804838061 807280004
1854 807280004 809580564 811817169 813924432 815817595 817561567 819282293 820817113 821865022 822523475
1872.4 822523475 823231220 824006915 824781001 825506091 826189697 826793134 827229261 827421069 827356875 827360868
1892.8 827360868 827607036 828070402 828651190 829269409 829766691 830043674 830034852 829727232 829180896 828392327
1913.2 828392327 827242553 825187504 821754694 816927791 811467171 808059037 808984578 813106716
1929.5 813106716 817498207 820302308 821261585 820945024 820017815 818971097 818212211 818284154 819470108
1947.9 819470108 821481645 823545754 824989498 825670958 825811327 825693905 825434983 825114429 824791729
$$ packed form
1817.3G80902922R90808J111984J145900R06169M15683Q9049l41713o24240p47621
1835.7G83848941m12881O93083K379238M143417M536629L722787L133774K793073K441943
1854H07280004K300560K236605K107263J893163J743972J720726J534820J047909O58453
1872.4H22523475P07745P75695P74086P25090O83606O03437M36127J91808o4194L993
1892.8H27360868K46168M63366N80788O18219M97282K76983q822l07620n46336p88569
1913.2H28392327j149774k055049l432810m826903n460620l408134R25541M122138
1929.5H13106716M391491K804101R59277l16561r27209j046718p58886P1943J185954
1947.9H19470108K011537K064109J443744O81460J40369j17422k58922l20554l22700
$$ plain form
1966.2 824791729 824606001 824663103 824745059 824433923 823433995 821515918 818470359 814545155 810616851
1984.6 810616851 807920814 807470739 809522390 813066125 816171944 817673385 817585886 816484988 815158129
2002.9 815158129 814246237 813950479 814361572 815748930 817975461 820128202 821324170 821511805 821202099
2021.3 821202099 820754707 820175767 819440365 818695486 818089187 817543745 816942334 816356182 815878510 815426290
2041.7 815426290 814831853 814089119 813283920 812420309 811406016 810274899 809314132 808792114 808720946
2060 808720946 808953524 809392273 809969783 810604811 811181784 811673045 812203944 812822640 813370407 813739896
2080.4 813739896 814068556 814469934 814861894 815099120 815220892 815394938 815617502 815707862 815655529 815638959
2100.8 815638959 815689802 815679073 815528512 815382004 815395355 815480649 815441191 815275431 815130889 815022826
$$ packed form
1966.2H24791729j85728N7102Q1956l11136r99928j918077l045559l925204l928304
1984.6H10616851k696037m50075K051651L543735L105819J501441q7499j100898j326859
2002.9H15158129r11892k95758M11093J387358K226531K152741J195968J87635l09706
2021.3H21202099m47392n78940p35402p44879o06299n45442o01411n86152m77672m52220
2041.7H15426290n94437p42734q05199q63611j014293j131117r60767n22018p1168
2060H08720946K32578M38749N77510O35028N76973M91261N30899O18696N47767L69489
2080.4H13739896L28660M01378L91960K37226J21772J74046K22564R0360n2333j6570
2100.8H15638959N0843j0729j50561j46508J3351Q5294l9458j65760j44542j08063
$$ plain form
2121.2 815022826 814801395 814394116 813960969 813606560 813231766 812748075 812276125 811959743 811721802 811388612
2141.6 811388612 810990632 810707748 810514212 810217619 809746087 809224725 808723927 808136404 807357430 806524456
2162 806524456 805866838 805383563 804901361 804323673 803720653 803078353 802249670 801240683 800345004 799841046
2182.4 799841046 799739957 799945652 800454676 801253617 802115858 802768290 803151667 803433776 803739071 803989112
2202.8 803989112 804079950 804098189 804141998 804093361 803835332 803429782 803017020 802623749 802182019 801726401
2223.2 801726401 801423728 801338613 801338553 801259995 801084399 800891757 800669611 800375283 800046802 799767315 799544036
2245.6 799544036 799260199 798824370 798326194 797905445 797563553 797234476 796933472 796760023 796714485 796679497
2266 796679497 796598434 796553314 796606898 796637774 796494544 796210408 795916378 795606017 795158923 794566333 793953955
$$ packed form
2121.2H15022826k21431m07279m33147l54409l74794m83691m71950l16382k37941l33190
2141.6H11388612l97980k82884j93536k96593m71532n21362n00798n87523p78974q32974
2162H06524456o57618m83275m82202n77688o03020o42300q28683j008987q95679n03958
2182.4G99841046j01089K05695N09024P98941Q62241O52432L83377K82109L05295K50041
2202.8H03989112R0838J8239M3809m8637k58029m05550m12762l93271m41730m55618
2223.2H01726401l02673q5115o0p8558j75596j92642k22146k94328l28481k79487k23279
2245.6G99544036k83837m35829m98176m20749l41892l29077l01004j73449m5538l4988
2266G96679497q1063m5120N3584L0876j43230k84136k94030l10361m47094n92590o12378
$$ plain form
2288.5 793953955 793376267 792762458 792109966 791529775 791053474 790551364 789902747 789157987 788420796 787619233
2308.9 787619233 786562920 785211205 783714771 782226861 780853987 779695630 778721511 777745128 776534200
2327.2 776534200 774966776 773268044 771887362 771014333 770475745 770016372 769503117 768923342 768356979
2345.6 768356979 767934501 767651677 767493606 767527759 767737627 768082559 768621206 769326210 769950211 770300686
2366 770300686 770482957 770723343 771048725 771308064 771453023 771543801 771554053 771372020 771021545 770673871
2386.4 770673871 770414948 770155728 769857645 769639909 769584179 769628048 769693494 769810498 769980907 770048380
2406.8 770048380 769829631 769368351 768912733 768582225 768235564 767725348 767109096 766489863 765814424 764959037
2427.2 764959037 763928354 762792110 761509418 759948492 758085191 756067753 754027188 751910686
$$ packed form
2288.5G93953955n77688o13809o52492n80191m76301n02110o48617p44760p37191q01563
2308.9G87619233j056313j351715j496434j487910j372874j158357r74119r76383j210928
2327.2G76534200j567424j698732j380682q73029n38588m59373n13255n79775n66363
2345.6G68356979m22478k82824j58071L4153K09868L44932N38647P05004O24001L50475
2366G70300686J82271K40386L25382K59339J44959R0778J0252j82033l50475l47674
2386.4G70673871k58923k59220k98083k17736n5730M3869O5446J17004J70409O7473
2406.8G70048380k18749m61280m55618l30508l46661n10216o16252o19233o75439q55387
2427.2G64959037j030683j136244j282692j560926j863301k017438k040565k116502
$$ plain form
2443.5 751910686 749554932 746884465 743872762 740453899 736636579 732653797 728949368 725958228
2459.8 725958228 723851085 722460151 721383095 720170677 718531966 716482162 714415014 712907553
2476.1 712907553 712368190 712935507 714676440 717503428 720915437 724185824 726766407 728544354 729805350
2494.5 729805350 731011987 732515931 734366119 736344099 738100708 739364386 740206897 740999877 742017806
2512.8 742017806 743256688 744539440 745697260 746654570 747409463 747974336 748343170 748545647 748600602
2531.2 748600602 748422027 747924209 747168362 746235251 745079935 743628561 741922975 740100682 738276780
2549.5 738276780 736535907 734967887 733602464 732335925 730988860 729429603 727677763 725903034
2565.8 725903034 724345267 723255515 722861469 723228991 724100888 725055933 725803256 726276934 726489007
$$ packed form
2443.5G51910686k355754k670467l011703l418863l817320l982782l704429k991140
2459.8G25958228k107143j390934j077056j212418j638711k049804k067148j507461
2476.1G12907553n39363N67317J740933K826988L412009L270387K580583J777947J260996
2494.5G29805350J206637J503944J850188J977980J756609J263678Q42511P92980J017929
2512.8G42017806J238882J282752J157820R57310P54893N64873L68834K02477N4955
2531.2G48600602j78575m97818p55847r33111j155316j451374j705586j822293j823902
2549.5G38276780j740873j568020j365423j266539j347065j559257j751840j774729
2565.8G25903034j557767j089752l94046L67522Q71897R55045P47323M73678K12073
$$ plain form
2584.2 726489007 726341665 725693107 724534035 722977698 721159101 719274342 717623830 716437936 715755820
2602.6 715755820 715605795 716160417 717549920 719585001 721750379 723500073 724601388 725179911 725472808
2620.9 725472808 725702882 726121426 726910174 727955580 728889704 729474306 729759097 729904473 729995191 730008185
2641.3 730008185 729933262 729831100 729709685 729494214 729185522 728866696 728557825 728131831 727423429 726409435
2661.7 726409435 725164235 723689198 721926749 719939530 717961669 716205120 714651406 713113368
2678 713113368 711391628 709345043 706944942 704357266 702004910 700424790 699969649 700644851 702198625
2696.4 702198625 704222381 706238151 707889438 709025562 709609151 709641516 709154844 708286405 707311034
2714.7 707311034 706487417 705925047 705602229 705457807 705458820 705496550 705386043 705090582 704708099 704302371
$$ packed form
2584.2G26489007j47342o48558j159072j556337j818597j884759j650512j185894o82116
2602.6G15755820j50025N54622J389503K035081K165378J749694J101315N78523K92897
2620.9G25472808K30074M18544P88748J045406R34124N84602K84791J45376R0718J2994
2641.3G30008185p4923j02162j21415k15471l08692l18826l08871m25994p08402j013994
2661.7G26409435j245200j475037j762449j987219j977861j756549j553714j538038
2678G13113368j721740k046585k400101k587676k352356j580120m55141O75202J553774
2696.4G02198625K023756K015770J651287J136124N83589L2365m86672q68439r75371
2714.7G07311034q23617n62370l22818j44422J013L7730j10507k95461l82483m05728
$$ plain form
2735.1 704302371 703813553 703130603 702275038 701331556 700309217 699189007 698016226 696925342 696023762
2753.5 696023762 695233107 694408000 693548143 692688704 691763282 690726638 689606369 688396811 687082112
2771.8 687082112 685718000 684412658 683236718 682166159 681126595 680076003 679024220 677946687
2788.2 677946687 676745892 675364673 673844397 672219992 670508802 668683410 666658401 664448798
2804.5 664448798 662175775 659956396 657933950 656305850 655152738 654321790 653580546 652798533 651930988
2822.8 651930988 650903583 649611890 648034513 646259487 644398868 642521322 640630841 638696194
2839.1 638696194 636619568 634248078 631524026 628483057 625154436 621577859 617845297 614124000
2855.5 614124000 610679507 607694089 605115414 602799356 600569665 598251104 595845163 593406141
$$ packed form
2735.1G04302371m88818o82950q55565r43482j022339j120210j172781j090884r01580
2753.5F96023762p90655q25107q59857q59439r25422j036644j120269j209558j314699
2771.8F87082112j364112j305342j175940j070559j039564j050592j051783j077533
2788.2F77946687j200795j381219j520276j624405j711190j825392k025009k209603
2804.5F64448798k273023k219379k022446j628100j153112q30948p41244p82013q67545
2822.8F51930988j027405j291693j577377j775026j860619j877546j890481j934647
2839.1F38696194k076626k371490k724052l040969l328621l576577l732562l721297
2855.5F14124000l444493k985418k578675k316058k229691k318561k405941k439022
$$ plain form
2871.8 593406141 590830266 588088393 585302532 582486331 579583049 576633453 573796034 571226597
2888.1 571226597 568892598 566599607 564157248 561376572 558169246 554722428 551301479 548027039
2904.4 548027039 544931591 542013168 539151132 536101818 532646477 528755546 524528205 520013332
2920.7 520013332 515192151 510014892 504497945 498572558 491854846 483930767 475116938 467780083
2937 467780083 466282129 473066241 485073030 496403515 503569901 506663442 507143080 506093264
2953.4 506093264 504069507 501450837 498461246 495170563 491629899 487954468 484277815 480668068
2969.7 480668068 477110535 473480910 469641417 465617359 461643785 458026767 454865098 451982170
2986 451982170 449170351 446400255 443659812 440838635 437947422 435006231 431953788 428871125 425832570
$$ packed form
2871.8E93406141k575875k741873k785861k816201k903282k949596k837419k569437
2888.1E71226597k333999k292991k442359k780676l207326l446818l420949l274440
2904.4E48027039l095448k918423k862036l049314l455341l890931m227341m514873
2920.7E20013332m821181n177259n516947n925387o717712p924079q813829p336855
2937D67780083j497954O784112J2006789J1330485P166386L093541M79638j049816
2953.4E06093264k023757k618670k989591l290683l540664l675431l676653l609747
2969.7D80668068l557533l629625l839493m024058l973574l617018l161669k882928
2986D51982170k811819k770096k740443k821177k891213k941191l052443l082663l038555
$$ plain form
3004.4 425832570 422804326 419811875 416876614 413876027 410672367 407298416 403858393 400390923
3020.7 400390923 396908224 393403053 389876813 386440098 383211285 380226701 377483100 375087798
3037 375087798 373244584 371834397 370487124 369056344 367595732 366134733 364627838 363027811 361353725
3055.3 361353725 359676719 358152032 356867343 355532646 353578657 350687683 347356349 344955087
3071.7 344955087 344600409 345893979 347477138 348441511 348739624 348764330 348867357 349129349 349458158
3090 349458158 349806696 350249350 350916564 351942599 353540480 355884910 358885586 362315804 366011232
3108.4 366011232 369797975 373462617 376895368 380118161 383184254 386141837 389012247 391758293
3124.7 391758293 394356310 396834970 399236649 401550055 403704435 405730069 407806844 410078019
$$ packed form
3004.4D25832570l028244k992451k935261l000587l203660l373951l440023l467470
3020.7D00390923l482699l505171l526240l436715l228813k984584k743601k395302
3037C75087798j843214j410187j347273j430780j460612j460999j506895j600027j674086
3055.3C61353725j677006j524687j284689j334697j953989k890974l331334k401262
3071.7C44955087l54678J293570J583159R64373K98113K4706J03027K61992L28809
3090C49458158L48538M42654O67214J026035J597881K344430L000676L430218L695428
3108.4C66011232L786743L664642L432751L222793L066093K957583K870410K746046
3124.7C91758293K598017K478660K401679K313406K154380K025634K076775K271175
$$ plain form
3141 410078019 412511647 414995521 417391151 419496000 421187729 422518939 423625618 424653977 425717741
3159.4 425717741 426888287 428211331 429686815 431288809 433039308 434991777 437186718 439677477
3175.7 439677477 442491204 445529908 448617280 451640964 454532713 457283378 459966987 462628365
3192 462628365 465284228 467938602 470505744 472845197 474920988 476823300 478630722 480374396 482075840
3210.3 482075840 483751386 485454023 487230986 489078790 490977615 492853791 494632244 496346742
3226.7 496346742 498066992 499782085 501465380 503137589 504773021 506281495 507636130 508898735
3243 508898735 510097384 511174560 512060285 512762010 513326585 513760209 514026880 514150739 514241159 514326751
3263.4 514326751 514365494 514388442 514405966 514305830 514007986 513531029 512896419 512132764 511231005 510122418
$$ packed form
3141D10078019K433628K483874K395630K104849J691729J331210J106679J028359J063764
3159.4D25717741J170546J323044J475484J601994J750499J952469K194941K490759
3175.7D39677477K813727L038704L087372L023684K891749K750665K683609K661378
3192D62628365K655863K654374K567142K339453K075791J902312J807422J743674J701444
3210.3D82075840J675546J702637J776963J847804J898825J876176J778453J714498
3226.7D96346742J720250J715093J683295J672209J635432J508474J354635J262605
3243E08898735J198649J077176Q85725P01725N64575M33624K66671J23859R0420Q5592
3263.4E14326751L8743K2948J7524j00136k97844m76957o34610p63655r01759j108587
$$ plain form
3283.8 510122418 508806586 507345438 505739868 503864110 501587391 498887271 495798796 492421508
3300.1 492421508 488793701 484748721 479983002 474220335 467369974 459518939 450754970 440978497
3316.4 440978497 430015951 417839557 404514641 390091896 374648780 358600706 342739195
3330.7 342739195 327790499 314484268 303632110 295761138 291241795 290397346 293132335 299087763
3347 299087763 307757497 318215340 329734415 342283130 355928898 370387375 385194451 399982423
3363.3 399982423 414503574 428247511 440521896 451083481 460301995 468575567 475907773 482306212
3379.6 482306212 487929195 492943853 497536361 501924992 506222367 510171413 513553917 516645908
3395.9 516645908 519750595 522719264 525221646 527324498 529421151 531606495 533711016 535646737
$$ packed form
3283.8E10122418j315832j461148j605570j875758k276719k700120l088475l377288
3300.1D92421508l627807m044980m765719n762667o850361p851035q763969r776473
3316.4D40978497j0962546j2176394j3324916j4422745j5443116j6048074j5861511
3330.7C42739195j4948696j3306231j0852158p870972m519343q44449K734989N955428
3347B99087763Q669734J0457843J1519075J2548715J3645768J4458477J4807076J4787972
3363.3C99982423J4521151J3743937J2274385J0561585R218514Q273572P332206O398439
3379.6D82306212N622983N014658M592508M388631M297375L949046L382504L091991
3395.9E16645908L104687K968669K502382K102852K096653K185344K104521J935721
$$ plain form
3412.3 535646737 537398994 539029002 540658951 542313695 543915212 545457184 547016799 548590839
3428.6 548590839 550073087 551496804 552974224 554473519 555901647 557275295 558704138 560236096
3444.9 560236096 561813712 563319683 564725816 566075742 567400873 568684876 569896579 571076453
3461.2 571076453 572285950 573532581 574817955 576197743 577689409 579230368 580758214 582314014
3477.5 582314014 584041655 586021662 588089824 590124607 592200577 594266951 596212387 598059118
3493.8 598059118 599886417 601687849 603423774 605138004 606867790 608560145 610240221 611873746
3510.2 611873746 613360584 614841342 616447449 618121386 619795084 621493638 623224258 624904096
3526.5 624904096 626461387 627942920 629423261 630959809 632566750 634141207 635677397 637293458
$$ packed form
3412.3E35646737J752257J630008J629949J654744J601517J541972J559615J574040
3428.6E48590839J482248J423717J477420J499295J428128J373648J428843J531958
3444.9E60236096J577616J505971J406133J349926J325131J284003J211703J179874
3461.2E71076453J209497J246631J285374J379788J491666J540959J527846J555800
3477.5E82314014J727641J980007K068162K034783K075970K066374J945436J846731
3493.8E98059118J827299J801432J735925J714230J729786J692355J680076J633525
3510.2F11873746J486838J480758J606107J673937J673698J698554J730620J679838
3526.5F24904096J557291J481533J480341J536548J606941J574457J536190J616061
$$ plain form
3542.8 637293458 638996661 640549541 641913176 643356323 644910872 646455646 648079634 649858296
3559.1 649858296 651664376 653445423 655363619 657451332 659296930 660820603 662428916 664326251
3575.4 664326251 666387618 668533385 670764208 673021972 675304472 677507579 679469645 681343794
3591.7 681343794 683347046 685451150 687554002 689615548 691590607 693483233 695344567 697231174
3608.1 697231174 699065983 700776994 702351689 703813374 705474734 707318366 708817542 710042000
3624.4 710042000 711392045 713041842 714501441 715445876 716257215 717055321 717824757 718593836 719358981
3642.7 719358981 720160007 721063614 721919954 722203195 722139895 722477496 723376691 724281788 724904239 725409508
3663.1 725409508 725922167 726473808 727058291 727535307 727778792 727807343 727647841 727488279 727460802 727595389
$$ packed form
3542.8F37293458J703203J552880J363635J443147J554549J544774J623988J778662
3559.1F49858296J806080J781047J918196K087713J845598J523673J608313J897335
3575.4F64326251K061367K145767K230823K257764K282500K203107J962066J874149
3591.7F81343794K003252K104104K102852K061546J975059J892626J861334J886607
3608.1F97231174J834809J711011J574695J461685J661360J843632J499176J224458
3624.4G10042000J350045J649797J459599R44435Q11339P98106P69436P69079P65145
3642.7G19358981Q01026R03607Q56340K83241o3300L37601Q99195R05097O22451N05269
3663.1G25409508N12659N51641N84483M77016K43485K8551j59502j59562k7477J34587
$$ plain form
3683.5 727595389 727977574 728645325 729108036 728968322 728726685 728705764 728882134 729203880 729555070 729780316
3703.9 729780316 729941428 730153203 730267763 730014265 729485571 729042649 728897750 729070008 729396343 729685247
3724.3 729685247 729857683 729916155 730033815 730406344 730815411 730809212 730445325 730039299 729699075 729540229
3744.7 729540229 729619741 729717731 729621828 729295969 728997409 728822708 728650808 728361189 728047848 727873206
3765.1 727873206 727788389 727640092 727405131 727183223 727173209 727461278 727706194 727583408 727356315 727223694
3785.5 727223694 727100432 726999819 726947248 726914763 726906717 726870835 726721287 726545751 726374388 726141274
3805.9 726141274 725938976 725780189 725727439 725889742 726147711 726283193 726227403 725906014 725469410 725231469
3826.3 725231469 725185037 725111127 725007176 725096285 725303948 725291610 725059390 724786699 724520862 724302828
$$ packed form
3683.5G27595389L82185O67751M62711j39714k41637k0921J76370L21746L51190K25246
3703.9G29780316J61112K11775J14560k53498n28694m42922j44899J72258L26335K88904
3724.3G29685247J72436N8472J17660L72529M09067o199l63887m06026l40224j58846
3744.7G29540229P9512R7990r5903l25859k98560j74701j71900k89619l13341j74642
3765.1G27873206q4817j48297k34961k21908j0014K88069K44916j22786k27093j32621
3785.5G27223694j23262j00613n2571l2485q046l5882j49548j75536j71363k33114
3805.9G26141274k02298j58787n2750J62303K57969J35482n5790l21389m36604k37941
3826.3G25231469m6432p3910j03951Q9109K07663j2338k32220k72691k65837k18034
$$ plain form
3846.7 724302828 724215746 724206328 724066257 723782122 723484993 723215759 723055482 722976148 722876310 722707689
3867.1 722707689 722495496 722307742 722103596 721859515 721647263 721570611 721602499 721510768 721182346 720708966
3887.5 720708966 720304012 720023334 719773054 719561398 719426513 719341993 719228327 718997419 718689024 718407691
3907.9 718407691 718196094 718045533 717967272 717993081 718017161 717919350 717760205 717617214 717480183 717344940
3928.3 717344940 717252374 717206001 717124641 716955721 716774225 716645062 716562152 716495931 716431499 716354966 716197789
3950.7 716197789 715943992 715681612 715493619 715325177 715092599 714813352 714499950 714185417 713923216 713685453
3971.1 713685453 713424861 713133335 712832630 712597966 712509930 712500274 712416232 712293446 712213397 712098837
3991.5 712098837 711917639 711747110 711599946
$$ packed form
3846.7G24302828q7082r418j40071k84135k97129k69234j60277p9334r9838j68621
3867.1G22707689k12193j87754k04146k44081k12252p6652L1888r1731l28422m73380
3887.5G20708966m04954k80678k50280k11656j34885q4520j13666k30908l08395k81333
3907.9G18407691k11597j50561p8261K5809K4080r7811j59145j42991j37031j35243
3928.3G17344940r2566m6373q1360j68920j81496j29163q2910o6221o4432p6533j57177
3950.7G16197789k53797k62380j87993j68442k32578k79247l13402l14533k62201k37763
3971.1G13685453k60592k91526l00705k34664q8036r656q4042j22786q0049j14560
3991.5G12098837j81198j70529j47164
$$ plain form
3997.6 711599946
$$ packed form
3997.6G11599946
##END=$$ End of the data block
