##TITLE=Acido Abietico $$ Begin of the data block
##JCAMP-DX=5.00 $$ ACD/SpecManager v 10.08
##SPECTROMETER/DATA SYSTEM=Alpha
##DATE=26 May 2015 13:33:38
##DATA TYPE=INFRARED SPECTRUM
##DATA CLASS=XYDATA
##ORIGIN=
##OWNER=
##NPOINTS=1765
##FIRSTX=399.76428223
##LASTX=3997.64306641
##MAXX=3997.64306641
##MINX=399.76428223
##MAXY=1.00057185
##MINY=0.49406928
##XFACTOR=1.0000000000
##YFACTOR=0.000000010000000
##FIRSTY=1.00000000
##DELTAX=2.03961372
##XUNITS=1/CM
##YUNITS=ARBITRARY UNITS
##XYDATA=(X++(Y..Y))
399.8A00000000L8743l8743r9748j34296l3521j0532q1438p6312L8427P8970m0316
422.2I9641234r2638l356P8375N2768m3917r6589m1533k629j08045k30366j63954k361
446.7I8986989K8569m1181l3444O8491J08678J2856r9271q9801L761J3102r3204j43004
471.2I8722541p1978j8424n6440j07169o3342O4636J01900J317n4187m959K0689m0781
495.6I8493803j21451j22052o7914q1551j70642k41202k23583j62459j61153k02942
516I6938854j82205j17707j24908j97440k40511j93596r5612n1742r8771j38199j03021
538.5I5395142o8885q3649r8718m9752N0670R7484L7259m1646m2242M655M5657R5922
562.9I5341897J61940J94472J72800J65295K24638K89184K64538J61510P0936M8631
$$ plain form
399.8 100000000 100038743 100000000 99900252 99765956 99732435 99721903 99640465 99564153 99602580 99681550 99641234
422.2 99641234 99548596 99545240 99623615 99676383 99632466 99535877 99494344 99491715 99383670 99153304 98989350 98986989
446.7 98986989 99015558 98974377 98940933 99009424 99118102 99130958 99031687 98941886 98945647 98958749 98865545 98722541
471.2 98722541 98650563 98632139 98575699 98468530 98405188 98469824 98571724 98573041 98518854 98513895 98534584 98493803
495.6 98493803 98372352 98250300 98182386 98100835 97930193 97688991 97465408 97302949 97141796 96938854
516 96938854 96756649 96638942 96514034 96316594 96076083 95882487 95786875 95735133 95636362 95498163 95395142
538.5 95395142 95326257 95242608 95143890 95094138 95144808 95242292 95279551 95237905 95195663 95200318 95245975 95341897
562.9 95341897 95503837 95698309 95871109 96036404 96261042 96550226 96814764 96976274 97047210 97095841
583.3I7095841O6126M7802j7476m4941L1447J19322Q0842l2770r1434r2709j09297
605.8I7052753j59848j47795J585J60718J76024J01048O4177Q2075R4563M7344l8070
628.2I7434574p1996k8491L296n1355j35416j35964m9639p433p6669j81264k36553
650.6I6463090k42024k56503l02857k86377q7136J66321K15340K32136N87654P74998
671I7264642O25950M39727K63840J35851N5229K760n7608j23805j40613q7446m8035
693.5I8330492p8321j24985j16241p0679m9013n7715o0004m7553m1228m1694l4034
715.9I7609025P403J55634M41772O60371N91690L32963J29551N5617J5974o6996j88362
738.3I9744642k46984j86139o2836K6489O8903J00296J19657Q1253k5356j14083j06585
$$ plain form
583.3 97095841 97161967 97209769 97192293 97147352 97178799 97298121 97378963 97346193 97254759 97162050 97052753
605.8 97052753 96892905 96745110 96746695 96907413 97083437 97184485 97248662 97330737 97425300 97472644 97434574
628.2 97434574 97362578 97334087 97337383 97286028 97150612 97014648 96965009 96957576 96880907 96699643 96463090
650.6 96463090 96221066 95964563 95661706 95375329 95288193 95454514 95669854 95901990 96489644 97264642
671 97264642 97890592 98330319 98594159 98730010 98785239 98787999 98730391 98606586 98465973 98378527 98330492
693.5 98330492 98252171 98127186 98010945 97940266 97891253 97833538 97773534 97725981 97684753 97643059 97609025
715.9 97609025 97616428 97772062 98213834 98874205 99465895 99798858 99928409 99984026 100000000 99933004 99744642
738.3 99744642 99497658 99311519 99248683 99275172 99344075 99444371 99564028 99645281 99619925 99505842 99399257
760.8I9399257m1485j4126m9353r1338r7043j09386j81842k49916k22761j52605j85830
783.2I8003572l59064m59278k37757J43379K76053J21230n9312j38766j54430j71375
803.6I6964252k15262k62141k82842l04139l90255n27239n86379m68314k45893q2850
824I3598938m7600o4391j1772J47360L36510M54462M55540L61950K33018J21391L3146
846.4I5618552n8889j60695k38364k64830k53594k26658j89305j44845j22106j69975
866.8I3789291l10570n10329o81632p12598n74422l69990j88416n7447m4465j89358
887.2I0150064l46237k82848k1762K15680L77786M68808M23575K99275K00712J27602
907.6I1612655N9277J5890j8352q7750j70565k07400j90252j47974q7727k0003N478
$$ plain form
760.8 99399257 99357772 99343646 99294293 99202955 99105912 98996526 98814684 98564768 98342007 98189402 98003572
783.2 98003572 97644508 97185230 96947473 97090852 97366905 97488135 97428823 97290057 97135627 96964252
803.6 96964252 96748990 96486849 96204007 95899868 95509613 94982374 94395995 93927681 93681788 93598938
824 93598938 93551338 93486947 93475175 93622535 93959045 94413507 94869047 95230997 95464015 95585406 95618552
846.4 95618552 95559663 95398968 95160604 94895774 94642180 94415522 94226217 94081372 93959266 93789291
866.8 93789291 93478721 92968392 92286760 91574162 90999740 90629750 90441334 90383887 90339422 90150064
887.2 90150064 89803827 89520979 89499217 89714897 90092683 90561491 90985066 91284341 91485053 91612655
907.6 91612655 91671932 91687822 91669470 91581720 91411155 91203755 91013503 90865529 90777802 90757799 90763277
930.1I0763277l5101j10221k03318k99525l51739l45063l15124k83664k35200j52320
950.5H8432002m8721K4849L4511R001o449p177j7971l3158j2290M8792Q4651M3350
974.9H8551390R000J31625L90011N75829N34105K88928k9647k62720k88290j50209
995.3H9750022j9038J1051l4619r4384j36739j61820j74707j68694j02645L1311J27905
1017.8H9027643Q0520p3689k17646k69831k10476r2154k385K2382K1088K6763L1972
1040.2H8344187M8136Q8340J22077J21468J13046J26129J20140N8609j1838l9428k8825
1062.6H9062041K897L3027J8930m4906j11932j52748j86611k13903j79606o8874K6906
1085.1H8185221J1551r1386j91497k59781l38340m53740n60636n91319n44674m51165
$$ plain form
930.1 90763277 90728176 90617955 90414637 90115112 89763373 89418310 89103186 88819522 88584322 88432002
950.5 88432002 88383281 88408130 88442641 88451642 88445193 88438016 88420045 88386887 88374597 88423389 88508040 88551390
974.9 88551390 88560390 88692015 89082026 89657855 90191960 90480888 90451241 90188521 89900231 89750022
995.3 89750022 89730984 89742035 89707416 89613032 89476293 89314473 89139766 88971072 88868427 88899738 89027643
1017.8 89027643 89108163 89034474 88816828 88546997 88336521 88244367 88241982 88264364 88285452 88312215 88344187
1040.2 88344187 88392323 88480663 88602740 88724208 88837254 88963383 89083523 89142132 89130294 89090866 89062041
1062.6 89062041 89064938 89097965 89116895 89071989 88960057 88807309 88620698 88406795 88227189 88158315 88185221
1085.1 88185221 88196772 88105386 87913889 87654108 87315768 86862028 86301392 85710073 85165399 84714234
1105.5H4714234k97171q2475J01751J41043L7509j06961k35951l67367n04082n98687
1125.9H2801843n79906m14628j83743k4694Q3o7156j48052k13611k84505l65907m48203
1148.3H0071521n23776n02133k10596L00825O48737N90736K84678j9521j96505k39807
1168.7H0204159k26384k26170k46704k68733k76578k52646k00516j81699k22510k05463
1189.1G7896756m2L22533N34981N24229L83848K58297K10893J91319J09124n7912k62731
1211.5H0111295m26692m71473m03976l23945l04455l37803l87788l99834l09604j45442
1231.9G6600283k4467O503q893l2145m9460o6716r9826j46979j81967j55556m5812
1254.4G5794965P4405R5182n191j58781l06738m36931n53012o34802o33174n19085
$$ plain form
1105.5 84714234 84417063 84334588 84436339 84577382 84614891 84507930 84271979 83904612 83400530 82801843
1125.9 82801843 82221937 81807309 81623566 81598872 81598955 81531799 81383747 81170136 80885631 80519724 80071521
1148.3 80071521 79547745 79045612 78835016 79135841 79784578 80375314 80659992 80640471 80443966 80204159
1168.7 80204159 79977775 79751605 79504901 79236168 78959590 78706944 78506428 78324729 78102219 77896756
1189.1 77896756 77896714 78219247 78754228 79278457 79662305 79920602 80131495 80322814 80431938 80374026 80111295
1211.5 80111295 79684603 79213130 78809154 78485209 78180754 77842951 77455163 77055329 76745725 76600283
1231.9 76600283 76575816 76582319 76573426 76541281 76491821 76425105 76325279 76178300 75996333 75840777 75794965
1254.4 75794965 75869370 75964552 75959361 75800580 75493842 75056911 74503899 73869097 73235923 72716838
1274.8G2716838l36563j55735J2254J98114M27789O96575R56095J165622J320744J386308
1295.2G8388041J299823J058381P52259N21564M75234N90819P19732P33870O27566
1313.5H5167289N07736M79847N20683N12665L98141K39629J31178P3266K902o3246
1333.9H7970090p0989p2336j47111k32184k09933r8962k9057r2089k76160n27734p85607
1356.4H5427928r19998p93779m70697j54645P5132K42990K98250J76227j26511n28794
1376.7H3226103r42427j300705j405614j108927m30655M79137J227093J621026J612133
1395.1H2977164J198363P16120L62152J52481O2418M3690R9414K13147L34394M19533
1415.5H6578876M71079M62711L37952J94466J9187k25734m39817m29684k38824k67094
$$ plain form
1274.8 72716838 72380275 72224540 72236794 72434908 72862697 73559272 74515367 75680989 77001733 78388041
1295.2 78388041 79687864 80746245 81498504 82020068 82495302 83086121 83805853 84539723 85167289
1313.5 85167289 85675025 86154872 86675555 87188220 87586361 87825990 87957168 88030434 88033336 87970090
1333.9 87970090 87899101 87826765 87679654 87447470 87237537 87138575 87109518 87017429 86741269 86213535 85427928
1356.4 85427928 84507930 83714151 83243454 83088809 83163941 83406931 83705181 83881408 83754897 83226103
1376.7 83226103 82283676 80982971 79577357 78468430 78037775 78516912 79744005 81365031 82977164
1395.1 82977164 84175527 84891647 85253799 85406280 85468698 85512388 85611802 85824949 86159343 86578876
1415.5 86578876 87049955 87512666 87850618 88045084 88064271 87838537 87398720 86969036 86730212 86463118
1435.9H6463118o36405q79610q43918o21110l20471j62863k15739l57336n16755q21208
1456.3H1087703r67348n20313j597L40259M38064L77017M72957R18067J550233K039814
1476.7H5734856K210474K048409J658619J151716P05964L90404K21491J73825K02483
1495I4498241L05813M83108O52897P38585Q06201P29269L93730K28566K25359K28960
1515.4I9290729K12258J88118J65540J01119M2111J25j7834j5646m7457p7325n5868
1537.9I9785870r1594k03782k43819k43592k31308k20883k13522k05904j90657k59054
1558.3I7681755m07487l33321k13892j65111j61725k09331k24716k21312k97838l50595
1578.7I5096427l51500l92604m53621n14043n77712o50513p28053q08948q72535r12284
$$ plain form
1435.9 86463118 85826713 84947103 84103185 83482075 83161604 82998741 82783002 82425666 81908911 81087703
1456.3 81087703 80120355 79600042 79598445 79938704 80376768 80753785 81226742 82144809 83695042 85734856
1476.7 85734856 87945330 89993739 91652358 92804074 93510038 93900442 94121933 94295758 94498241
1495 94498241 94804054 95287162 95940059 96678644 97484845 98214114 98607844 98836410 99061769 99290729
1515.4 99290729 99502987 99691105 99856645 99957764 99999875 100000000 99982166 99966520 99919063 99841738 99785870
1537.9 99785870 99694276 99490494 99246675 99003083 98771775 98550892 98337370 98131466 97940809 97681755
1558.3 97681755 97274268 96940947 96727055 96561944 96400219 96190888 95966172 95744860 95447022 95096427
1578.7 95096427 94744927 94352323 93898702 93384659 92806947 92156434 91428381 90619433 89746898 88834614
1599.1H8834614r39864r40913q72368p31826n66458m33004l53217l61097m54843m67056
1619.5H2713968m54796n04017m84776m08119l57390k64883j59132j72103k84379l59321
1639.9G9265052m01777m27943m87584n20528m06235l93039n39374n09751m52024m96030
1660.3G4630767o13511p28195p73293r28259j182187j287490j532775j891428k044308
1678.6F3649321k196783k611697l163260k632970j725441j195782o51128o5332N55768
1697D9962696J242760J903034J802349J548057J411814J129764R14723Q06069P70968
1715.3F1492234P90406P25615O24835O64157P53194Q52662R66865J106292J405680
1733.7F9381940J517940J368850J473266J556212J452971J368695J280040J202327
$$ plain form
1599.1 88834614 87894750 86953837 86081469 85349643 84783185 84350181 83996964 83635867 83181024 82713968
1619.5 82713968 82259172 81755155 81270379 80862260 80504870 80239987 80080855 79908752 79624373 79265052
1639.9 79265052 78863275 78435332 77947748 77427220 77020985 76627946 76088572 75578821 75126797 74630767
1660.3 74630767 74017256 73289061 72515768 71587509 70405322 69117832 67585057 65693629 63649321
1678.6 63649321 61452538 58840841 55677581 53044611 51319170 50123388 49472260 49406928 49962696
1697 49962696 51205456 53108490 54910839 56458896 57870710 59000474 59915197 60721266 61492234
1715.3 61492234 62282640 63008255 63633090 64297247 65050441 65903103 66869968 67976260 69381940
1733.7 69381940 70899880 72268730 73741996 75298208 76751179 78119874 79399914 80602241
1750H0602241J060974Q67802P73013P29257O73353O46591N80597N24027N23889N15937
1770.4H7497681N05472M38112L74609L80003M00901M01175M01604M03291M05866M41325
1790.8I1650039M55803L99595L55744L56550L45295L11572K83300K81161L00092L15619
1811.2I5054770L09950K92647K79188K60418K38628K16501J89817J58799J37812J15073
1831.6I7253603J00392J02025R7448R4700J05714J12188Q3024N8513O3801P2533P1877
1854I8215818O5977O1685N8549N9468O3550O6090N3132L0058K2447L0059L1739K6775
1878.5I8785347K5016K9081L4040L3111L0291K3871K2620K5976K4271J9574K0641K8092
1903I9101931L1608K8515K1476J7374K1309L1155L0500J6815J2129J9765K1893J6618
$$ plain form
1750 80602241 81663215 82531017 83304030 84033287 84706640 85353231 85933828 86457855 86981744 87497681
1770.4 87497681 88003153 88441265 88815874 89195877 89596778 89997953 90399557 90802848 91208714 91650039
1790.8 91650039 92105842 92505437 92861181 93217731 93563026 93874598 94157898 94439059 94739151 95054770
1811.2 95054770 95364720 95657367 95936555 96196973 96435601 96652102 96841919 97000718 97138530 97253603
1831.6 97253603 97353995 97456020 97553468 97648168 97753882 97866070 97949094 98007607 98071408 98143941 98215818
1854 98215818 98281795 98343480 98402029 98461497 98525047 98591137 98644269 98674327 98696774 98726833 98758572 98785347
1878.5 98785347 98810363 98839444 98873484 98906595 98936886 98960757 98983377 99009353 99033624 99053198 99073839 99101931
1903 99101931 99133539 99162054 99183530 99200904 99222213 99253368 99283868 99300683 99312812 99332577 99354470 99371088
1927.5I9371088J5175K0587K7842K7287J9991J5032J9127K4927K3312J6129J5807K4062
1951.9I9620366K5833J8328P630L999J0610J8793J5390R30p725j973P063N424l290
1978.5I9721378o604J633R418N632k444l457J192N842M405l952o360L147J1706O718
2007I9748254j967J097J3351J6558N43j8871k4271l3117k9200K5070O5464N0866L3456
2033.5I9847233K5815J2547J871M173R662N042k163k456K539P838M369m095m422%Q04
2064.1I9908757k730n763l517J800J788o539j1718m971M524M763K9j603J812P397N656
2094.7I9899685j72K473J2541J7023R847L552Q810J6486J4937N818k09L153O104m8
2123.3A00000000l171k199L117K253n984j4913j1766k551j717j1051j8072j3322m148
$$ plain form
1927.5 99371088 99386263 99406850 99434692 99461979 99481970 99497002 99516129 99541056 99564368 99580497 99596304 99620366
1951.9 99620366 99646199 99664527 99672157 99676156 99686766 99705559 99720949 99721879 99714154 99712181 99719244 99724668 99721378
1978.5 99721378 99714774 99716407 99725825 99731457 99729013 99725556 99726748 99732590 99736995 99733043 99726683 99729830 99741536 99748254
2007 99748254 99746287 99747384 99760735 99777293 99777836 99758965 99734694 99701577 99672377 99697447 99762911 99813777 99847233
2033.5 99847233 99873048 99885595 99887466 99891639 99901301 99906343 99904180 99901724 99904263 99912101 99916470 99912375 99907953 99907953 99908757
2064.1 99908757 99906027 99900264 99896747 99898547 99900335 99893796 99882078 99877107 99881631 99886394 99886423 99884820 99886632 99894029 99899685
2094.7 99899685 99899513 99901986 99914527 99931550 99941397 99944949 99953759 99970245 99985182 99991000 99990791 99993944 100000048 100000000
2123.3 100000000 99996829 99994630 99997747 100000000 99994016 99979103 99967337 99964786 99963069 99952018 99933946 99920624 99916476
2149.8I9916476k819r573j3703p057M321N931n215j5027q517Q595J4215M387J276J2439
2178.3I9905729K0570J3393k86j001J2511J8304M673r543n787O330O991m470j2070
2204.8I9955344p903K128M047n168j5062j6064p623l040p665j1784j2982j3005j3686
2231.4I9847537j8465k2072j8805j4687j7965k6112l0876k4688j3155j2654k4128l2520
2255.8I9591410k8145j7476j2940j9551k9647l1906k3354j6808k3544l0845k7484k0850
2280.3I9308860k0593k8062l8016m0072l2020k8604l7771m6182m2808l7229m2010n7685
2304.8I8857808p1365o8390n5444n2536o4552q1819q9580p6896o0671o2895p0602o4242
2329.3I8038816n2833n5945p1681p6258o0934l6901r131K1332K5440k2150r0372j26028
$$ plain form
2149.8 99916476 99913657 99904084 99890381 99883324 99887645 99893576 99888361 99873334 99864817 99873412 99887627 99892014 99893290 99905729
2178.3 99905729 99926299 99939692 99939406 99938405 99950916 99969220 99973893 99964350 99958563 99964893 99971884 99967414 99955344
2204.8 99955344 99947441 99949569 99953616 99948448 99933386 99917322 99909699 99906659 99898994 99887210 99874228 99861223 99847537
2231.4 99847537 99829072 99807000 99788195 99773508 99755543 99729431 99698555 99673867 99660712 99648058 99623930 99591410
2255.8 99591410 99563265 99545789 99532849 99513298 99483651 99451745 99428391 99411583 99388039 99357194 99329710 99308860
2280.3 99308860 99288267 99260205 99222189 99182117 99150097 99121493 99083722 99037540 98994732 98957503 98915493 98857808
2304.8 98857808 98786443 98718053 98662609 98610073 98545521 98463702 98374122 98297226 98236555 98173660 98103058 98038816
2329.3 98038816 97985983 97930038 97858357 97782099 97721165 97684264 97675133 97696465 97721905 97699755 97609383 97483355
2353.7I7483355j18143j00743p1001k9612r286p683M792K4366L4338K6489J3798J7274
2378.2I7267944K5457J5962j1182l8254n0134n1611n5290o3359p1371p2449o5440o1107
2402.7I6769166o5637p2747p2748o5434o2495o8837p6080p6008o9755o6572p1609p9441
2427.2I5921803q1105p6031p4852q3726r3049r4462r2715r3919r8908j04051j02818
2449.6I4926167r4921r0223r3925r7591r4682q9490q7691r1147r6554r6744r2489r1874
2474.1I3808836r9921j10525j14257j14285j20140j31791j39755j38009j32728j33127
2494.5I2574298j38294j41687j39278j34378j35929j44219j51229j51080j46085j47152
2514.9I1144967j54936j56772j48148j34921j26278j22273j11044r1248o7753m3327
$$ plain form
2353.7 97483355 97365212 97264469 97193468 97163856 97154570 97146887 97151679 97176045 97210383 97236872 97250670 97267944
2378.2 97267944 97293401 97309363 97298181 97259927 97209793 97158182 97102892 97039533 96968162 96895713 96830273 96769166
2402.7 96769166 96703529 96630782 96558034 96492600 96430105 96361268 96285188 96209180 96139425 96072853 96001244 95921803
2427.2 95921803 95840698 95764667 95689815 95606089 95513040 95418578 95325863 95231944 95133036 95028985 94926167
2449.6 94926167 94831246 94741023 94647098 94549507 94454825 94365335 94277644 94186497 94089943 93993199 93900710 93808836
2474.1 93808836 93708915 93598390 93484133 93369848 93249708 93117917 92978162 92840153 92707425 92574298
2494.5 92574298 92436004 92294317 92155039 92020661 91884732 91740513 91589284 91438204 91292119 91144967
2514.9 91144967 90990031 90833259 90685111 90550190 90423912 90301639 90190595 90099347 90031594 89988267
2535.3H9988267k3311o884Q857K0975K3365J5569Q142M583n358k0939l0184l2562l5614
2561.8H9914906m2987n2905o0397o3879o6125p0405p6056p9470p8345p3153p0810p3093
2586.2H9107281p2223o6423o4040p0721q1133q6558q7112q9336r5165j00803j01352
2608.7H8192415r7912r7633j01274j02174r7686r2501q8435q2833p7313p3558o8730
2631.1H7212366o1828n5617n0986m6229m0567l4875k6745j2725N752K3663L5214M2874
2655.6H6990297N5361P1239Q5217R8085J06883J06347R9492Q9544P9936P3814O6549
2678H7922764N5069M4149L6597L1871K8503K6041K6184K8050K8998K9498L1889L5423
2702.5H8325036L5971L1984K5475J5938L356o926j6481k9671m2081m7845n0288o0803
$$ plain form
2535.3 89988267 89964956 89958072 89966929 89987904 90011269 90026838 90034980 90039563 90034205 90013266 89983082 89950520 89914906
2561.8 89914906 89871919 89819014 89758617 89694738 89628613 89558208 89482152 89402682 89324337 89251184 89180374 89107281
2586.2 89107281 89035058 88968635 88904595 88833874 88752741 88666183 88579071 88489735 88394570 88293767 88192415
2608.7 88192415 88094503 87996870 87895596 87793422 87695736 87603235 87514800 87431967 87354654 87281096 87212366
2631.1 87212366 87150538 87094921 87043935 86997706 86957139 86922264 86895519 86882794 86888546 86912209 86947423 86990297
2655.6 86990297 87045658 87116897 87202114 87300199 87407082 87513429 87612921 87702465 87782401 87856215 87922764
2678 87922764 87977833 88021982 88058579 88090450 88118953 88144994 88171178 88199228 88228226 88257724 88289613 88325036
2702.5 88325036 88361007 88392991 88418466 88434404 88437760 88430834 88414353 88384682 88342601 88294756 88244468 88183665
2727H8183665p6955q4812q4895q8912r9254j09416j13642j12414j13398j19198j22004
2749.4H7058765j17934j13326j15353j22380j24717j22750j24830j31112j35553j33962
2769.8H5816848j32668j39707j50949j57207j55979j49525j45530j48732j50448j45578
2790.2H4340525j41287j44494j55049j69045j79470j82432j85877j96713k12502k32089
2810.6H2541567k59352k97981l45946l97574m54545n17148n63061n61160n07510m33731
2831G8203559l72863l30782l11833l32511l80808m20737m36127m27539l99851l72035
2851.4G4418473l81303m60213o01786p63935q82769q83221p35248m80532j90079N9878
2871.8F9099265J99372K14165J52797P1090R150j5045j3840j0490k0546n2333j05381
$$ plain form
2727 88183665 88106710 88021898 87937003 87848091 87748837 87639421 87525779 87413365 87299967 87180769 87058765
2749.4 87058765 86940831 86827505 86712152 86589772 86465055 86342305 86217475 86086363 85950810 85816848
2769.8 85816848 85684180 85544473 85393524 85236317 85080338 84930813 84785283 84636551 84486103 84340525
2790.2 84340525 84199238 84054744 83899695 83730650 83551180 83368748 83182871 82986158 82773656 82541567
2810.6 82541567 82282215 81984234 81638288 81240714 80786169 80269021 79705960 79144800 78637290 78203559
2831 78203559 77830696 77499914 77188081 76855570 76474762 76054025 75617898 75190359 74790508 74418473
2851.4 74418473 74037170 73576957 72975171 72211236 71328467 70445246 69709998 69229466 69039387 69099265
2871.8 69099265 69298637 69512802 69665599 69736689 69745839 69730794 69716954 69706464 69685918 69633585 69528204
2894.2F9528204j66541k19995k63232l09127l65460m23378m73023n21630n90193o89632
2914.6F5505993p94917q64810q84390q52996p71612o60199n46044m24701k63428o3211
2935E9379685J18017K28703K74742K78151K40385J65183Q0710K0719k706J6582Q5574
2957.4F0885745J99974L36993M59116N44846N97149O18673O01590N36608M39513L66330
2977.8F5586537L60221M14938N01704N82254O30682O54161O55717O35606O04475N53983
2998.2G1180278M88997M27216L64059L08299K81918K78229K69389K50834K41667K47830
3018.6G4338716K59412K69150K70403K67911K79373K94929K89035K53988K13658J98889
3039G6935464J87004J47086R8294P0894O5005N6380L7837K1285R578O783J6272K8503
$$ plain form
2894.2 69528204 69361663 69141668 68878436 68569309 68203849 67780471 67307448 66785818 66195625 65505993
2914.6 65505993 64711076 63846266 62961876 62108880 61337268 60677069 60131025 59706324 59442896 59379685
2935 59379685 59497702 59726405 60001147 60279298 60519683 60684866 60765576 60786295 60783589 60800171 60885745
2957.4 60885745 61085719 61422712 61881828 62426674 63023823 63642496 64244086 64780694 65220207 65586537
2977.8 65586537 65946758 66361696 66863400 67445654 68076336 68730497 69386214 70021820 70626295 71180278
2998.2 71180278 71669275 72096491 72460550 72768849 73050767 73328996 73598385 73849219 74090886 74338716
3018.6 74338716 74598128 74867278 75137681 75405592 75684965 75979894 76268929 76522917 76736575 76935464
3039 76935464 77122468 77269554 77367848 77438742 77503747 77560127 77597964 77619249 77628827 77635610 77651882 77680385
3063.5G7680385L2419K5410K0343K9629M8822P3904Q8853P6931O2925N9736N4443N8812
3088G8312612O7681O0731N3507O0892O9684O4409M6694L9255N1463N5570L6680K8748
3112.4G8947926M3797M2886J9484m357k1213k0576l111P147l6o664k086R114J0377
3139G9022688p469j9532j3691k307J2177K0403L081k0998k2388j4186j1581j1468j1462
3165.5G8923267q136l695o020j0419j2327j2767p796n692j2565j8662j6260j1486j3918
3192G8783524k0194k1726j8710j6737j6522j7858j9312j8596j9843k1839k1243k2989
3216.5G8547955k7246k9224k9689l1084k9850k3913j6594j7244l5536n0056m0758k5546
3240.9G8191215j8126j7041k2834k9135k5732k0390k1565k1917j8221j4907j3405j1987
$$ plain form
3063.5 77680385 77712804 77738214 77758557 77788186 77837008 77910912 77999765 78076696 78139621 78199357 78253800 78312612
3088 78312612 78380293 78441024 78494531 78555423 78625107 78689516 78736210 78775465 78826928 78882498 78919178 78947926
3112.4 78947926 78991723 79034609 79054093 79049736 79028523 79007947 79004836 79011983 79011947 79005283 79003197 79012311 79022688
3139 79022688 79015219 78995687 78981996 78979689 78991866 79012269 79015350 78994352 78971964 78957778 78946197 78934729 78923267
3165.5 78923267 78915131 78911436 78905416 78894997 78882670 78869903 78862107 78856415 78843850 78825188 78808928 78797442 78783524
3192 78783524 78763330 78741604 78722894 78706157 78689635 78671777 78652465 78633869 78614026 78592187 78570944 78547955
3216.5 78547955 78520709 78491485 78461796 78430712 78400862 78376949 78360355 78343111 78307575 78257519 78216761 78191215
3240.9 78191215 78173089 78156048 78133214 78104079 78078347 78057957 78036392 78014475 77996254 77981347 77967942 77955955
3265.4G7955955p343k956j2154k8407l5048l5107l1960k7698k9242l3605l2861l0225
3289.9G7649349l9697n7435o4206o1971n8484n3608n4568o8128q6660r7108r8896j01441
3314.4G6807147j05679j07676j08993j11675j21039j35350j41812j42395j45644j47826
3334.8G5539058j48832j57708j72836j83880j89918j90419j88292j97088k13260k21073
3355.2G3675752k20263k19214k21837k27344k31916k31844k30098k29555k27606k22987
3375.5G1413088k13492k03651j99485j95044j85591j74028j64622j62488j64354j57750
3395.9F9592583j46568j40673j36441j30385j20461j08945j03045j02228r5975q2153
3416.3F8425709o7794n7507m9865m0633k9337j5116q76J0234J8197K7204M1610N6422
$$ plain form
3265.4 77955955 77948612 77945656 77933502 77905095 77870047 77834940 77802980 77775282 77746040 77712435 77679574 77649349
3289.9 77649349 77609652 77552217 77488011 77426040 77367556 77313948 77259380 77191252 77104592 77007484 76908588 76807147
3314.4 76807147 76701468 76593792 76484799 76373124 76252085 76116735 75974923 75832528 75686884 75539058
3334.8 75539058 75390226 75232518 75059682 74875802 74685884 74495465 74307173 74110085 73896825 73675752
3355.2 73675752 73455489 73236275 73014438 72787094 72555178 72323334 72093236 71863681 71636075 71413088
3375.5 71413088 71199596 70995945 70796460 70601416 70415825 70241797 70077175 69914687 69750333 69592583
3395.9 69592583 69446015 69305342 69168901 69038516 68918055 68809110 68706065 68603837 68507862 68425709
3416.3 68425709 68357915 68300408 68250543 68209910 68180573 68165457 68164581 68174815 68193012 68220216 68261826 68318248
3440.8F8318248O5970P5144Q7893R4706R8973J10269J24609J36876J45465J46789J48564
3463.2F9553506J60659J70749J66148J56975J62405J74635J82319J88255J89102J88583
3483.6G1293336J93608J97577K02686K12812K18219K21729K26206K32243K39122K35832
3504G3473370K29365K40868K62958K73484K69955K67428K76465K90030K97564K90227
3524.4G6171714K84022K97243L11476L15427L23820L31170L32141L46964L66891L66211
3544.8G9447079L47644L40527L55727L67790L64310L70895L87067L87228L82596L93909
3565.2H3144772M09192L97074L81416L90703M02826M05586M09036M14718M18484M20964
3585.6H7194771M14925L94708L83574L95382M06497M03786L92228L76720L66312L67105
$$ plain form
3440.8 68318248 68384218 68459362 68547255 68641961 68740934 68851203 68975812 69112688 69258153 69404942 69553506
3463.2 69553506 69714165 69884914 70051062 70208037 70370442 70545077 70727396 70915651 71104753 71293336
3483.6 71293336 71486944 71684521 71887207 72100019 72318238 72539967 72766173 72998416 73237538 73473370
3504 73473370 73702735 73943603 74206561 74480045 74750000 75017428 75293893 75583923 75881487 76171714
3524.4 76171714 76455736 76752979 77064455 77379882 77703702 78034872 78367013 78713977 79080868 79447079
3544.8 79447079 79794723 80135250 80490977 80858767 81223077 81593972 81981039 82368267 82750863 83144772
3565.2 83144772 83553964 83951038 84332454 84723157 85125983 85531569 85940605 86355323 86773807 87194771
3585.6 87194771 87609696 88004404 88387978 88783360 89189857 89593643 89985871 90362591 90728903 91096008
3606I1096008L77172L74389L62140L53616L43466L45302L36271K96509K78306K99699
3626.4I4462878L20094K79564K25163K16799K15304K08396K07394K06691K06829K15244
3646.8I6764356K13843J61481J10013J17337J39505J32942J14513J03891J09887J29825
3667.2I8097593J37186J14703J01459R3788N9086M9501P1562R2947J16891J34164R8360
3689.6I9167240L8457K5552L6925N0450O4820N7870L3009L1501N3960O1160K9695l057
3714.1I9647582k778J3703K4951K0825P469P45J6576M1729N0867L6192N966j0240M929
3740.6I9858516K7758K4498J5628K6918J0985k5588k2758k563L785P81K790P832R519
3767.1I9938101N644m756p367J937J2535Q094j0449j2100k497l052l010Q106J8257
$$ plain form
3606 91096008 91473180 91847569 92209709 92563325 92906791 93252093 93588364 93884873 94163179 94462878
3626.4 94462878 94782972 95062536 95287699 95504498 95719802 95928198 96135592 96342283 96549112 96764356
3646.8 96764356 96978199 97139680 97249693 97367030 97506535 97639477 97753990 97857881 97967768 98097593
3667.2 98097593 98234779 98349482 98450941 98544729 98603815 98653316 98724878 98817825 98934716 99068880 99167240
3689.6 99167240 99205697 99231249 99268174 99318624 99383444 99441314 99474323 99505824 99559784 99620944 99650639 99647582
3714.1 99647582 99644804 99658507 99683458 99704283 99711752 99712497 99729073 99770802 99821669 99857861 99863827 99853587 99858516
3740.6 99858516 99886274 99910772 99926400 99953318 99964303 99938715 99915957 99913394 99917179 99917960 99920750 99928582 99938101
3767.1 99938101 99943745 99938989 99931622 99933559 99946094 99954188 99943739 99931639 99929142 99926090 99923080 99931186 99949443
3793.7I9949443J2577J0377J9837P766q625p695j1831j4597o414M208R102J1390Q005
3820.2I9983543j4931k5332j2123p87R805K0152K4671J5002n716j2338q589j8013k0152
3846.7I9935192K771L1806K7513j9163l5047j2637P034P665l296l135K437K03k974
3873.2I9938369l743P522J9288J7190J6051K301j5604n460j306j5866j1158J2785K6077
3899.7I9986446J3554j2648k8390k3556p212P326Q446J502n383k956Q976R597R77J914
3928.3I9958593P450O920O336R078R900O801n84m494l707k796J997q4p236K325J4257
3958.9A00004756P499r90M89K86l326j585N150Q571l314j5915J43K1649K0301Q869
3987.4A00052583j764m459k980J347J2458
$$ plain form
3793.7 99949443 99962020 99972397 99992234 100000000 99991375 99983680 99971849 99957252 99950838 99955046 99964148 99975538 99983543
3820.2 99983543 99968612 99943280 99931157 99930370 99940175 99960327 99984998 100000000 99994284 99981946 99973357 99955344 99935192
3846.7 99935192 99937963 99969769 99997282 99978119 99943072 99930435 99937469 99945134 99941838 99938703 99941140 99941343 99938369
3873.2 99938369 99934626 99942148 99961436 99978626 99994677 99996978 99981374 99975914 99974608 99958742 99947584 99960369 99986446
3899.7 99986446 100000000 99987352 99958962 99935406 99928194 99935520 99943966 99945468 99940085 99937129 99946105 99955702 99956679 99958593
3928.3 99958593 99966043 99972963 99979299 99988377 99998277 100005078 100004494 100000000 99996293 99993497 99995494 99995410 99988174 99990499 100004756
3958.9 100004756 100012255 100011265 100011754 100012040 100008714 100007129 100012279 100020850 100017536 100001621 100001764 100023413 100043714 100052583
3987.4 100052583 100050819 100046360 100043380 100044727 100057185
3997.6A00057185
$$ plain form
3997.6 100057185
##END=$$ End of the data block
