##TITLE=Acetato de isoamila - Grupo 6 $$ Begin of the data block
##JCAMP-DX=5.00 $$ ACD/SpecManager v 10.08
##SPECTROMETER/DATA SYSTEM=Alpha
##DATE=22 Oct 2014 14:05:46
##DATA TYPE=INFRARED SPECTRUM
##DATA CLASS=XYDATA
##ORIGIN=
##OWNER=
##NPOINTS=1667
##FIRSTX=599.64648438
##LASTX=3997.64306641
##MAXX=3997.64306641
##MINX=599.64648438
##MAXY=0.73460555
##MINY=0.23886584
##XFACTOR=1.0000000000
##YFACTOR=1.000000000000000e-9
##FIRSTY=0.64618134
##DELTAX=2.03961372
##XUNITS=1/CM
##YUNITS=ARBITRARY UNITS
##XYDATA=(X++(Y..Y))
599.6F46181345o976664r983599r103418l593743K105594M366517M160166L746510
616F30902708L895640M380763M834294N021095M582763L291905J137197q99494j032948
634.3F56113923J099884L384411M241586M452229N055487N740821N565644M877865
650.6F90531850M465282M437744M309595L817737L325880L305197L582119L210247
667G20985651J606405J155317J594901J382172J056671R45330Q79764P71642O03795
685.3G30981648M15027L63171L98338L03924L49820L49939J36077J31011L22938M09305
705.7G34161198K65896L6657J6570R4533k622j53303j50681Q6784K02954M7565j04964
728.1G34500587j21951j0848q226j14083j81079j68025j24216k49684m68493n82278
$$ plain form
599.6 646181345 639204681 629221082 620117664 616523921 618629515 622996032 627156198 630902708
616 630902708 634798348 639179111 644013405 649034500 653617263 656909168 658046365 657146871 656113923
634.3 656113923 657213807 660598218 664839804 669292033 674347520 680088341 685653985 690531850
650.6 690531850 694997132 699434876 703744471 707562208 710888088 714193285 717775404 720985651
667 720985651 722592056 723747373 725342274 726724446 727781117 728726447 729606211 730377853 730981648
685.3 730981648 731396675 731759846 732158184 732462108 732811928 733161867 733297944 733428955 733751893 734161198
705.7 734161198 734427094 734463751 734480321 734574854 734572232 734418929 734268248 734355032 734557986 734605551 734500587
728.1 734500587 734378636 734367788 734359562 734245479 734064400 733896375 733772159 733522475 733053982 732471704
748.5G32471704p08103q99672j016915r88662q02517o84440q28267j011908r60469
766.9G24570751p05480l23773J41919N13196O72579O65426N96762N23269L93688J99497
787.3G27247834N7996r9242l66748o12795p47740r29475j242220j559318j947403k335965
807.7G17464924k427757k201378j899064j610100r83536L16441J867592K811730K792478
826G16131330K132236J393855P72536K64823K6405O5327J30296o5327m44651p72655
846.4G19634175j097798j338840j187741o68228m5955N26547Q43287Q46803P08759
864.8G18221009M54128J11520k28465m86195o23286p22766o85870l91245j51813k39611
885.2G15257406n35607q60155j201153j572430j761198j619100j142085l81827K81513
$$ plain form
748.5 732471704 731763601 730863929 729847014 728858352 728055835 727371395 726543128 725531220 724570751
766.9 724570751 723865271 723541498 723683417 724196613 724869192 725534618 726131380 726654649 727048337 727247834
787.3 727247834 727305830 727206588 726839840 726227045 725479305 724549830 723307610 721748292 719800889 717464924
807.7 717464924 715037167 712835789 710936725 709326625 708343089 708659530 710527122 713338852 716131330
826 716131330 718263566 719657421 720429957 720694780 720721185 720786512 720916808 720851481 720406830 719634175
846.4 719634175 718536377 717197537 716009796 715341568 715295613 715822160 716665447 717512250 718221009
864.8 718221009 718675137 718786657 718558192 718071997 717448711 716725945 716040075 715648830 715497017 715257406
885.2 715257406 714721799 713861644 712660491 711088061 709326863 707707763 706565678 706183851 706465364
903.5G06465364M44591K56598M7564k04503o52254j277506j871109k027572j389563
921.9F99791610l57985K71618M54188O81340J059234J298488J147925N61953k92540
940.3G04615831j218438k009630k692878l662288m815519m955173l828406l415704
956.6F78017795m124284l375649n18143J575112J151085k06828m78924O33181K174198
974.9F74847543K962828K733231K275288K061426J767278J141012L64959l63946j019180
993.3F86770439j622915k244949l030539m036844n209803o534160p858336q837163
1009.6F47395730r331226r458304r162485q324802p249654o533324o349028o050527
1025.9E84936380m904031l195525j824140j098871p78616o98745q79228j399756k469539
$$ plain form
903.5 706465364 706909955 707166553 707214117 707009614 706357360 705079854 703208745 701181173 699791610
921.9 699791610 699433625 699705243 700159431 700840771 701900005 703198493 704346418 704908371 704615831
940.3 704615831 703397393 701387763 698694885 695032597 690217078 685261905 681433499 678017795
956.6 678017795 673893511 670517862 669999719 671574831 672725916 672519088 672040164 672673345 674847543
974.9 674847543 677810371 680543602 682818890 684880316 686647594 687788606 688153565 687789619 686770439
993.3 686770439 685147524 682902575 679872036 675835192 670625389 664091229 656232893 647395730
1009.6 647395730 638064504 628606200 619443715 611118913 603869259 597335935 590986907 584936380
1025.9 584936380 580032349 576836824 575012684 573913813 573135197 572436452 571557224 570157468 567687929
1044.3E67687929m280210o670236r144009j0823786j0307431o342888M91977P358432
1060.6E27969778J1788249J3978898J5459240J6518712J6285121J4686346J2582064
1074.9F29268408J0512590Q643270P060349N751312M692137L881156L259480K712250
1091.2F75780952K199233J751720J346112R76801P99954P69555N80728J25587l54945
1109.6F83975697n47231m40061k68161k30312k47002j6809L62158K79904m75824j376569
1129.9F81015790j816929j534283o54697K90274P03752M98712J20580M9830L42905
1148.3F79015934N98848M94898P5400m41134r95517j794815l025532m774630o757617
1166.7F62395835p670164n326212L91662N564988O922245N588114L872574K457201
$$ plain form
1044.3 567687929 563407719 556737483 547593474 536769688 526462257 520119369 520611346 527969778
1060.6 527969778 539758027 553736925 569196165 585714877 601999998 616686344 629268408
1074.9 629268408 639780998 648424268 655484617 661235929 665928066 669809222 673068702 675780952
1091.2 675780952 677980185 679731905 681078017 682054818 682854772 683624327 684205055 684330642 683975697
1109.6 683975697 683428466 682988405 682720244 682489932 682242930 682226121 682588279 682868183 682392359 681015790
1129.9 681015790 679198861 677664578 677009881 677300155 678003907 678502619 678623199 678673029 679015934
1148.3 679015934 679614782 680109680 680185080 679743946 678748429 676953614 673928082 669153452 662395835
1166.7 662395835 654725671 649399459 649791121 655356109 662278354 667866468 671739042 674196243
1183F74196243J187802O6578q36015j582145k326429l189385m107356n075693o192148
1201.3F52141452p425189q668244r946525j1471272j3601362j6719759k1183133k7332664
1217.7E35793304l4938395m2552679m7604323m7391265m1150302l1324089k1599382
1231.9B69232869j4077633q857072n212054k220273J050488N014866R257585J3608843
1248.2B67797619J8955499K5783569L1931638L4019798L1679422K7476758K3139089
1262.5D60783392J8878341J4755726J1148423Q685410P705986Q149505R825647J2065768
1278.8E51998198J3542354J3474286J2389242J1238754J0335267R287953P812441O124734
1295.2F36203229M472018K948761J640916P34210N05983J086474K194404L178001L630876
$$ plain form
1183 674196243 675384045 675450623 674614608 673032463 670706034 667516649 663409293 658333600 652141452
1201.3 652141452 644716263 636048019 626101494 614630222 601028860 584309101 563125968 535793304
1217.7 535793304 500854909 458302230 410697907 363306642 322156340 290832251 269232869
1231.9 269232869 255155236 246298164 241086110 238865837 239916325 244931191 254188776 267797619
1248.2 267797619 286753118 312536687 344468325 378488123 410167545 437644303 460783392
1262.5 460783392 479661733 494417459 505565882 514251292 521957278 530106783 539932430 551998198
1278.8 551998198 565540552 579014838 591404080 602642834 612978101 622266054 630078495 636203229
1295.2 636203229 640675247 643624008 645264924 645999134 646505117 647591591 649785995 652963996 656594872
1313.5F56594872L513396K984464K305866J679659J082360M76122j37627p13467r45330
1331.9F66840315p37548o54936j149714j477420j082063p60615r93609j748860l214061
1350.2F55021489n667687r507775j4687121k0786405k9421687m0329337m1484803k7165204
1366.6D65971470o274045J3274193K4792046K7938336K3509621J5879989Q151591P57634
1382.9E74000835m874587o403088j466036N068421Q181930R636581J1225700J2721956
1399.2F08091712J2062252R470045P417858N713939L951431K450347J424491N84424
1415.5F51166499q20220k025962j631558j758337k519071l070891l686547k702713
1431.8F32951200q82208m96447j75953N50568J3530j084447k396226m003882m766226
$$ plain form
1313.5 656594872 660108268 663092732 665398598 667078257 668160617 668636739 668499112 667785645 666840315
1331.9 666840315 666102767 665447831 664298117 662820697 661738634 660978019 659984410 658235550 655021489
1350.2 655021489 649353802 639846027 625158906 604372501 574950814 534621477 493136674 465971470
1366.6 465971470 459697425 472971618 497763664 525702000 549211621 565091610 573243201 574000835
1382.9 574000835 569126248 562723160 561257124 566325545 574507475 584144056 595369756 608091712
1399.2 608091712 620153964 629624009 637041867 642755806 646707237 649157584 650582075 651166499
1415.5 651166499 650346279 648320317 646688759 644930422 642411351 639340460 635653913 632951200
1431.8 632951200 632068992 631572545 631396592 631947160 631960690 630876243 628480017 624476135 619709909
1450.2F19709909m800499n332469q612454j1101664p594227o287813o698013l527999
1466.5E65754771J395881M695535Q694708J1640311J1378944J0737478J0531843J0005534
1482.8F34835005Q279502O195188M531622L955483L623963K401828J030565Q90076
1499.1F65743232J554608J635254n0903k079964J38104J597167J189410N20528L14474
1517.5F70561910K37405l47853O7294M81009M68612Q62539L57628l64244O42061O70016
1537.9F73636377j415014j290679N52415J172245J084626O88672O08802P86900N39661
1556.2F76364005j686871j564920J608669J521051P41005j19k23458P48575K61068
1574.6F77769005r69827j2517O82116K20358k7239p0274j59264j90139j82330j74344
$$ plain form
1450.2 619709909 614909410 609576941 600964487 589862823 582268596 575980783 569282770 565754771
1466.5 565754771 567150652 571846187 580540895 592181206 603560150 614297628 624829471 634835005
1482.8 634835005 643114507 649309695 653841317 657796800 661420763 663822591 664853156 665743232
1499.1 665743232 667297840 668933094 668882191 666802227 666940331 668537498 669726908 670247436 670561910
1517.5 670561910 670799315 670451462 670518756 670999765 671468377 672330916 672688544 672324300 672966361 673636377
1537.9 673636377 672221363 670930684 671483099 672655344 673739970 674428642 675037444 675824344 676364005
1556.2 676364005 674677134 673112214 674720883 676241934 676982939 676982820 676759362 677507937 677769005
1574.6 677769005 676799178 676786661 677468777 677689135 677661896 677591622 677432358 677242219 677059889 676885545
1595F76885545o9916L3855m6908j06693j22010k17081l08156k0206K43724o51539j319646
1617.4F74300969J50203M64619m24207k56300l7074J09971O37531q8811j887262j032233
1637.8F71937406M26233M14133r5487j594424j355290N05507j295209l117025O66559
1656.2F66492403J685380O40154l31163m0948O40451l53455j021326j92165n21123
1674.5F66998208q41797N6982J55211j430631l153563j327633l71576q87871r75310
1692.9F58222020k451182l407597l447473l568769j576304j785755l479660m039824
1709.2F34465456m824042o486416r531319j4464498j4767587j2309849j3991952j6691745
1725.5E41398048j8762052k2399902k7874351m2045772m7218352l5322100l0620307
$$ plain form
1595 676885545 676815629 676849484 676802576 676695883 676573873 676356792 676048636 676028430 676272154 675620615 674300969
1617.4 674300969 674451172 674915791 674491584 674235284 674198210 674308181 674945712 674856901 672969639 671937406
1637.8 671937406 672363639 672777772 672682285 671087861 669732571 670238078 668942869 665825844 666492403
1656.2 666492403 668177783 668817937 668486774 668445826 669086277 668732822 667711496 667519331 666998208
1674.5 666998208 666156411 666213393 666368604 664937973 661784410 660456777 660085201 659197330 658222020
1692.9 658222020 655770838 652363241 648915768 645346999 643770695 641984940 638505280 634465456
1709.2 634465456 629641414 623154998 613623679 599159181 584391594 572081745 558089793 541398048
1725.5 541398048 522635996 500236094 472361743 430315971 383097619 347775519 317155212
1739.8C17155212k2768318q831412L385633J5011072K6950956L1983733K4685144J5239775
1756.1D02811795Q978397O258816P384836R038419J1273235J7061293K4850398L1910301
1772.4E19567490L0177295K2759735J8322587J5400589J2064934R098828O998837N291044
1788.8F39681339L700257K933502K968907K629280J935482J525760J744807J826346
1805.1F58945680J610279J203716R47892J006663R75192P43270O90758O87063K97963
1823.4F67108476R2983J79351n8294J06216O25968M52757L01599N77748L74198m02331
1843.8F69358671j78099N83172N31256L32058J98602R1613l6002o4849L8921J74225
1864.2F71029568p1466o40571l22521L89874L80933J30236J31429J92105K45989L24666
$$ plain form
1739.8 317155212 294386894 285555482 288941115 303952187 330903143 362886876 387572020 402811795
1756.1 402811795 411790192 418049008 425433844 434472263 445745498 462806791 487657189 519567490
1772.4 519567490 549744785 572504520 590827107 606227696 618292630 627391458 634390295 639681339
1788.8 639681339 643381596 646315098 649284005 651913285 653848767 655374527 657119334 658945680
1805.1 658945680 660555959 661759675 662707567 663714230 664689422 665432692 666123450 666810513 667108476
1823.4 667108476 667201459 667380810 667322516 667428732 668054700 668507457 668809056 669386804 669761002 669358671
1843.8 669358671 669180572 669763744 670295000 670627058 670825660 670917273 670881271 670816422 670855343 671029568
1864.2 671029568 670958102 670317531 669995010 670384884 670765817 670896053 671027482 671219587 671465576 671790242
1884.6F71790242L08633M1664P3313L56555K21610J46747K21491J62780P4625O1155
1905F73458815m7326j86384p3970J85311J52946k17200j73747L1292n5313M5061J47581
1927.5F73267066K3604n1320l0696O795O9260M5538j32739q2910J70052K04444J83761
1949.9F73672855J42395O3003M1961J5080N007O3360O1571p4744j06692r775K5570
1972.3F73899591J1146q583n0366q3208n8472l7492p1525j35601k61664k78950o6638
1994.8F72858238K3604o7890j17421r6977n6863k9504j2457L8027Q5473L8803r716
2017.2F72653317K1339N2333O5446N7518Q047l0875n0307n1558m6551p2837q5413m2975
2041.7F72477484J2159K8133K0504m887o6817r9301q2731r1076j17839j32918j30057
$$ plain form
1884.6 671790242 672098875 672140539 672213852 672570407 672792017 672938764 673160255 673323035 673397660 673458815
1905 673458815 673411489 673225105 673151135 673336446 673489392 673272192 673098445 673129737 673074424 673119485 673267066
1927.5 673267066 673290670 673239350 673208654 673215449 673284709 673330247 673197508 673114598 673284650 673489094 673672855
1949.9 673672855 673815250 673878253 673920214 673935294 673940301 674003661 674065232 673990488 673883796 673874021 673899591
1972.3 673899591 673910737 673902154 673851788 673768580 673710108 673672616 673601091 673465490 673203826 672924876 672858238
1994.8 672858238 672881842 672813952 672696531 672599554 672542691 672513187 672500730 672538757 672624230 672663033 672653317
2017.2 672653317 672674656 672726989 672792435 672849953 672858000 672827125 672776818 672725260 672678709 672605872 672520459 672477484
2041.7 672477484 672489643 672517776 672538280 672533393 672466576 672367275 672284544 672193468 672075629 671942711 671812654
2064.1F71812654r6739m4167j7702l2843j9073K3246J2159n066L5345P5758J27792
2086.6F71871364J85013J81436J52052J23620R8526R4951P0691L4928L9995K7716j9968
2109F72860324k1278M2319P4088j132j27077j75715j51574j55449j79410j62184j15872
2131.4F71887040j38104j92702j66893r0599o9141q0884n2511j6570N543O199K1100
2153.9F71112478O9558P9513K8729P630M8578P2658L9100P75J6391M0949M4048N1140
2178.3F71611547N6267N4658P3135N6922k2590q2135p9096n0246l2545k205K9743M7326
2202.8F71660781L6895J2100k027q463j7345l0995l0041k8669k9266k5630o974J8179
2227.3F71548545J8001k9326p8797p7605p4208q3208o0856k9564m2677m5121j6808
$$ plain form
2064.1 671812654 671715915 671671748 671654046 671621203 671602130 671625376 671637535 671632469 671667814 671743572 671871364
2086.6 671871364 672056377 672237813 672389865 672513485 672612011 672706962 672777653 672812581 672852576 672880292 672860324
2109 672860324 672839046 672881365 672955453 672954321 672827244 672651529 672499955 672344506 672165096 672002912 671887040
2131.4 671887040 671748936 671556234 671389341 671298742 671229601 671148717 671096206 671079636 671085179 671091378 671112478
2153.9 671112478 671182036 671261549 671290278 671297908 671346486 671419144 671458244 671459019 671475410 671516359 671560407 671611547
2178.3 671611547 671667814 671722472 671795607 671852529 671829939 671747804 671668708 671618462 671585917 671583712 671613455 671660781
2202.8 671660781 671697676 671709776 671707749 671699286 671681941 671650946 671620905 671592236 671562970 671537340 671530366 671548545
2227.3 671548545 671566546 671537220 671458423 671380818 671306610 671223402 671162546 671132982 671090305 671045184 671028376
2249.7F71028376k5750o7591p8500o0379n1498m7923m5657k3186j967k0683n0962m4465
2274.2F70509815n7757j21534j21593o0916l3140j8776M2379R9659J16110J41203J53125
2296.6F70648575J68681K13444K54154L06845L42727L51548L45647K60830K23041L59416
2317F73474908M45187L42131K46405K90692L28004K41340J72972K09451J77562J14322
2337.4F76042974J26243r5904q16047j096845K9266J138329J221538P20680K83002
2355.8F77553236k8252l25859n50270p90536j013100j040161r45866q69751q18729
2374.1F71170712p75397p35164o29783m68790l21031k11954j46866j05977p2241o5863
2394.5F67637646q2373p7904n5194k9683k6524m4167m1306j7524J4127N6505R3102
$$ plain form
2249.7 671028376 671002626 670935035 670856535 670796156 670744658 670696735 670651078 670627892 670625925 670605242 670554280 670509815
2274.2 670509815 670452058 670330524 670208931 670148015 670114875 670096099 670138478 670238137 670354247 670495450 670648575
2296.6 670648575 670817256 671030700 671284854 671591699 671934426 672285974 672631621 672892451 673115492 673474908
2317 673474908 673920095 674262226 674508631 674799323 675127327 675368667 675541639 675751090 675928652 676042974
2337.4 676042974 676169217 676073313 675257266 674160421 674189687 675328016 676549554 677270234 677553236
2355.8 677553236 677524984 677199125 676648855 675858319 674845219 673805058 672859192 671989441 671170712
2374.1 671170712 670395315 669660151 669030368 668561578 668240547 668028593 667881727 667775750 667703509 667637646
2394.5 667637646 667555273 667477369 667422175 667392492 667365968 667321801 667280495 667262971 667277098 667333603 667426705
2417F67426705Q1003K9683M351L5942P6890P5579M8875O9678P7546N36m5716K324O3837
2443.5F67947233N9306L5406M3451N5313M0174P272j1742m6134r3818q3208m3929n9545
2467.9F67849779j03533j19269r0539p9692r9361o5863r537L040l636j2100m291L9458
2492.4F67304456O7830K3127m5478m6730m3273p3851q2790r4235r6858n4538k861m590
2516.9F66850209l1054k5689q703m887P15j4245q6844j42754j13070m7624k1100k5689
2541.4F66329265m6850j10566j55032j31905j16169j08600p3433o4671r0540j40190
2561.8F65291309j86026j79410j54674j61290j57654j27137j46925j99318j96755j44422
2582.2F63637698j05083j47343k26915k18868k06709k74181k93434k26617j36256q8096
$$ plain form
2417 667426705 667507708 667537391 667541742 667577684 667654574 667730153 667779028 667848706 667926252 667926788 667881072 667883396 667947233
2443.5 667947233 668006539 668041945 668085396 668140709 668180883 668188155 668176413 668130279 668036461 667953253 667909324 667849779
2467.9 667849779 667746246 667626977 667536438 667456746 667357385 667291522 667281985 667285025 667281389 667269289 667264998 667304456
2492.4 667304456 667372286 667395413 667349935 667303205 667259932 667186081 667103291 667009056 666912198 666857660 666854799 666850209
2516.9 666850209 666819155 666793466 666784763 666779876 666780591 666766346 666679502 666536748 666423678 666376054 666354954 666329265
2541.4 666329265 666282415 666171849 666016817 665884912 665768743 665660143 665586710 665522039 665431499 665291309
2561.8 665291309 665105283 664925873 664771199 664609909 664452255 664325118 664178193 663978875 663782120 663637698
2582.2 663637698 663532615 663385272 663158357 662939489 662732780 662458599 662165165 661938548 661802292 661714196
2602.6F61714196q6367n9485m6552o1035p748O5565K6464m8280k2709N2869M8578o1095
2627F61514401j11639m2081M77l6895j03116j85788k45690k16067j48535j25885j21653
2649.5F60177529p3731k1696M3630J29164R4950R417M5419J33455J02222K5809N9187
2671.9F60725355J20938J65343J66297j3351k83063l97503l46124k35915j58549j49250
2692.3F59594178j31786j27494j83225k20716k32458k37465j71721j14858k12431l21865
2712.7F57640159l39985m25637m74870k70128M5061K32637J11342j61946j65999J2994
2733.1F56203628J31845J78635J29104J03593K21431M14371M40777J19865k33710k49207
2753.5F57460332j18971j18613j95265k48015k27988j34945m172J46031L00408K80619
$$ plain form
2602.6 661714196 661627829 661568344 661521792 661460757 661453009 661518574 661545038 661496758 661474049 661526918 661575496 661514401
2627 661514401 661402762 661360681 661361158 661324263 661221147 661035359 660789669 660573602 660425067 660299182 660177529
2649.5 660177529 660103798 660082102 660125732 660254896 660349846 660359263 660404682 660538137 660640359 660666168 660725355
2671.9 660725355 660846293 661011636 661177933 661164582 660881519 660484016 660137892 659901977 659743428 659594178
2692.3 659594178 659462392 659334898 659151673 658930957 658698499 658461034 658289313 658174455 657962024 657640159
2712.7 657640159 657300174 656874537 656399667 656129539 656174600 656407237 656518579 656356633 656190634 656203628
2733.1 656203628 656335473 656514108 656643212 656746805 656968236 657382607 657823384 657943249 657709539 657460332
2753.5 657460332 657341361 657222748 657027483 656779468 656551480 656416535 656412363 656558394 656858802 657139421
2773.9F57139421j03951m51028m04358l20912l43263j25468J62363l5822m39405m30823
2794.3F54646754j91211k98799p40587r12428p22170m76956l05295n18740r39726r47833
2814.7F48593009p00772n59688n14984n83291p69854r37998r94444j026451j183451
2833F41322076j486063j846730k613485l549934l489792k690017k429843k662122k542735
2851.4F18011355k386927k960384m041433n565823p714033r869516j1597514j2718856
2867.7E61156869j2032867q994936n424679k597391J24871K539933L797829L982067
2884E42551696L511072K606749J309812k7895j100123k293229l558040m107296m041791
2902.4E34850955m057348l985405l337502k435744k265632l132761m127741m510223
$$ plain form
2773.9 657139421 657035470 656584442 656180084 655859172 655515909 655390441 655552804 655516982 655077577 654646754
2794.3 654646754 654455543 654156744 653416157 652503729 651781559 651304603 650999308 650480568 649540842 648593009
2814.7 648593009 647892237 647332549 646817565 646234274 645464420 644526422 643531978 642505527 641322076
2833 641322076 639836013 637989283 635375798 631825864 628336072 625646055 623216212 620554090 618011355
2851.4 618011355 615624428 612664044 608622611 603056788 595342755 585473239 573875725 561156869
2867.7 561156869 549124002 540129066 534704387 532106996 532231867 534771800 538569629 542551696
2884 542551696 546062768 548669517 549979329 549951434 548851311 546558082 543000042 538892746 534850955
2902.4 534850955 530793607 526808202 523470700 521034956 518769324 515636563 511508822 506998599
2918.7E06998599m575611m655689m815638m726141m150808l694594l190428k146572
2935D75043118j099944l67284J94818k42859k885968p396728j1932760j5084356j7219633
2953.4D19008404j8193066j6716123j2909382p999420k913654K446204Q457899J4306277
2969.7C85487139J8973053K2110015K3922711K5117636K5013864K2203148J7968535
2984E40796101J4559209J2360812J1054456R784937P959783O592333N621851M427075
3000.3F13156557L762186L461778L039300L054977L351569K872646J615822O02186
3016.6F34917021J80244J32680M54068P31707N90742O90102J152337J350462Q22187
3034.9F41021550Q4042N21541J347303R85444K9564l29256J89006O02126L06547J1086
$$ plain form
2918.7 506998599 502422988 497767299 492951661 488225520 484074712 480380118 477189690 475043118
2935 475043118 473943174 473575890 473770708 473527849 470641881 463245153 451312393 436228037 419008404
2953.4 419008404 400815338 384099215 371189833 363190413 360276759 362722963 371180862 385487139
2969.7 385487139 404460192 426570207 450492918 475610554 500624418 522827566 540796101
2984 540796101 555355310 567716122 578770578 588555515 596515298 603107631 608729482 613156557
3000.3 613156557 616918743 620380521 623419821 626474798 629826367 632699013 634314835 634917021
3016.6 634917021 635097265 635229945 635684013 636415720 637006462 637696564 638848901 640199363 641021550
3034.9 641021550 641105592 641627133 642974436 643959880 643989444 643660188 643849194 644451320 644757867 644768953
3055.3F44768953j67071k65360J22964P15673R98318N58913k88308m53055K30849J180172
3075.7F47402048J528621P31408p0452j32084k34783k12550j5974m16160p19726j52588
3096.1F47707760N50866M16339k93553k84314N46098Q25703J37388N0545R72986J190186
3116.5F51820004M09365o41466j466095j290977l01421L73304R5248l97264p6354P48575
3136.9F49272919P90715k85983r87590o01172O0O10530J020610K77341r29773j057148
3157.3F48110509m84288j40846q4996j07825j05321j14024j03831q1897r0658n7102
3177.7F46739721k1934n3168n7876M5181J52111N5194j12355j16646k8074O7055J38283
3200.1F46807492J47700J40607J17720L8385M9829J37985J48237J80364K09272L5703
$$ plain form
3055.3 644768953 644601882 644336522 644459486 645175159 646173477 646732390 646444082 645991027 646221876 647402048
3075.7 647402048 648930669 649662077 649591625 649459541 649224758 649012208 648996234 648580074 647860348 647707760
3096.1 647707760 648258626 648674965 648381412 648097098 648643196 649468899 649606287 649656832 650629818 651820004
3116.5 651820004 652229369 651587903 650121808 648830831 648529410 648902714 648997962 648600698 648524344 649272919
3136.9 649272919 650063634 649777651 648790061 648188889 648188949 648799479 649820089 650097430 649167657 648110509
3157.3 648110509 647626221 647485375 647400379 647292554 647187233 647073209 646969378 646887481 646796823 646739721
3177.7 646739721 646717787 646664619 646606743 646651924 646804035 646859229 646746874 646630228 646602154 646669209 646807492
3200.1 646807492 646955192 647095799 647213519 647251904 647301733 647439718 647587955 647768319 647977591 648013294
3220.5F48013294j18315j6869J19687L11136Q80003J126408N1558j047432q15690j84595
3240.9F48319185K73704Q03769O44803l87311p90179j28746L49641r4354n44608k97427
3261.3F48148477j907J74582P82370J422048P42316o09755j052499q83281n10514j33634
3281.7F48078203n0962l1352K72811R38654J177072M72188m64439j008570o76454N89967
3302.1F49297118J623213J158178m59671j640141j577258q31544k95758q4818J05024
3320.5F47294343M55856O63102L993q16464o71089j20580M23372J032054P12514l15905
3340.9F48661196o81638o35565k09033P15553M92454q17716j084924k19405L97385
3359.2F46618307K17378J02699Q89360J421571M17054j196504j464724m56393P7546
$$ plain form
3220.5 648013294 647894979 647878110 647997797 648308933 649188936 650315344 650366902 649319470 648503780 648319185
3240.9 648319185 648592889 649396658 650041461 649654150 648863971 648735225 649084866 648990512 648445904 648148477
3261.3 648148477 648146570 648321152 649103522 650525570 651267886 650658131 649605632 648722351 648211837 648078203
3281.7 648078203 648027241 647995889 648268700 649207354 650384426 650856614 650392175 649383605 648707151 649297118
3302.1 649297118 650920331 652078509 651618838 649978697 648401439 647569895 647274137 647189319 647294343
3320.5 647294343 647750199 648413301 648417294 647600830 646929741 646809161 647232533 648264587 648977101 648661196
3340.9 648661196 647979558 647343993 647134960 647850513 648342967 647525251 646440327 646220922 646618307
3359.2 646618307 646835685 646938384 647827744 649249315 649666369 648469865 647005141 646548748 646626294
3377.6F46626294q6248l24965m49657j75774O06417J412630J011551l95954o88791
3395.9F47535503N45323J174211j76251j591444j057386J48356L98576k5034n65231
3414.3F46386623p91669m10795j19865k24590o4671M40240P25627M29332K08318L72827
3434.7F46951377j06752j119732j344681p29978k87712l40104m68969m77970m17948
3453.1F41657531l42905j28866J30773k0742p9692N04494R50217N41687j64389j64271
3473.4F42883837L88444P33673N28217L5524L3140L12686J28091j39833r5367p4208
3493.8F44734204j41978k17021l43144n18262p00474p26402n73575j38343M97282N60343
3514.2F42432630M3094j33455J57953L43382J1444n38528n30958r5189K10643L06666
$$ plain form
3377.6 646626294 646540046 646215081 645765424 645589650 646196067 647608697 648620248 648224294 647535503
3395.9 647535503 648080826 649255037 649078786 647487342 646429956 646578312 646976888 646951854 646386623
3414.3 646386623 645594954 645184159 645064294 644839704 644775033 645215273 645940900 646370232 646578550 646951377
3434.7 646951377 646844625 645724893 644380212 643650234 643362522 643022418 642553449 642075479 641657531
3453.1 641657531 641314626 641185760 641316533 641295791 641216099 641720593 642670810 643212497 643048108 642883837
3473.4 642883837 643272281 644005954 644534171 644569695 644602835 644915521 645043612 644903779 644808412 644734204
3493.8 644734204 644592226 644375205 644032061 643513799 642813325 642086923 641513348 641375005 641872287 642432630
3514.2 642432630 642475724 642342269 642500222 642843604 642855048 642316520 641785562 641690373 641901016 642207682
3534.6F42207682P0453j76847J36971L70503l01361j067043q39531m31061m54247k92361
3555F39223158L6478K89262M41909j10269j352787j286209N97775J142562L43621M231
3575.4F39329731J44482N75304J245976J248598l80397j889050m30405Q42213L0160
3593.8F40716612j66356O31988N75304L11851L87967n33104j478553p85172N5611N11527
3614.2F40227675L17455p12574o7055J435578J116633j096248l250599r87470J551032
3632.5F38534427J130461M60387Q9228P6175M89056K24650j490891k409459J07408
3650.9F37211442J559079L45885L58344J453280N52535m68552k0087m36842j706004
3669.2F38849080m36366K0981j770973k08259J754463J613915J533329J148164l05533
$$ plain form
3534.6 642207682 642278135 642101288 642238259 642608762 642307401 641240358 640400827 639969766 639515519 639223158
3555 639223158 639259636 639548898 639990807 639880538 638527751 637241542 637839317 638981879 639325500 639329731
3575.4 639329731 639474213 640049517 641295493 642544091 642163694 640274644 639844239 640686452 640716612
3593.8 640716612 640550256 641182244 641757548 642069399 642457366 641924262 640445709 639660537 639716148 640227675
3614.2 640227675 640545130 639832556 639765501 641201079 642317712 641221464 637970865 636983395 638534427
3632.5 638534427 639664888 640125275 640214503 640290678 640779734 641004384 639513493 637104034 637211442
3650.9 637211442 638770521 639116406 639474750 640928030 641480565 641012013 640991926 640555084 638849080
3669.2 638849080 638412714 638433695 636662722 636454463 638208926 639822841 641356170 642504334 642198801
3687.6F42198801j686633q25643P12335R78231L49820n18322o41942N29349R85622
3706F42081618k08795j937747j594305R67264J641512N93305k32518m32849n25892
3724.3F40351593r3996Q41975N35071r47356j670957j5855K062381J179099k202451
3742.7F40039504l031075M33981Q0943j780569N96642K329707R92000k93672K84493
3761F39651954O59347M3988m08947p08402n1498R81688Q75414P2002m76360l68416
3781.4F40270770l59953l18467J86622N30362M30524j70648n38349k25902j034498
3799.8F38770461j242161M45783j9550k17378J388490J284242n71489j236797k96295
3818.1F38305306j099050p49409J063168Q83341M12822R9599N3764K86281q64923j824498
$$ plain form
3687.6 642198801 640512168 639686525 640398860 641377091 641726911 641208589 640566647 641095996 642081618
3706 642081618 641872823 639935076 638340771 639308035 640949547 641542852 641310334 640877485 640351593
3724.3 640351593 640257597 641099572 641634643 640687287 639016330 639000475 641062856 642241955 640039504
3742.7 640039504 637008429 637442410 637523353 635742784 636339426 638669133 639661133 639367461 639651954
3761 639651954 640311301 640355289 639946342 639237940 639186442 640168130 641043544 641115546 640639186 640270770
3781.4 640270770 639910817 639592350 639778972 640309334 640739858 640569210 640030861 639804959 638770461
3799.8 638770461 637528300 637974083 637954533 637737155 639125645 640409887 639838398 638601601 638305306
3818.1 638305306 637206256 636456847 637520015 638403356 638816178 638915777 638969541 639255822 638390899 636566401
3838.5F36566401m58658P88510J293063J540184Q73208j736164n038917j664043L256798
3856.9F35420382K498209L72351q17061k49028J10030j073718p79211N34296R95874
3875.2F37012124O89685n10871k58029M81248p4744O4135k29836o79850N55634J015723
3895.6F38065219k82466j340271j433789q52168O58214J578212J069903L70682j49608
3914F37683928p14362o51121O2049J85310j31428J81854L20017k98202l21924L50117
3934.4F36666238L98398j9670m10139m81546n722P3492k70784r5606K66493K12431
3954.8F36333585k9326j54555j42395K3603J39118j5498j84953j69635j40071p9929
3975.2F35579944j3709l5406J01507K76804M3869l41594l36945j07467j2756R477N9367
$$ plain form
3838.5 636566401 636107743 636896253 638189316 639729500 640602708 638866544 633827627 632163584 635420382
3856.9 635420382 637918591 638290942 637473881 637224853 637334883 636261165 635481954 636016250 637012124
3875.2 637012124 637701809 637190938 636932909 637414157 637339413 637403548 637173712 636493862 637049496 638065219
3895.6 638065219 637782753 636442482 635008693 634156525 634814739 636392951 637462854 637833536 637683928
3914 637683928 636969566 636318445 636380494 636565804 636434376 636616230 636936247 636638045 636316121 636666238
3934.4 636666238 637064636 637044966 636634827 636153281 636147559 636221051 635950267 635854661 636121154 636333585
3954.8 636333585 636304259 636149704 636007309 636030912 636170030 636154532 635969579 635799944 635659873 635579944
3975.2 635579944 635566235 635530829 635632336 635909140 635953009 635611415 635274470 635167003 635154247 635163724 635223091
3997.6F35223091
$$ plain form
3997.6 635223091
##END=$$ End of the data block
