##TITLE=Acetato de isoamila - Grupo 5 $$ Begin of the data block
##JCAMP-DX=5.00 $$ ACD/SpecManager v 10.08
##SPECTROMETER/DATA SYSTEM=Alpha
##DATE=22 Oct 2014 14:05:46
##DATA TYPE=INFRARED SPECTRUM
##DATA CLASS=XYDATA
##ORIGIN=
##OWNER=
##NPOINTS=1667
##FIRSTX=599.64648438
##LASTX=3997.64306641
##MAXX=3997.64306641
##MINX=599.64648438
##MAXY=0.74471152
##MINY=0.20078653
##XFACTOR=1.0000000000
##YFACTOR=1.000000000000000e-9
##FIRSTY=0.64527363
##DELTAX=2.03961372
##XUNITS=1/CM
##YUNITS=ARBITRARY UNITS
##XYDATA=(X++(Y..Y))
599.6F45273626o927490r994150r144246l590584K150118M621625M594744M141390
$$ 645273626 638346136 628351986 619207740 615617156 617767274 622388899 626983643 631125033
616F31125033M322588M871190N193233N154610M515171L124595J005351q90195r40740
$$ 631125033 635447621 640318811 645512044 650666654 655181825 658306420 659311771 658421576 657480836
634.3F57480836J308739L749192M461527M444360N045057N888521N829871N093277
$$ 657480836 658789575 662538767 667000294 671444654 676489711 682378232 688208103 693301380
650.6F93301380M691243M723787M544437M106581L740967L614127L521502K757013
$$ 693301380 697992623 702716410 707260847 711367428 715108395 718722522 722244024 725001037
667G25001037J553953J768648K069354J693726J313090J056910R40323R40621P90179
$$ 725001037 726554990 728323638 730392992 732086718 733399808 734456718 735397041 736337662 737127841
685.3G37127841O47485O88433O50227M62294M95315N66780M01795K89560L85344M83691
$$ 737127841 737775326 738463759 739113986 739576280 740071595 740638375 741040170 741329730 741715074 742198765
705.7G42198765M41015K98858K19643L07381K34425j40071k42054J73688M05669K45392
$$ 742198765 742639780 742938638 743158281 743465662 743700087 743560016 743317962 743491650 743897319 744142711
726.1G44142711O9976m768P75O0915K00630K16186K5093j40190k07186l11315m96685
$$ 744142711 744212687 744207919 744208694 744269609 744470239 744686425 744711518 744571328 744364142 744052827 743556142
748.5G43556142o87778q35240q89182q67248p79032o78957o61433p49826q30412o87003
$$ 743556142 742868364 742033124 741143942 740276694 739497662 738818705 738157272 737407446 736577034 735890031
768.9G35890031k40505K75076N30242O51777Q53181R12786P16805M75824L58462K65956
$$ 735890031 735649526 735924602 736454844 737106621 737959802 738872588 739589393 740065217 740423679 740689635
789.3G40689635m3213m12405n50508o19710q28325j133323j525402k013683k459825
$$ 740689635 740646422 740234017 739683509 739063799 738235474 737102151 735576749 733563066 731103241
807.7G31103241k629041k359867j856804j473069r59456L10421J986682K986431K975762
$$ 731103241 728474200 726114333 724257529 722784460 721825004 722135425 724122107 727108538 730084300
826G30084300K396584J732170J064956M12763J40905K61545K91169L5405l34859o71565
$$ 730084300 732480884 734213054 735278010 735690773 735831678 736093223 736384392 736419797 736084938 735413373
846.4G35413373j027644j303733j183092o52731O2943O98984R67681R27746Q16107
$$ 735413373 734385729 733081996 731898904 731246173 731309116 732008100 732975781 733903527 734719634
864.8G34719634O23405K72870k27630o02067o40690n85794n02169k55287j03355k41875
$$ 734719634 735343039 735615909 735388279 734786212 734145522 733559728 733057559 732802272 732698917 732457042
885.2G32457042m65870p39992j165807j582027j774609j657366j108110k70963L73661
$$ 732457042 731991172 731251180 730085373 728503346 726728737 725071371 723963261 723692298 724065959
903.5G24065959N78225M33445J00136k88785p12931j281142j911700k109349j481652
$$ 724065959 724644184 725077629 725177765 724888980 724176049 722894907 720983207 718873858 717392206
921.9G17392206m71234K16186N50687R03189J334131J521647J276314O65725j73986
$$ 717392206 716920972 717137158 717687845 718591034 719925165 721446812 722723126 723388851 723214865
940.3G23214865j126468j985670k722263l830254n207479n406141m184366l734827
$$ 723214865 722088397 720102727 717380464 713550210 708342731 702936590 698752224 695017397
956.6F95017397m435956l565431n25295J684129J312911l8922l44872P72595K356649
$$ 695017397 690581441 687016010 686490715 688174844 689487755 689448833 689103961 689876556 692233205
974.9F92233205L183365K978205K503097K296091K045035J393199M87029m07099j170099
$$ 692233205 695416570 698394775 700897872 703193963 705238998 706632197 707119226 706712127 705542028
993.3G05542028j838446k486646l282428m432618n823791p237614q613169r744584
$$ 705542028 703703582 701216936 697934508 693501890 687678099 680440485 671827316 662082732
1009.6F62082732j0374785j0485768j0070741r126187q000254p278443p014572o505728
$$ 662082732 651707947 641222179 631151438 622025251 614024997 606746554 599731982 593226254
1025.9E93226254n180240l390252j942992j157403q81196q88288j085817j589120k711057
$$ 593226254 588046014 584655762 582712770 581555367 580674171 579785883 578700066 577110946 574399889
1044.3E74399889m731060p417440j0150254j2044012j1563540p305980N3287P503271
$$ 574399889 569668829 562251389 552101135 540057123 528493583 521187603 521240890 528744161
1060.6E28744161J2448013J5053153J6876578J8150032J8041015J6478478J4187873
$$ 528744161 541192174 556245327 573121905 591271937 609312952 625791430 639979303
1074.9F39979303J1856258R799540Q084059O680607N482436M466712L676772L100515
$$ 639979303 651835561 661635101 669719160 676399767 681882203 686348915 690025687 693126202
1091.2F93126202K580165K055049J629234J279831J033187Q73446O30796K10345l02434
$$ 693126202 695706367 697761416 699390650 700670481 701703668 702577114 703207910 703418255 703115821
1109.6G03115821o06656n06044k73883k74420l22163l7908L35633K04683n41091j456201
$$ 703115821 702509165 702003121 701729238 701454818 701132655 701094747 701430380 701635063 701093972 699637771
1129.9F99637771j963616j684546p26402K71201O70970M21702L6180L7194L89099O38604
$$ 699637771 697674155 695989609 695263207 695534408 696205378 696627080 696663260 696700454 697089553 697728157
1150.3F97728157M99845N0366n28932j218021k140164l489674n431950p591903q441269
$$ 697728157 698228002 698278368 697749436 696531415 694391251 690901577 685469627 677877724 669436455
1168.7F69436455n733431M24266N877435P298291N971134M260957K718508J239837
$$ 669436455 663703024 664127290 670004725 677303016 683274150 687535107 690253615 691493452
1185F91493452m8519j064062j923442k760291l656745m687369n880057p180989q532643
$$ 691493452 691444933 690380871 688457429 685697138 682040393 677353024 671472967 664291978 655759335
1203.4F55759335r848059j1172771j2874782j5352249j8860102k3814380l0714989
$$ 655759335 645911276 634738505 621863723 606511474 587651372 563836992 533122003
1217.7E33122003l9327145m8046231n3931743n3734958m6461761l5017699k3796931
$$ 533122003 493794858 445748627 391816884 338081926 291620165 256602466 232805535
1231.9B32805535j5212893r340406n339160k126545J335889N607694J0386810J5447632
$$ 232805535 217592642 208252236 202913076 200786531 202122420 207730114 218116924 233564556
1248.2B33564556K1724462K9729396L6889643L9303869L6547452L1509310K6228636
$$ 233564556 255289018 285018414 321908057 361211926 397759378 429268688 455497324
1262.5D55497324K1119357J6315877J2227118R525359Q524000R088815J0903597J3197302
$$ 455497324 476616681 492932558 505159676 514685035 523209035 532297850 543201447 556398749
1278.8E56398749J4694214J4654458J3546109J2355149J1421144J0277211Q632243
$$ 556398749 571092963 585747421 599293530 611648679 623069823 633347034 641979277
1293.1F41979277O768346M972637L310322J877070Q77321N80966J193643K359688L290713
$$ 641979277 648747623 653720260 657030582 658907652 659784973 660365939 661559582 663919270 667209983
1311.5F67209983L721058L639519L081859K425015J866996J221001N03659k06470q56519
$$ 667209983 670931041 674570560 677652419 680077434 681944430 683165431 683669090 683462620 682606101
1329.8F82606101j132011j002551j063168j607894j686097j014292p66992j202703
$$ 682606101 681474090 680471539 679408371 677800477 676114380 675100088 674333096 673130393
1346.2F73130393k064884l635883o295145j0441184j6045034k2842586l2561004m4508993
$$ 673130393 671065509 667429626 661134481 650693297 634648263 611805677 579244673 534735680
1362.5E34735680m5486063k9742628p085532J3957947K6264638L0041605K6036859
$$ 534735680 489249617 459506989 452421457 466379404 492644042 522685647 548722506
1376.7E48722506J8217027R871483J604855m917145o802321j432478N424142Q389473
$$ 548722506 566939533 576811016 578415871 573498726 566696405 565263927 570688069 579077542
1393.1E79077542R843111J1824369J3837457J3337910J0417521Q269072O631374M553080
$$ 579077542 588920653 600745022 614582479 627920389 638337910 646606982 653238356 657791436
1409.4F57791436K706289J479089K99275j397431k235830j380682j643240k520084
$$ 657791436 660497725 661976814 662276089 660878658 658642828 657262146 655618906 653098822
1425.7F53098822l196895l987730k958417j242995r92239j44779R42707J09911j339853
$$ 653098822 649901927 645914197 642955780 641712785 640720546 640575767 641518474 641628385 640288532
1444.1F40288532k910972m530072n067945n218684o330252j0152876j1722327p130205
$$ 640288532 637377560 632847488 627779543 622560859 616230607 606077731 594355404 587225199
1460.4E87225199o270826p167339l678561J387537M257023Q306325J2165427J2469172
$$ 587225199 580954373 573787034 570108473 571496010 575753033 584059358 596224785 608693957
1476.7F08693957J1795283J1365533J0603547Q468330N903422M319609M549086M386246
$$ 608693957 620489240 631854773 642458320 650926650 656830072 661149681 665698767 670085013
1493F70085013K467811P64132J150012J970291J350641j515567l454388Q74579K692759
$$ 670085013 672552824 673316956 674466968 676437259 677787900 676272333 672817945 673692524 676385283
1511.4F76385283J522184J52707k30134k57134o44207M16398R89914R16004J168013
$$ 676385283 677907467 678060174 677830040 677572906 676928699 677345097 678335011 679251015 680419028
1529.7F80419028J25885o74784O05344q4877k837360j281797J672148K197564J558721
$$ 680419028 680544913 679870129 680475473 680390596 677553236 676271439 677943587 680141151 681699872
1548.1F81699872O52611L94702K97249m79699k815961p63774L044009K044201O50704
$$ 681699872 682352483 682747185 683044434 682564735 679748774 678985000 682029009 684073210 684723914
1566.4F84723914l36349k40565J002550M4644j231372M15623J100838L31581j5736
$$ 684723914 684387565 684147000 685149550 685194194 683962822 684378445 685479283 685810864 685795128
1584.8F85795128r7334k09153k59042l14056l13104j18255J0490j57952k30491j81496
$$ 685795128 685697794 685488641 685229599 684915543 684602439 684484184 684494674 684336722 684106231 683924735
1605.2F83924735k85805l69012m7565N603j195430j520038M14312L86596o71983j63555
$$ 683924735 683638930 683269918 683222353 683227956 682032526 680512488 680926800 681313396 680641413 680477858
1625.6F80477858J63197K98023N61655q29101k679586o35743J174032N92053o83903
$$ 680477858 680641055 680939078 681500733 680671632 677992046 677356303 678530335 679122388 678438485
1643.9F78438485k646864j729190N33283j922667l031910J947522K370894N31972o59824
$$ 678438485 675791621 674062431 674595714 672673047 669641137 671588659 673959553 674491525 673831701
1662.3F73831701l8266N40137r31084j355231n2809m51088o80030J62185k90215k365530
$$ 673831701 673793435 674333572 673402488 672047257 671994448 671543360 670863330 671025515 670735300 668369770
1682.7F68369770l436863n19753K80380n97715j124978l228605m230022l778458l300130
$$ 668369770 664932907 664413154 664693534 664095819 662970841 659742236 655512214 651733756 648433626
1701.1F48433626j098275j497984k985716l426969m589856o730855r921073j4208436
$$ 648433626 647335351 645837367 642851651 639424682 634834826 628103971 618182898 603974462
1717.4F03974462j3650537j1476457j3941586j7430604k0401656k5027931l1743944
$$ 603974462 590323925 578847468 564905882 547475278 527073622 502045691 470301747
1731.7D70301747m8733145n5419296m2616367l8418531k9073030j1141509M608512
$$ 470301747 421568602 366149306 323532939 285114408 256041378 244899869 249508381
1745.9B49508381J8941939L2390803L6560655K6471614J4549226P124185M515917O305456
$$ 249508381 268450320 300841123 337401778 363873392 378422618 385546803 390062720 396368176
1762.2C96368176Q735060J1586011J8313885K7640372L6585421L5367280K6905775
$$ 396368176 405103236 416689247 435003132 462643504 499228925 534596205 561501980
1776.5E61501980K1585524J8138587J4286220J0797441Q257092N992412L910542L233611
$$ 561501980 583087504 601226091 615512311 626309752 634566844 640559256 644469798 647703409
1792.8F47703409L591418L147185K209366J756251K129733K200961J735628J141667
$$ 647703409 651294827 654442012 656651378 658407629 660537362 662738323 664473951 665615618
1809.2F65615618J017928J289428J224577Q44061P09534O06656P1705o5506Q3447j40727
$$ 665615618 666633546 667922974 669147551 669991612 670701146 671307802 671379507 671314001 671397448 671256721
1829.6F71256721L46184R67324N69522L22044N26249J06216o73175l1293R55701P87139
$$ 671256721 671602905 672570229 673139751 673461795 673988044 674094260 673421085 673389792 674345493 675132632
1850F75132632M30882K13087Q2016n4002n0545Q0884O3061m77015r99988j44898Q08715
$$ 675132632 675563514 675776601 675858617 675804615 675754070 675834954 675898015 675421000 674421012 674276114 675084829
1872.4F75084829N93365J59919J41203K12252K42770K94030K13027p8678J24871N21422
$$ 675084829 675678194 675838113 675979316 676191568 676434338 676728368 676941395 676862717 676987588 677509010
1892.8F77509010L00824J89901K95877K25008P4923K921j28329k27213k5988K18749
$$ 677509010 677809834 677999735 678295612 678520620 678595543 678598464 678470135 678242922 678216934 678435683
1913.2F78435683K3067m06861j82509R9658J5557K13147K93731Q0168k8252o080M1127
$$ 678435683 678458750 678051889 677869380 677969038 677984595 678197742 678491473 678571641 678543389 678537309 678578436
1935.6F78578436N8353j04904l57628j05321L67820L83556K59936J77145R2864N5015
$$ 678578436 678636789 678531885 678174257 678068936 678436756 678820312 679080248 679257393 679350257 679405272
1956F79405272K5094K6106Q9169M0710j58131j31786P5281J04487J4245k0921j0610
$$ 679405272 679430366 679456472 679545641 679586351 679428220 679296434 679371715 679476202 679490447 679469526 679458916
1978.5F79458916k6703l9816n4657j31846k34782l41535k36928O6578Q6010p0274r9242
$$ 679458916 679432213 679392397 679337740 679205894 678971112 678629577 678392649 678459227 678545237 678474963 678375721
2000.9F78375721n6207j8418J19Q702J5676M0293K0504n960P5757J39594R7692O6161
$$ 678375721 678319514 678301096 678301215 678309917 678325593 678365886 678386390 678380430 678456187 678595781 678693473 678759634
2025.4F78759634M5717k4855o6161k2709Q285l3141q0287n3465J7464M0948J2040k6643
$$ 678759634 678805351 678780496 678714335 678691626 678699911 678666770 678586483 678533018 678550482 678591430 678603470 678576827
2049.8F78576827m0829m6253n8353q2493j16825j36912j45197j08361m0829O139L7670
$$ 678576827 678535998 678489745 678431392 678348899 678232074 678095162 677949965 677841604 677800775 677806914 677844584
2072.3F77844584L4392J4543J4663L8326Q6665J35899J48594J13070J44064K36214
$$ 677844584 677878976 677893519 677908182 677946508 678033173 678169072 678317666 678430736 678574800 678811014
2092.7F78811014K27034J56045J22905Q6784M9174M9829M6015K0385L57J0014M0174
$$ 678811014 679038048 679194093 679316998 679403782 679452956 679502785 679548800 679569185 679569542 679579556 679619730
2115.1F79619730M9591o140r3817j53065j60515j22726j09375j27733j62661j75059
$$ 679619730 679669321 679663181 679569364 679416299 679255784 679133058 679023683 678895950 678733289 678558230
2135.5F78558230j59144j33634j02579p0274o497M1783N6028N5731L9219N2214J14024
$$ 678558230 678399086 678265452 678162873 678092599 678086102 678127885 678183913 678239644 678278863 678331077 678445101
2157.9F78445101J34408R6500O0499M1425M6313L5465K5153N1737P1823O3420M5716
$$ 678445101 678579509 678676009 678736508 678777933 678824246 678859711 678884864 678936601 679008424 679071844 679117560
2180.4F79117560N5015Q7739M8637l2067k9684K3127L3677J0371J9014K1279J7523
$$ 679117560 679172575 679260314 679308951 679276884 679247200 679270327 679304004 679314375 679333389 679354668 679372191
2202.8F79372191L4869K7061J1086L1948L5584J1862K6106K6882j4722k5928J3351
$$ 679372191 679407060 679434121 679445207 679477155 679512739 679524601 679550707 679577589 679562867 679536939 679550290
2225.2F79550290M1664L2425j4246l8445k0683l4690n9962o2644m3810l7610m9770
$$ 679550290 679591954 679624379 679610133 679571688 679551005 679516315 679456353 679393709 679349899 679312289 679262519
2247.7F79262519n7221o0498m2796k1875j5676k5094l8326m1902m2975k5570k384k9683
$$ 679262519 679205298 679144800 679102004 679080129 679064453 679039359 679001033 678959131 678916156 678890586 678888202 678858519
2272.2F78858519n2631k6048l2782q5712q7440l6776j0669J5199M7863N5134P9692
$$ 678858519 678805888 678779840 678747058 678661346 678573906 678537130 678526461 678541660 678589523 678644657 678724349
2294.6F78724349J10507J18613J31488J45554J78874K45988K62737J55747N9486J43051
$$ 678724349 678834856 678953469 679084957 679230511 679409385 679655373 679918110 680073857 680133343 680276394
2315F80276394K51174K18809J33335J07586J86444K38597J31965L6180J32501K18689
$$ 680276394 680527568 680746377 680879712 680987298 681173742 681412339 681544304 681580484 681712985 681931674
2335.4F81931674J21594n007j76847o76453p72059L70026J276433J006901K36989j35780
$$ 681931674 682053268 682048261 681871414 681194961 680422902 680792928 682069361 683076262 683313251 683177471
2355.8F83177471k30253l72111n12958p04944q33631p75277o33717m48525l24487l32356
$$ 683177471 682947218 682575107 682062149 681357205 680523574 679748297 679114580 678666055 678341568 678009212
2376.2F78009212l65078k78116j10388j2636k4259n3644m6909o4015p1943m1306l8564
$$ 678009212 677644134 677366018 677255630 677242994 677218735 677165091 677118182 677054167 676982224 676940918 676902354
2398.6F76902354n6207l6359o259m6789r0719l8802J9848K4378N8234J27375J45734
$$ 676902354 676846147 676809788 676803529 676756740 676666021 676627219 676647067 676671445 676729679 676857054 677002788
2421F77002788J15931R7513O4909L2544O7354J02281N3525j669j8239j3172J5854K3485
$$ 677002788 677118719 677216232 677281141 677313685 677381039 677483320 677536845 677535176 677516937 677503765 677519619 677543104
2445.5F77543104L9458P5400P4625L7610J908O55J2458k1935j11758j36555n3167k8908
$$ 677543104 677582562 677657962 677732587 677770197 677772105 677772760 677785218 677763283 677651525 677514970 677461803 677432895
2470F77432895j20163j71066j21057m7803L696R835J9312P1227N8711k742j0431J0252
$$ 677432895 677312732 677141666 677020609 676972806 676976502 676986337 677005649 677076876 677135587 677132845 677122414 677132666
2494.5F77132666j9908q3864m0412L5406K2292j5497p4864j55389j61946q8573l4034
$$ 677132666 677112758 677028894 676988482 677023888 677046180 677030683 676955819 676800430 676638484 676549911 676515877
2516.9F76515877K4200P3313M7446L934k6703p6115j30713j44780j08898l6597K2054
$$ 676515877 676540077 676613390 676660836 676664770 676638067 676561952 676431239 676286459 676177561 676140964 676163018
2539.3F76163018N185o8128r8407q8930j08183j18970j04189j12176j13309r8765j34349
$$ 676163018 676168203 676100075 676001668 675912738 675804555 675685585 675581396 675469220 675355911 675257146 675122797
2561.8F75122797j73091j84715j80721j59562j59800j56105j57833j91331j97828j68681
$$ 675122797 674949706 674764991 674584270 674424708 674264908 674108803 673950970 673759639 673561811 673393130
2582.2F73393130j70588j90377j80722j85668k25902k62737k65241k34604j79290j04309
$$ 673393130 673222542 673032165 672851443 672665775 672439873 672177136 671911895 671677291 671498001 671393692
2602.6F71393692n6445p3850r8408l6656L6120K801n6505o3061j8299N2988P3016l815
$$ 671393692 671337247 671263397 671164989 671128333 671164453 671167254 671110749 671047688 671029389 671082377 671155393 671151578
2627F71151578r5963r8109o2943o5148q4757j35959j97231j85490j51038j78218j51575
$$ 671151578 671055615 670957506 670894563 670829415 670744658 670608699 670411468 670225978 670074940 669896722 669745147
2649.5F69745147j8298L2544n901J6153M8816M2021P6235J21593P9036L8922Q2910
$$ 669745147 669726849 669759393 669753492 669769645 669818461 669860482 669936717 670058310 670137346 670176268 670259178
2671.9F70259178J05083R1731J06573K3127k38240m10914l40224k22325j82927j99854
$$ 670259178 670364261 670455992 670562565 670585692 670347452 669936538 669596314 669373989 669191062 668991208
2692.3F68991208k05100j53779j34588j98304k35916k07364j67906j40727j99437l22223
$$ 668991208 668786108 668632329 668497741 668299437 668063521 667856157 667688251 667547524 667348087 667025864
2712.7F67025864l88801m44055m60445l10362n3763J46866Q8572j26481j45018m7386
$$ 667025864 666637063 666193008 665732563 665422201 665368438 665515304 665603876 665477395 665332377 665284991
2733.1F65284991N0009J70707J83523J63674K38836L62277L61502J07289j90795k56300
$$ 665284991 665335000 665505707 665689230 665852904 666091740 666454017 666815519 666922808 666732013 666475713
2753.5F66475713j41322r0897j52111k12014k06948j23739j5795R7752K58505K50280
$$ 666475713 666334391 666243494 666091383 665879369 665672421 665548682 665532887 665630639 665889144 666139424
2773.9F66139424j54317n13553m33803k63631k42353j13189R9898n9367m70280n23687
$$ 666139424 665985107 665471554 665037751 664774120 664531767 664418578 664518476 664459109 663988829 663465142
2794.3F63465142k53737k66671o60479q41677o83487n05149l87073n66542r55283r97901
$$ 663465142 663211405 662944734 662284255 661442578 660759091 660253942 659866869 659300327 658345044 657347143
2814.7F57347143p72298o37173n95510o17206p72000r60052j013875j048505j238525
$$ 657347143 656574845 655937672 655342162 654724956 653952956 652992904 651979029 650930524 649691999
2833F49691999j555622j938522k722322l608168l527760k842367k681255k851963k597690
$$ 649691999 648136377 646197855 643475533 639867365 636339605 633497238 630815983 627964020 625366330
2851.4F25366330k364516k931535m030407n582392p757008r997487j1895955j3204753
$$ 625366330 623001814 620070279 616039872 610457480 602700472 592702985 580807030 567602277
2867.7E67602277j2737751r909749o372214l402173n54025J958966L412366L864527
$$ 567602277 554864526 544954777 538582563 535180390 534626365 536585331 539997697 543862224
2884E43862224L606021K856195J712322M20690p33793k042413l476143m217207m270434
$$ 543862224 547468245 550324440 552036762 552457452 551723659 549681246 546205103 541987896 537717462
2902.4E37717462m377425m425585l858924k943456k696991l498912m399419m652441
$$ 537717462 533340037 528914452 525055528 522112072 519415081 515916169 511516750 506864309
2918.7E06864309m670202m807085n059064n026757m514605m076660l450632k335548
$$ 506864309 502194107 497387022 492327958 487301201 482786596 478709936 475259304 472923756
2935D72923756j344204o25909n9396n06431l156900p745743j2485146j6078770j8740893
$$ 472923756 471579552 470953643 470894247 470387816 467230916 459485173 447000027 430921257 412180364
2953.4D12180364j9971222j8498718j4606893r557575m207999J603604Q170098J4612108
$$ 412180364 392209142 373710424 359103531 349545956 345337957 346941561 355111659 369723767
2969.7C69723767J9829184K3424208K5827020K7669132K7827114K4843574K0189523
$$ 369723767 389552951 412977159 438804179 466473311 494300425 519143999 539333522
2984E39333522J6235590J3558924J1971951J0595024Q709371P190585O056666M834295
$$ 539333522 555569112 569128036 581099987 591695011 600404382 607594967 613651633 618485928
3000.3F18485928M172623L779351L285945L290355L494024K937556J691401O44028
$$ 618485928 622658551 626437902 629723847 633014202 636508226 639445782 641137183 641781211
3016.6F41781211K07424K25186N28872O84441N20944P00116J178265J332045Q08775
$$ 641781211 641988635 642213821 642742693 643427134 643948078 644648194 645826459 647158504 647967279
3034.9F47967279J52409O19710J377582R93669O2406l34620J33574N60820L14474N0962
$$ 647967279 648119688 648739398 650116980 651110649 651173055 650838435 650972009 651532829 651847303 651898265
3055.3F51898265j28865j91748K35557P52389R62914N29289l23355m76599K26497J163424
$$ 651898265 651769400 651577652 651813209 652565598 653528512 654057801 653734446 653257847 653484344 654647768
3075.7F54647768J506924P32124l874k0564j67429j99378l1471m46737p15077r9063
$$ 654647768 656154692 656886816 656882942 656862378 656694949 656495571 656464100 656017363 655302286 655203223
3096.1F55203223N63741L61741k96534k23457N74231Q08716J18494O3717J007795J188696
$$ 655203223 655766964 656128705 655832171 655608714 656182945 656991661 657110155 657173872 658181667 659370363
3116.5F59370363L55065o68943j420379j205802k52902L37660M1544l99172j9670P84994
$$ 659370363 659725428 659056485 657636106 656430304 656177402 656515062 656556606 656157434 656137764 656922758
3136.9F56922758P58409l13759r80258n83231q35N91576J032234L08454r22919j103639
$$ 656922758 657681167 657367408 656387150 655803919 655803084 656394660 657426894 657735348 656812429 655708790
3157.3F55708790n85020j95265n0962r9837j53005j16647n1260l8445o2763o0618l4392
$$ 655708790 655123770 654928505 654877543 654777706 654624701 654508054 654456794 654418349 654355586 654294968 654260576
3179.8F54260576l4392m9174L8028J34468K3186j17540j01805k0564Q4937J48773J32323
$$ 654260576 654226184 654177010 654215038 654349506 654372692 654255152 654153347 654132783 654217720 654366493 654498816
3202.2F54498816J37627J39057K5809l0160Q3745J98722K77221K40922k384j01090
$$ 654498816 654636443 654775500 654801309 654771149 654854894 655053616 655330837 655571759 655569375 655468285
3222.6F55468285P9334K07841L55780Q35002J000285j7881j041949q00669j06514L59774
$$ 655468285 655547619 655755460 656111240 656946242 657946527 657928646 656886697 656086028 655979514 656339288
3243F56339288P43448N19455m32253p86185j16408M08232L4034m50134l33726p0215
$$ 656339288 657082736 657602191 657169938 656383753 656267345 656675577 656709611 656259477 655925751 655855536
3263.4F55855536J78159Q05199J394987O86705o26266r97245p98702m60864j32143
$$ 655855536 656033695 656838894 658233881 658920586 658294320 657297075 656498373 656037509 655905366
3281.7F55905366o4492n8949K17437Q79109J129866M84526l85880r72808p15971N31972
$$ 655905366 655840874 655781925 655999362 656878471 658008337 658492863 658106983 657134175 656418204 656950176
3302.1F56950176J560867J117467m42266j589656j519143p69020k51233q5116O0678
$$ 656950176 658511043 659628510 659186244 657596588 656077445 655308425 655057192 654972076 655032754
3320.5F55032754M01139O30796K8730p34985o29545j53303M23134J071334P43806k48373
$$ 655032754 655433893 656064689 656093419 655358434 654728889 654575586 654998720 656070054 656813860 656565487
3340.9F56565487o22928o60717k77519O49631M33921q51333j070738j75714M34101
$$ 656565487 655942559 655281842 655004323 655653954 656087875 655236542 654165804 653990090 654424191
3359.2F54424191K51114J40548Q77797J382947M47333j147330j490056m89116J37508
$$ 654424191 654675305 654815853 655693650 657076597 657523930 656376600 654886544 654397428 654534936
3377.6F54534936j2517l42309m74215j21534O66261J390159R22859m91798p20084O07550
$$ 654534936 654522419 654180110 653705895 653584361 654250622 655640781 656563640 656071842 655351758 655959308
3398F55959308J241207j41501j529694j000762J30773L73900L5405m73559p37846m27186
$$ 655959308 657200515 657059014 655529320 654528558 654659331 655033231 655068636 654595077 653857231 653430045
3418.4F53430045k14637k80142J3173N71847P81179M11927K23279M37081q0764j120091
$$ 653430045 653215408 652935266 652948439 653520286 654301465 654713392 654936671 655373752 655292988 654172897
3438.8F54172897j311421p33674l20732l04759l88324m25220m14669l48389j10924
$$ 654172897 652861476 652127802 651807070 651502311 651113987 650688767 650274098 649925709 649814785
3457.1F49814785J29103n6028r0718N25593R47059N88953j311n4717L99708P37071
$$ 649814785 649943888 649887860 649797142 650322735 651269794 651858747 651857436 651802719 652202427 652939498
3477.5F52939498N02527P6235J71303L61920Q4579j43826j08123j82450k40087j98603
$$ 652939498 653442025 653518260 653689563 654051483 654136062 653992236 653884113 653701663 653461576 653262973
3497.9F53262973l58105o80864p80523n78939m18544j20938M85718O32763J93119K1577
$$ 653262973 652904868 652224004 651443481 650864542 650445998 650325060 650810778 651443541 651636660 651658237
3518.3F51658237K18689K56539o7830m28796l21746R3401L22103K70784J0729j49548
$$ 651658237 651876926 652133465 652065635 651636839 651315093 651408494 651730597 652001381 652012110 651862562
3538.7F51862562M5597Q3208n31196j011372o08682l18110m09544j35183J26838J41144
$$ 651862562 651908159 651991367 651460171 650448799 649840117 649522007 649112463 648977280 649104118 649245262
3559.1F49245262J23203n58317j905858j534045J015544J665890N09441J907J30058
$$ 649245262 649368465 648810148 646904290 645370245 646385789 648051679 648561120 648563027 648693085
3577.5F48693085N00619J135349R50218j026512k381265k06172J229226Q9288k14457
$$ 648693085 649193704 650329053 651279271 650252759 647871494 647665322 648894548 648983836 648769379
3595.8F48769379O28769N41270K99454L40998p28727j697003r25780j05023L94463
$$ 648769379 649398148 649939418 650238872 650579870 649851143 648154140 647228360 647123337 647517800
3614.2F47517800K66135p85351J20223J884758J266659j464487l713428q18849K026141
$$ 647517800 647783935 646998584 647118807 649003565 650270224 648805737 645092309 644273460 646299601
3632.5F46299601J403093O37710K00212M8637L30866k13146k308488l120780L48925
$$ 646299601 647702694 648340404 648540616 648589253 648920119 648706973 646398485 643277705 643626630
3650.9F43626630K370477Q59022M97341J667381Q23617l86417j94252r32038k408385
$$ 643626630 645997107 646856129 647353470 649020851 649844468 649458051 649263799 648331761 645923376
3669.2F45923376q63016j53005j914799K21312K541602K086699J555323P73967r92000
$$ 645923376 645060360 644907355 642992556 643213868 645755470 647842169 649397492 650171459 649179459
3687.6F49179459k167702m54605J460493J440108M07874p78258r28819N93126J125336
$$ 649179459 647011757 646557152 648017645 649457753 649865627 649087369 648158550 648751676 649877012
3706F49877012m98593k559781j853466J372039K131343P29680m61280q08716p14123
$$ 649877012 649378419 646818638 644965172 646337211 648468554 649198234 648736954 647928238 647214115
3724.3F47214115O3359J076401L78489j655936k408028L4869K655029J484454k443016
$$ 647214115 647277474 648353875 648732364 647076428 644668400 644703269 647358298 648842752 646399736
3742.7F46399736l450453L80635K802j989067J016081L084719J403808j68860N41032
$$ 646399736 642949283 643329918 643332720 641343653 642359734 645444453 646848261 646679401 647220433
3761F47220433R58442K8611n65112p07567J65940J301646J016795o3896o56068k84016
$$ 647220433 648178875 648207486 647642374 646934807 647100747 648402393 649419188 649355292 648699224 648415208
3781.4F48415208j63019j98543L05533N43535K83063l83199q71181o28352j464904
$$ 648415208 648252189 648053646 648359179 648902714 649185777 648802578 647931397 647303045 645838141
3799.8F45838141j600623O57440M89115J83940J674772J274108r20534j718998n76496
$$ 645838141 644237518 644894958 645384073 645568013 647242785 648516893 647596359 645877361 645300865
3818.1F45300865j264989p23481J539886J287818N02049K5869j81079q6427j294493
$$ 645300865 644035876 643312395 644852281 646140099 646642148 646668017 646486938 646400511 645106018
3836.5F45106018k041877j49846J376331J801074J771986O56128k363682n741715j583100
$$ 645106018 643064141 642914295 644290626 646091700 647863686 648519814 646156132 640414417 638831317
3854.8F38831317M022539L003657L15130j212478n19991O8903j170158p70271Q52287
$$ 638831317 642853856 645857513 646172643 644960165 644440174 644509077 643338919 642568648 643420935
3873.2F43420935J308620Q00013o78301m64439M81307o0737K56539K1279o86408O50764
$$ 643420935 644729555 645529568 644851267 644386828 644868135 644807398 645063937 645085216 644398808 645049572
3893.6F45049572J226604m60446j923203j873732o92427J270652K072751J234293L76702
$$ 645049572 646276176 645815730 643892527 642018795 641326368 642597020 644669771 645904064 646280766
3912F46280766k22505r23097q18491J34111L28064q0526J74761L02195l44097l19899
$$ 646280766 646058261 645135164 644316673 644450784 644778848 644698322 644873083 645175278 644831181 644511282
3932.3F44511282N11826O11126J10745l83377n43534n3347O8188l01063r2566L27170
$$ 644511282 645023108 645634234 645744979 645361602 644818068 644764721 644832909 644531846 644439280 644766450
3952.7F44766450K54154j1444j41084j52052k6106O7770J0908l6240q0943j78695j32024
$$ 644766450 645020604 645009160 644868076 644716024 644689918 644757688 644768596 644732356 644651413 644472718 644340694
3975.2F44340694n186n2094J4305K83062J97292k01106l30210k17915r7572K3424P1526
$$ 644340694 644335508 644283414 644297719 644580781 644778073 644576967 644246757 644028842 643931270 643954694 644026220
3997.6F44026220
$$ 644026220
##END=$$ End of the data block
