##TITLE=Acetato de isoamila - Grupo 4 $$ Begin of the data block
##JCAMP-DX=5.00 $$ ACD/SpecManager v 10.08
##SPECTROMETER/DATA SYSTEM=Alpha
##DATE=22 Oct 2014 14:05:46
##DATA TYPE=INFRARED SPECTRUM
##DATA CLASS=XYDATA
##ORIGIN=
##OWNER=
##NPOINTS=1667
##FIRSTX=599.64648438
##LASTX=3997.64306641
##MAXX=3997.64306641
##MINX=599.64648438
##MAXY=0.75490105
##MINY=0.18179564
##XFACTOR=1.0000000000
##YFACTOR=1.000000000000000e-9
##FIRSTY=0.65595388
##DELTAX=2.03961372
##XUNITS=1/CM
##YUNITS=ARBITRARY UNITS
##XYDATA=(X++(Y..Y))
599.6F55953884p767200j1168301j0151327l946841K702594N533934N262374M511178
616F40930295M403293M769266N146563N287051M745126L247320Q94607j272083j380741
634.3F66770697J035988L638744M447937M430831N123734O129027O123125N372584
650.6G03072667M894257M930973M851341M393339L819883L540218L574431K918064
667G35995173J570583J718163J948417J445114J148760J190186J201153J015186P28488
685.3G47961223N77092O48380P60197O52433M69386L03388K76983M68731N25951L64542
705.7G53008306K78235K31266J42872J38819J35422J3470p5101R7513K74360K39849
726.1G54485011J22845L8505L2127L6895Q7082R8587j7047j35243k30074l93510n39065
$$ plain form
599.6 655953884 648186684 637018383 626867056 622920215 625622809 631156743 636419117 640930295
616 640930295 645333588 650102854 655249417 660536468 665281594 668528914 669423521 668151438 666770697
634.3 666770697 667806685 671445429 675893366 680324197 685447931 691576958 697700083 703072667
650.6 703072667 707966924 712897897 717749238 722142577 725962460 729502678 733077109 735995173
667 735995173 737565756 739283919 741232336 742677450 743826210 745016396 746217549 747232735 747961223
685.3 747961223 748538315 749186695 749946892 750599325 751068711 751372099 751649082 752117813 752643764 753008306
705.7 753008306 753286541 753517807 753660679 753799498 753934920 753948390 753873289 753970802 754245162 754485011
726.1 754485011 754607856 754646361 754678488 754715383 754802465 754901052 754884005 754748762 754518688 754125178 753586113
748.5G53586113o03497q05676j107573j197279j000225p24375o66678q98600j052618
766.9G45529592q17060k59340L44157O82175P93576Q86321Q85547P44939N49018K90692
787.3G49629617M3809j74224l92437n64277p24972r59515j259804j602054k178669
805.6G41817474k851724k997160k555430k112627j847506j195192L36230K237260L421187
824G34252512L378690K570450J759410J111567N31912J95265J31368P3016j63794m77254
844.4G43363142p61449j120448j430631j342476p93457L4333P50482R86039R39846
862.8G40625381Q92878P06911K50638l08276o43670p08282o99639o45161m63545l15369
883.2G38691866m10616o17027q83818j319647j768470k045214k002060j395643l79145
$$ plain form
748.5 753586113 752982616 752176940 751069367 749872088 748871863 748147488 747480810 746582210 745529592
766.9 745529592 744712532 744453192 744797349 745479524 746273100 747159421 748044968 748789907 749338925 749629617
787.3 749629617 749673426 749499202 749106765 748542488 747817516 746858001 745598197 743996143 741817474
805.6 741817474 738965750 735968590 733413160 731300533 729453027 728257835 728594065 730831325 734252512
824 734252512 737631202 740201652 741961062 743072629 743604541 743799806 743931174 744004190 743840396 743363142
844.4 743363142 742601693 741481245 740050614 738708138 737914681 737949014 738699496 739685535 740625381
862.8 740625381 741518259 742225170 742475808 742167532 741523862 740815580 740115941 739470780 739007235 738691866
883.2 738691866 738281250 737664223 736780405 735460758 733692288 731647074 729645014 728249371 727870226
901.5G27870226M37558O67989M43995O8188l39151q47578j514673k182007k397716
919.9G22206831j722336n05268L42667O40034R37939J362085J569868J349270O87480
938.2G26868570l06130j434028k365648l102124m207671n622566n878389m591226m033625
956.6F95327163m812479l961981n59747J989067J523793j24276n97358O48081K564609
974.9F91996872L556550L262043K679110K432525K172947J479387N02646m59254j285493
993.3G06337333j944125k614617l539682m730701o115794p687509r266317j0490537
1009.6F59948051j1176765j1355579j0986209j0003447q741856p927299p694423p246434
1025.9E84816039n876720l883124k184868j166820o91593o35266q71301j451731k724587
$$ plain form
901.5 727870226 728307784 728975773 729419768 729487956 729148805 728301227 726786554 724604547 722206831
919.9 722206831 720484495 719979227 720321894 720961928 721899867 723261952 724831820 726181090 726868570
938.2 726868570 726562440 725128412 722762764 719660640 715452969 709830403 703952014 699360788 695327163
956.6 695327163 690514684 686552703 685992956 687982023 689505816 689381540 688784182 689432263 691996872
974.9 691996872 695553422 698815465 701494575 703927100 706100047 707579434 708082080 707622826 706337333
993.3 706337333 704393208 701778591 698238909 693508208 687392414 679704905 670438588 659948051
1009.6 659948051 648771286 637415707 626429498 616426051 607684195 599756896 592062473 584816039
1025.9 584816039 578939319 575056195 572871327 571704507 571012914 570377648 569506347 568054616 565330029
1044.3E65330029m974068p937491j0925352j3005316j2479067p650554P37249R155274
1060.6E18250704J4595866J7199934J8733978J9698441J9295037J7379760J4804125
1074.9F39957845J2285114J0089218Q239508O661355N366803M352808L554999K936542
1091.2F93444192K423048J949072J504541J145839R51767Q19087N53549M9114n28097
1109.6G02312112p99716o69002m54366m21703m12584j34348K17378Q3327o83367j679838
1129.9F97357893k265275j968145r16183K50518Q02875N24580K2412j9193L46720O12676
1150.3F94748878M72486j5735o38306j340211k280593l665387n681753q038640r127439
1168.7F64433300o309866M78923O500065P927180O296455M342080K704680J168370
$$ plain form
1044.3 565330029 560355961 552418470 541493118 528487802 516008735 508358181 509095430 518250704
1060.6 518250704 532846570 550046504 568780482 588478923 607773960 625153720 639957845
1074.9 639957845 652242959 662332177 670571685 677233040 682599843 686952651 690507650 693444192
1091.2 693444192 695867240 697816312 699320853 700466692 701418459 702237546 702791095 702840209 702312112
1109.6 702312112 701512396 700843394 700389028 699967325 699554741 699420393 699637771 699721098 699037731 697357893
1129.9 697357893 695092618 693124473 692208290 692458808 693261683 693786263 693808675 693789482 694136202 694748878
1150.3 694748878 695221364 695205629 694567323 693227112 690946519 687281132 681599379 673560739 664433300
1168.7 664433300 658123434 658602357 665102422 673029602 679326057 683668137 686372817 687541187
1185F87541187j92344j225770k073765k956152l935933m982114o151020p501304q952380
1203.4F49570405j0388195j1847913j3656259j6292453k0065665k5306106l2558083
1217.7E19455731m1652590n0765872n6551606n5535316m6990216l4401595k2520274
1231.9B11038262j3805107q246690m844784k346039M52190M267872Q934125J4186680
1248.2B09636509K0670593K8815806L6365867L9592027L7785620L3419520K8348416
1262.5D34634358K3035973J7797679J3306290J0376751R238303R761512J1791348J4468968
1278.8E44411182J6167999J6012788J4669477J3257325J2112439J0813534R039939
1293.1F36484683P034838N131542L369093J810432P52270N10871J212001K496600L589392
$$ plain form
1185 687541187 687348843 686123073 684049308 681093156 677157223 672175109 666024089 658522785 649570405
1203.4 649570405 639182210 627334297 613678038 597385585 577319920 552013814 519455731
1217.7 519455731 477803141 427037269 370485663 314950347 267960131 233558536 211038262
1231.9 211038262 197233155 188986465 184141681 181795642 182247832 186515704 195449829 209636509
1248.2 209636509 230307102 259122908 295488775 335080802 372866422 406285942 434634358
1262.5 434634358 457670331 475468010 488774300 499151051 508389354 518150866 529942214 544411182
1278.8 544411182 560579181 576591969 591261446 604518771 616631210 627444744 636484683
1293.1 636484683 643519521 648651063 652020156 653830588 654582858 655093729 656305730 658802330 662391722
1311.5F62391722M088819L939271L289402K514124J824796J110792L88086k86758r27687
1329.8F78332567j252413j101493j001597j474857j766086j293182r61840j289845
1346.2F68191254k191901l893793o771624j1236071j7276049k4555028l4896910m7903537
1362.5E19466341m9398274l2260000o839365J6835630L0425489L3738911K7923941
1376.7E39892673J8567503R433866P25984n985439p691621j684011O027043R717048
1393.1E69003046J1428773J3137758J4837682J4014781J0889589Q545637O589473M443943
1409.4F52890682K610862J374305L55303j228273k395570j851559k078473l007293
1425.7F46669984l670156m336834l237069j260459o29246M6551P44700m1961j358569
$$ plain form
1311.5 662391722 666480541 670419812 673709214 676223338 678048134 679158926 679547012 679260254 678332567
1329.8 678332567 677080154 675978661 674977064 673502207 671736121 670442939 669481099 668191254
1346.2 668191254 665999353 662105560 655333936 644097865 626821816 602266788 567369878 519466341
1362.5 519466341 470068067 437808067 430968702 447804332 478229821 511968732 539892673
1376.7 539892673 558460176 567894042 568620026 562634587 554942966 553258955 559285998 569003046
1393.1 569003046 580431819 593569577 608407259 622422040 633311629 641857266 648446739 652890682
1409.4 652890682 655501544 656875849 657231152 656002879 653607309 651755750 649677277 646669984
1425.7 646669984 642999828 638662994 635425925 634165466 633536220 633582771 634327471 634285510 632926941
1444.1F32926941k900422m686534n528867n745530o578386j0138274j2432575q614838
1460.4E76301515p465899p771492l920853J463294N150199J0188460J3850570J3355613
1476.7F01151407J2432575J2087345J1402369R272635O780624N012512M538775M059314
1493F66737556K519846J067460J131415J784802J529038n79000k511561M27127J978159
1511.4F74084842J337648M26232J05620M2200m64737K26974P59661O76453R72212K86579
1531.8F78453684m60148O29961L42727k038717j268864J105666J647413J299501P03692
1550.1F80414915N42641N89013J29282k135515j285672K205193J806617P65383j06752
1568.5F82925105k32458Q65102J82450j082898J97947Q87216K66075m0353j17480k27869
$$ plain form
1444.1 632926941 630026519 625339985 619811118 614065588 607487202 597348928 584916353 576301515
1460.4 576301515 568835616 561064124 557143271 558606565 563756764 573945224 587795794 601151407
1476.7 601151407 613583982 625671327 637073696 646346331 653126955 658139467 662678242 666737556
1493 666737556 669257402 670324862 671456277 673241079 674770117 674191117 671679556 672106683 674084842
1511.4 674084842 675422490 675848722 675954342 675996542 675531805 675758779 676518440 677194893 678167105 678453684
1531.8 678453684 677993536 678623497 678966224 676927507 675658643 676764309 678411722 679711223 680414915
1550.1 680414915 680957556 681546569 681675851 679540336 678254664 680459857 682266474 683031857 682925105
1568.5 682925105 682692647 683557749 683740199 682657301 682855248 683742464 684008539 683968186 683850706 683622837
1588.9F83622837k63274k56776k19882p3612L0637q2016j49846j49965k38777l41117
1609.3F81878209n0127J42097r03606j482368K19464M37916n52237k35200Q3327K55168
1629.7F79792643O36816m25160k280951r03070P27296M84586l28124k077102j601339
1648F74025595N01156j545429l197134J108349J968801O07013m45664J1862O77466
1666.4F73712015n16295j115203j72198n80847q23021J41442J9550j837790l440917
1684.7F65386736j199066k31624r43601j249254l047645m052698l806949l702343j630127
1703.1F45523429j844704l520549m214584n316496p342518j0622739j5716076j6154051
1719.4E80791712j4071822j6538144k0287215k3527980k8724074l6081672n4073811
$$ plain form
1588.9 683622837 683359563 683102787 682882905 682809293 682839930 682757914 682608068 682458103 682219326 681878209
1609.3 681878209 681828082 681970179 681066573 679584205 679803669 680241585 679689348 679454148 679537475 679792643
1629.7 679792643 680429459 680004299 677723348 676820278 677547574 678032160 677704036 675626934 674025595
1648 674025595 674526751 672981322 669784188 670892537 672861338 673468351 673022687 673034549 673712015
1666.4 673712015 673195720 672080517 671908319 671327472 670504451 670645893 670665443 668827653 665386736
1684.7 665386736 664187670 663956046 663012445 661763191 658715546 654662848 650855899 647153556 645523429
1703.1 645523429 643678725 640158176 635943592 630627096 623284578 612661839 596945763 580791712
1719.4 580791712 566719890 550181746 529894531 506366551 477642477 441560805 387486994
1733.7C87486994o1312288m6894490m0566713k9509097j0519684O315544K2393153
1748B27393419L8684338M4852644L4139782K1532625J3203800Q691728R126335J0459483
1764.3D08084154J2555659J8839687K7591616L5829246L4199655K5953233K0974577
1778.6E84027827J7689824J3871670J0501623Q109867O073714M225611L429056L474891
1794.9F51404083L071785K304613J843512K103389K155780J823187J345516J153707
1811.2F67205572J270890J208485Q88228P57873P22885L04997J46806K31922m8995
1829.6F72688663K38538Q42213N91040L81291O07669L25859m82440j31548P70152P22468
1850F76553905M83155K84374J44064K6048n842P1168J65522j71899p96914l17038N62191
$$ plain form
1733.7 387486994 326174706 279280216 238713503 209204406 198684722 205000266 227393419
1748 227393419 266077757 310930401 345070183 366602808 379806608 388498336 397624671 408084154
1764.3 408084154 420639813 439479500 467071116 502900362 537100017 563053250 584027827
1778.6 584027827 601717651 615589321 626090944 634200811 640274525 644500136 647929192 651404083
1794.9 651404083 654475868 656780481 658623993 660727382 662883162 664706349 666051865 667205572
1811.2 667205572 668476462 669684947 670573175 671331048 672053933 672358930 672505736 672737658 672688663
1829.6 672688663 672927201 673769414 674360454 674741745 675349414 675675273 675192833 675061285 675831437 676553905
1850 676553905 677037060 677321434 677465498 677491546 677485704 677556872 677722394 677550495 676753581 676436543 676998734
1872.4F76998734N38946K22087K04801K55823L02196L63231L12328L7491J48595N05507
1892.8F79889739L27825K06649K83063K21968J11341J08779R53j72674n3049K08259
1913.2F81132853J19031k85984j59680R6857r537J28925K53797Q9347k2352m649N9605
1935.6F81398213J43349O6817j90377r6977K59638K96652K11179J64628J34111R9242
1956F82486475K4318K5809J23322J05917q6724j13368M4942R1612L0994j2695l8982
1978.5F82681620n8412n0605o7949j04666j12653j98781k17438j8239L1948p4744r5129
2000.9F81714952q2076o9677j2458M2439O5505R6619N2929j8537M5121J24037J15752
2023.3F82074606Q8394L2485k5571k4438j2397m2677n9307n4955m8459L755O5982Q0109
$$ plain form
1872.4 676998734 677537680 677759767 677964568 678220391 678522587 678885818 679198146 679235637 679384232 679889739
1892.8 679889739 680217564 680424213 680707276 680929244 681040585 681149364 681150317 680977643 680924594 681132853
1913.2 681132853 681251884 680965900 680806220 680903077 680893540 681022465 681276262 681365609 681343257 681338608 681398213
1935.6 681398213 681541562 681608379 681418002 681321025 681580663 681877315 682088494 682253122 682387233 682486475
1956 682486475 682510793 682536602 682659924 682765841 682679117 682565749 682610691 682702303 682733297 682720602 682681620
1978.5 682681620 682623208 682572603 682504654 682399988 682287335 682088554 681871116 681852877 681884825 681810081 681714952
2000.9 681714952 681632876 681563199 681550741 681593180 681658685 681755304 681808233 681789696 681834817 681958854 682074606
2023.3 682074606 682163000 682195485 682169914 682145476 682133079 682090402 682031095 681976140 681927681 681931436 681997418 682077527
2047.8F82077527K6166n0783o6578m6194q0764j37627j48654j37210j07110l6180L3677
2070.2F81326270N7221L5226Q702J0789L6478Q1896J21236J58131J76669J96158K22385
2092.7F82431161J73331J14977J35481J31429O8187N5969N7757J5438r954J4841L4988
2115.1F83223605m291p5579j16587j26481j34229j39118j52290j57058j70052k05934
2135.5F81941986k00093j02579m2379q3983p9751j3828N4001Q1480P6353Q6904R6917
2157.9F81815028P9692P4029P6711P0929P2301M6789J9193K3127O0200J09971J13904
2180.4F82561874O6758K7418j669k4080j6511j5616j1504P570J9967K3008K4259J8954
2204.8F82680428J3292J8120L1054J7821j0907l398j549K384L0696K4975j5021k1755
$$ plain form
2047.8 682077527 682103693 682052910 681986332 681940138 681859374 681721747 681573093 681435883 681328773 681292593 681326270
2070.2 681326270 681383491 681418717 681427419 681438208 681474686 681556582 681677818 681835949 682012618 682208776 682431161
2092.7 682431161 682604492 682719469 682854950 682986379 683054566 683110535 683168292 683183730 683173776 683188617 683223605
2115.1 683223605 683219314 683143735 683027148 682900667 682766438 682627320 682475030 682317972 682147920 681941986
2135.5 681941986 681741893 681639314 681596935 681512952 681433201 681419373 681473374 681554854 681631207 681718111 681815028
2157.9 681815028 681894720 681968749 682045460 682116389 682188690 682235479 682254672 682277799 682337999 682447970 682561874
2180.4 682561874 682628632 682656050 682654381 682630301 682613790 682598174 682586670 682594240 682614207 682637215 682661474 682680428
2204.8 682680428 682693720 682711840 682742894 682760715 682749808 682746410 682744861 682747245 682777941 682802916 682787895 682766140
2229.3F82766140j1743j7225l2723o7056o8545l6180m6849n6207k4259o5148j11282
2251.8F82228923o7353m2141l5465l2842n6267n2034l7373n0604m0352l7194p5101
2274.2F81702197p6354n0247n2511p7486q9705n4956j0252O855M3451J06931J47939
2296.6F81595862J75893J92702J78099J74403J82629J55448J02997P3552J28150K15054
2317F83174789J88529M1962j3471J85729K56538l6240j46925O9737J49250O4075l6418
2339.5F83897555k42829p33018o98448O13690J495302J007020L3200l72172m02987
2357.8F84597313n32329o90043p70330p47860n98013m27961l58701l58939k86401j68800
2378.2F79657936r2685l8624J9431L1173l9100j08242r7871n0187m3452o6757q0705
$$ plain form
2229.3 682766140 682754397 682737172 682704449 682637393 682568848 682532668 682485819 682429612 682405353 682340205 682228923
2251.8 682228923 682161570 682119429 682083964 682051122 681994855 681942821 681905448 681854844 681814492 681777298 681702197
2274.2 681702197 681625843 681575596 681523085 681445599 681355894 681300938 681290686 681297541 681340992 681447923 681595862
2296.6 681595862 681771755 681964457 682142556 682316959 682499588 682655036 682758033 682831585 682959735 683174789
2317 683174789 683363318 683405280 683391809 683577538 683834076 683797836 683650911 683720648 683869898 683933973 683897555
2339.5 683897555 683654726 682921708 682223260 682836950 684332252 685339272 685372472 685000300 684597313
2357.8 684597313 684064984 683374941 682604611 681856751 681258738 680830777 680472076 680113137 679826736 679657936
2378.2 679657936 679565251 679526627 679546058 679577231 679538131 679429889 679332018 679281831 679238379 679171622 679090917
2400.6F79090917p0095m3094m3392p3552n4837K2054R7752J23381Q8871O7293P4506
2423.1F79279804P5698N7399N9069R3698J16766Q8095J3888k7358l159O4075Q3506
2445.5F79901481M2617M8995J00017O5565o5029j33812r9361m0889j4365m3928j01865
2467.9F79659426j14918j00672j11580j05500p2777m7624j0431L1590M8042N7995N2333
2490.4F79285884K8312K2769j192l2544l2365n7459o0499k9385o5684r8408n9962l9041
2514.9F78860426l2663K980l815l3676l0160k6465l7193p2599j23500j17004n0068
2537.3F78336263k4140l8207n3227p8678q0168p7367j22070j33097r4235j19925j83165
2559.7F77331984j95742j63018j36197j52171k03251k23995j77920j49071j65701j82390
$$ plain form
2400.6 679090917 679020822 678977728 678934336 678860784 678805947 678828001 678925753 679049134 679138005 679205298 679279804
2423.1 679279804 679355502 679412901 679471970 679565668 679682434 679770529 679784417 679757059 679753900 679817975 679901481
2445.5 679901481 679944098 679993093 680093110 680158675 680093646 679959834 679860473 679819584 679805219 679761291 679659426
2467.9 679659426 679544508 679443836 679332256 679226756 679153979 679106355 679095924 679127514 679175556 679233551 679285884
2490.4 679285884 679314196 679336965 679335773 679303229 679270864 679213405 679152906 679123521 679057837 678959429 678899467 678860426
2514.9 678860426 678827763 678830743 678826928 678793252 678763092 678736627 678699434 678626835 678503335 678386331 678336263
2537.3 678336263 678312123 678273916 678220689 678142011 678061843 677984476 677862406 677729309 677635074 677515149 677331984
2559.7 677331984 677136242 676973224 676837027 676684856 676481605 676257610 676079690 675930619 675764918 675582528
2580.1F75582528k01881k17736k08497k01463k25246k59519k60591k36035k35140k07663
2600.5F73328757j32739j08362r3936l2127j5080j7166P152k2232j2279P2360P6592
2623F73050940L3200r358o7294p8439p0274r0838j09255j74463k66790k34306j20998
2645.4F71862125q2314r4354o0677N36L9816O7771J01923J35243J32144Q4639K0146
2667.8F72206998P748Q6070J32978J21831J43111K0564k84314m45187l89100k66194
2688.2F71334505j67549j48117j44482j16229j58965k72155l16203k32279j34707j37984
2708.6F69505835k30790l31461l65436m07934m62175l35455n9306J63495J52231j1266
2729F67617738k8729L8028Q1718J21951J18494J50561K56777L74794L90351K14755
$$ plain form
2580.1 675582528 675380647 675162911 674954414 674752951 674527705 674268186 674007595 673771560 673536420 673328757
2600.5 673328757 673196018 673087656 672993720 672961593 672946513 672929347 672936499 672914267 672901988 672974348 673050940
2623 673050940 673084140 673074782 673007488 672929049 672858775 672767937 672658682 672484219 672217429 671983123 671862125
2645.4 671862125 671779811 671685457 671624780 671625316 671665132 671732903 671834826 671970069 672102213 672186852 672206998
2667.8 672206998 672214746 672300816 672433794 672555625 672698736 672719300 672434986 671989799 671600699 671334505
2688.2 671334505 671166956 671018839 670874357 670758128 670599163 670327008 670010805 669778526 669643819 669505835
2708.6 669505835 669275045 668943584 668578148 668170214 667708039 667372584 667313278 667476773 667629004 667617738
2729 667617738 667589009 667627037 667708755 667830706 667949200 668099761 668356538 668731332 669121683 669336438
2749.4F69336438o6578k12670j63495j80066k88486l09348k38061j22190P391J49846
2769.8F67912781L19898L03388r6321m47869m00782l23713l51727j37746J51574l5703
2790.2F66893780m65095n26011k97189l14593o91652q79586p36475n51402m08829o11841
2810.6F61411107j018763j030266q25763p26700o31630n94378p61568r80199j072287
2828.9F53769553j131773j318515j686692k155065k990604l894627l798723l108561
2845.3F33684993k938390l009379k623498k406001l186524m532040o275892q677661
2861.6F00035608j1191309j3339877j4783501j4177680j0837973o549596k893687L89576
2877.9E26651561L102303M542470M773080M194737L120839J624525R417j335203k725005
$$ plain form
2749.4 669336438 669269860 669057190 668893695 668713629 668425143 668115795 667877734 667755544 667762935 667912781
2769.8 667912781 668232679 668536067 668439746 667991877 667591095 667267382 666915655 666777909 666929483 666893780
2790.2 666893780 666428685 665902674 665605485 665290892 664599240 663719654 662983179 662431777 662022948 661411107
2810.6 661411107 660392344 659362078 658536315 657809615 657177985 656583607 655822039 654841840 653769553
2828.9 653769553 652637780 651319265 649632573 647477508 644486904 640592277 636793554 633684993
2845.3 633684993 630746603 627737224 625113726 622707725 619521201 614989161 608713269 600035608
2861.6 600035608 588844299 575504422 560720921 546543241 535705268 529155672 526261985 526651561
2877.9 526651561 529753864 534296334 539069414 543264151 546384990 548009515 548018932 546683729 543958724
2896.3E43958724m140139m806519m809260m814208m681468l973484l015279k768755
2912.6E10949612l623128m645050m998863n137652n394995n661041n633592n053163
2928.9D70802128m402399l650635k481520j303345l90053J74463n16087l574193q682519
2947.2D45975840j4073044j8164128k0882696k1886110j9919455j5073002q752137
2961.5C27225268k241880M259110J1040419J7421335K2372633K5541663K7433783K8752774
2977.8D61805105K8548360K5424838K0727515J6817510J4230848J2611806J1089921
2992.1E91255903R093046P539630O377578N114138M417360L977358L408850L357768
3008.4F34541631L600955L076195J771570O88731K71023K96414O22034P91490N45323
$$ plain form
2896.3 543958724 539818585 535012066 530202806 525388598 520707130 516733646 513718367 510949612
2912.6 510949612 507326484 502681434 497682571 492544919 487149924 481488883 475855291 470802128
2928.9 470802128 466399729 462749094 460267574 458964229 458574176 458748639 458232552 454658359 445975840
2947.2 445975840 431902796 413738668 392855972 370969862 351050407 335977405 327225268
2961.5 327225268 324983388 329242498 340282917 357704252 380076885 405618548 433052331 461805105
2977.8 461805105 490353465 515778303 536505818 553323328 567554176 580165982 591255903
2992.1 591255903 600348949 607888579 614266157 619380295 623797655 627775013 631183863 634541631
3008.4 634541631 638142586 641218781 642990351 643679082 643950105 644246519 644868553 645660043 646205366
3026.8F46205366O44385J152516J400947R27389K24948O61671J446009J048922R8587
3045.1F53810740k54393K14219N88357L25740O3419j18077j91509K33471P72536J025259
3065.5F56469762O34015k59757n34833J59800J239598J639605P60674q2314r4831j58310
3085.9F59773409j38461N543m46916p28786q9585O25312M02391l22998k55048N65052
3106.3F59389913Q03232J27316J22547J105249J269698L96490o81460j493335j294672
3124.7F59744978k92182L73185Q9109l92974j7524Q35658Q10384l57091j059353n74470
3145.1F59159720O5148O35803J056015K98142r95874j178861n83529j54197k8730q3387
3165.5F58190250j38282j10805p5400p8559o8128m1902k7061l2484k7657Q4758K00748
$$ plain form
3026.8 646205366 646849751 648002267 649403214 650330603 650555551 651217222 652663231 653712153 653810740
3045.1 653810740 653556347 653770566 654358923 654684663 654748082 654630005 654438496 654671967 655444503 656469762
3065.5 656469762 657103777 656844020 656309187 656468987 657708585 659348190 660108864 660026550 659931719 659773409
3085.9 659773409 659634948 659640491 659193575 658464789 658375204 659000516 659402907 659079909 658824861 659389913
3106.3 659389913 660193145 660320461 660443008 661548257 662817955 663214445 662532985 661039650 659744978
3124.7 659744978 659452796 659825981 659915090 659522116 659504592 660340250 661150634 660793543 659734190 659159720
3145.1 659159720 659224868 659860671 660916686 661214828 660218954 659040093 658456564 658302367 658273637 658190250
3165.5 658190250 658051968 657941163 657865763 657787204 657719076 657677174 657650113 657617629 657589972 657674730 657875478
3187.9F57875478N1439j55032j21235j79Q3804J43289J65344J70588J24276J3411L3736
3210.3F58384919J52230J60337J61171J84834L8028p7486P8618K49386M20451R33647
3230.7F60686135J095534m8876j115680q14795j82271K52783P81774O16014m21881
3249.1F60848737p62522l5704M22359p1406n53728l11792p629J86861Q06450J452566
3269.5F61974192P94172n75244j051903q77917n26667j96218j08183l1292L25084R82999
3289.9F60709023J177431M53651m72248j017392p15375N38946J629531J226604m34280
3308.2F63095891j652240j551390p93159k83897j46329K0861M98832P73608J1742q72135
3328.6F59101784o82473j27077L90410J021803P30395k45213n54800n89848l04401
$$ plain form
3187.9 657875478 657926917 657771885 657650650 657650471 657734275 657877564 658042908 658213496 658337772 658351183 658384919
3210.3 658384919 658537149 658697486 658858657 659043491 659081519 659004033 659082651 659332037 659752488 660686135
3230.7 660686135 661781669 661732793 660617113 659802318 659620047 659872830 660654604 661270618 660848737
3249.1 660848737 660086215 660050511 660472870 660401464 659847736 659535944 659528315 659715176 660521626 661974192
3269.5 661974192 662768364 662193120 661141217 660263300 659736633 659540415 659432232 659400940 659726024 660709023
3289.9 660709023 661886454 662340105 661867857 660850465 660135090 660674036 662303567 663530171 663095891
3308.2 663095891 661443651 659892261 659099102 658815205 658668876 658689737 659188569 659962177 659973919 659101784
3328.6 659101784 658419311 658292234 658682644 659704447 660434842 660189629 659634829 659044981 658740580
3347F58740580O03497M80652p49826j039267k33114L77774K22922J08421Q88347J409531
3367.4F60809517L85344j219988j451194m11213J34409k8253k88188m34995j77801
3385.7F57317638O27220J481593J012921m71711p12931N59926J174330j84476j629650
3404.1F59174860j090289J63436M22418j2517n65230p65086l52263j01864k22743j0908
3424.5F56639814N10395P58946M09126J46330L49819r9957j111388j264572o52969
3442.9F55685544l14832l83556m28259m12703m27305m10974k28763M2796j2457l4750
3463.2F53074741M51684Q36611O24538K10106K28345N98669P51853M85719J42276J42515
3483.6F57547057K39253Q8453l3200k1755j56761l30805l44813m05252o47843p51138
$$ plain form
3347 658740580 659344077 659824729 659074903 658035636 657802522 658180296 658403218 658511639 659399986 660809517
3367.4 660809517 661194861 659974873 658523679 658112466 658246875 658218622 657930434 657495439 657317638
3385.7 657317638 657944858 659426451 660439372 659967661 659254730 659814656 660988986 660804510 659174860
3404.1 659174860 658084571 658248007 658670425 658657908 658092678 657327592 656975329 656873465 656650722 656639814
3424.5 656639814 657150209 657909155 658318281 658464611 658814430 658714473 657603085 656338513 655685544
3442.9 655685544 655370712 654987156 654558897 654146194 653718889 653307915 653079152 653121948 653109491 653074741
3463.2 653074741 653526425 654363036 654987574 655197680 655426025 656024694 656776547 657262266 657404542 657547057
3483.6 657547057 657786310 657874763 657841563 657819808 657663047 657332242 656987429 656582177 655934334 655183196
3504F55183196n56827m47392k54929L06964M94957J50263N6744K23219K24233o4314
3524.4F55316114m25219l91305l934K60771K25484o8426k35498J08838K87473m00006
3544.8F54674292j068294p03752l23534m76659l10600M8459K75135M12405j90676j629770
3565.2F50707006j635849O31273J391947M23014j9371J49429N39600J169205J178444
3583.6F54534698o11246k291441n06342J059831Q6605k34484O09457N32687K77996
3601.9F53457761M36723m80354j528263r62078k04206L73721M00245p53879k44200
3620.3F50495470J543939J389503j075983l715157j201094J895726J330972N28157
3636.6F51191533K31921J99735N90086K79248j676857k980471j96993J916587O23584
$$ plain form
3504 655183196 654626369 654178977 653924048 654231012 654725969 654876232 654932976 655156195 655380428 655316114
3524.4 655316114 654890895 654499590 654495656 654756427 654981911 654913485 654677987 654786825 655074298 654674292
3544.8 654674292 653605998 652902246 652578712 652102053 651791453 651839912 652115047 652527452 652336776 650707006
3565.2 650707006 649071157 649702430 651094377 651517391 651498020 651647449 652187049 653356254 654534698
3583.6 654534698 653923452 651632011 651125669 652185500 652272105 652037621 652647078 653179765 653457761
3601.9 653457761 653894484 653414130 651885867 650923789 650719583 651093304 651493549 650739670 650495470
3620.3 650495470 652039409 653428912 652352929 648637772 647436678 649332404 650663376 651191533
3636.6 651191533 651423454 651623189 652213275 652492523 650815666 647835195 647638202 649554789 650178373
3655F50178373K78950J540958Q16048l33667m649n55218k168357q55207M4882j888573
3675.4F47053540k17200K179385J957118J719952J203537o58810k284289q46743J169145
3693.7F51275635J344919N10097n92769r40561M40359J202107j14799k179146j964986
3712.1F48980856R60708J922249P64072l10599o72222o95407o7532J013219O25849
3730.4F52521193j164317k144694l53575K235651J679838k057970l487468M26471L67523
3748.8F48022652k030611N21659K784729J336635k68162L67523R28104J93059l81053
3767.1F51474535p68601k02358J008928J059532J13725o39379l80098k40624l21985
3785.5F51103675K25902O40690N05507j22308o12140l20375j211465j702547L87013
$$ plain form
3655 650178373 650457323 651998281 652814329 652480662 652476013 651920795 649752438 648897231 648942113 647053540
3675.4 647053540 646836340 649015725 650972843 652692795 653896332 653237522 650953233 650106490 651275635
3693.7 651275635 652620554 653130651 652537882 651597321 652037680 653239787 653124988 650945842 648980856
3712.1 648980856 649941564 651863813 652627885 652317286 651645064 650949657 650882125 651895344 652521193
3730.4 652521193 651356876 649212182 648858607 651094258 652774096 650716126 647228658 647655129 648022652
3748.8 648022652 645992041 646513700 649298429 650635064 650366902 650734425 651662529 651855588 651474535
3767.1 651474535 650705934 650503576 651512504 652572036 652685761 652046382 651666284 651425660 651103675
3785.5 651103675 651329577 651970267 652475774 652353466 651741326 651420951 650209486 648506939 648893952
3803.9F48893952K27988j77741J562297J553238n97656j601815m74811j249611j038611
3822.2F47097230J266599J228213O01470K13027n662K05457j032948k207101n26130
3840.6F46840155J063943J557410J842439J191318j700103n790770k446711L612756
3856.9F46170437L137052O34373r55046m56988J33574j154006j027584N32150J228631
3875.2F48242593J079738l71456m37796M42385j74045L3557j60157q95977N49972J428961
3895.6F49737775j20699j656115j758814r40859P52628J809060J241386M42028p8261
3914F49428129p61330p97987O1631K69354j68443J14798M32313j03951k83837K87473
3934.4F48478150M13299K6047m39644n49554j4723R5964k66672j37090K08676K87413
$$ plain form
3803.9 648893952 649121940 648944199 650506496 652059734 651462078 649860263 649385452 648135841 647097230
3822.2 647097230 648363829 649592042 650193512 650406539 650400877 650606334 649573386 647366285 646840155
3840.6 646840155 647904098 649461508 651303947 652495265 650795162 645004392 642557681 646170437
3856.9 646170437 649307489 649941862 648986816 648529828 648663402 647509396 646481812 647013962 648242593
3875.2 648242593 649322331 648950875 648513079 648955464 648781419 648814976 648654819 647758842 648308814 649737775
3895.6 649737775 649617076 647960961 646202147 645261288 646013916 647822976 649064362 649506390 649428129
3914 649428129 648666799 647868812 647930443 648199797 648031354 648146152 648578465 648474514 648190677 648478150
3934.4 648478150 648891449 648917496 648477852 647928298 647913575 648009539 647742867 647605777 647814453 648101866
3954.8F48101866J43111p2777j90139p7903O6995K7538r9063k04146k50578j19269
3975.2F47325635J07467J69695J98185K46286O8486k11239l15010k17915m1306L994
3995.6F47334278p0095
3997.6F47264183
$$ plain form
3954.8 648101866 648244977 648172200 647982061 647904158 647971153 647998691 647899628 647695482 647444904 647325635
3975.2 647325635 647433102 647602797 647800982 648047268 648115754 647904515 647589505 647371590 647330284 647334278
3995.6 647334278 647264183
3997.6 647264183
##END=$$ End of the data block
