##TITLE=Acetato de isoamila - Grupo 3 $$ Begin of the data block
##JCAMP-DX=5.00 $$ ACD/SpecManager v 10.08
##SPECTROMETER/DATA SYSTEM=Alpha
##DATE=22 Oct 2014 14:05:46
##DATA TYPE=INFRARED SPECTRUM
##DATA CLASS=XYDATA
##ORIGIN=
##OWNER=
##NPOINTS=1667
##FIRSTX=599.64648438
##LASTX=3997.64306641
##MAXX=3997.64306641
##MINX=599.64648438
##MAXY=0.74714154
##MINY=0.10248420
##XFACTOR=1.0000000000
##YFACTOR=1.000000000000000e-9
##FIRSTY=0.65824819
##DELTAX=2.03961372
##XUNITS=1/CM
##YUNITS=ARBITRARY UNITS
##XYDATA=(X++(Y..Y))
599.6F58248186j2278020j6944826j4400422l879130O346523J0049642R077489P153273
616F43372715N722284N036890M940987M870057M046917K078056r36687l513991l123105
634.3F62494123M47035L675878M312456M290878N644620P359206P447064O382406N606949
652.7G07660615N377830N131900M476428L653526L318250L627956L857076K295375
669G39398956Q06570J210750J325428R97186P52270N53667M37379M10676L28601K63870
689.4G46485353K91585K23637J04189m1902j38700n0724N3645P8260J01090L5107q7202
711.8G47054338j25944j96159l23534l89159l02434j89244j53363j65284k39193k86401
732.2G44683623k46942j77443j72734k92897n10395o67870p59125r27329j203119j492382
$$ y = [658248186, 645970166, 629025340, 614624918, 610745788, 617092311, 627141953, 636219442, 643372715, 649094999, 654131889, 659072876, 663942933, 667989850, 670067906, 669131219, 665617228, 662494123, 662941158, 666617036, 670929492, 675220370, 680864990, 688224196, 695671260, 702053666, 707660615, 713038445, 718170345, 722646773, 726300299, 729618549, 733246505, 737103581, 739398956, 740205526, 741416276, 742741704, 743738890, 744491160, 745044827, 745482206, 745892882, 746221483, 746485353, 746776938, 747000575, 747104764, 747062862, 746924162, 746873438, 746927083, 747005343, 747106433, 747141540, 747054338, 746928394, 746732235, 746408701, 746019542, 745717108, 745527864, 745374501, 745209217, 744970024, 744683623, 744436681, 744259238, 744086504, 743793607, 743283212, 742615342, 741856217, 740928888, 739725769, 738233387]
752.6G38233387j691699j722633j459003j118719j144648j512528j704633j330971
768.9G26548553n38946K58863Q05080J059592J081169R49621P87258O36756M00782
787.3G31988728J09851l04758q11100j102924j202941j381159j789630k436459l289223
805.6G19780385m083693m229605l546118k824128k591550j901269K44438L075719M818618
824G08742797M722953L467977K026141Q24511M8935q5890J91748L77000J39713m83573
844.4G19972312j155257j772523k205670k006828j120031N3167J096487J593411J518428
862.8G15973496J232446Q22305K41876l96013q75533j096427j134456r31501m83036
881.1G13353157k22564m77552r45747j405716k008557k655268l019035k846479j937211
$$ y = [738233387, 736541688, 734819055, 733360052, 732241333, 731096685, 729584157, 727879524, 726548553, 726009607, 726268470, 727073550, 728133142, 729214311, 730163932, 730951190, 731587946, 731988728, 732098579, 731793821, 730982721, 729879797, 728676856, 727295697, 725506067, 723069608, 719780385, 715696692, 711467087, 707920969, 705096841, 702505291, 700604022, 700848460, 703924179, 708742797, 713465750, 716933727, 718959868, 719784379, 719833314, 719747424, 719939172, 720316172, 720455885, 719972312, 718817055, 717044532, 714838862, 712832034, 711712003, 711765170, 712861657, 714455068, 715973496, 717205942, 718028247, 718270123, 717874110, 716998577, 715902150, 714767694, 713836193, 713353157, 713130593, 712653041, 711707294, 710301578, 708293021, 705637753, 702618718, 699772239, 697835028]
899.5F97835028n28037O35385J049757Q24511L77894p6592p97153j929641l069639
917.8F94321513l381073k193928l33607P67946J087069J377166J862287K124489J728534
936.2F97360396P61092n17547j949728l158271m154026n838037q028388q190215n766034
954.5F60519242m742503o354749n721629j029849K623916J897991m84229r84072J071274
972.9F46795392M027486N556702N034447L935933L444851L173351K339780R64344m29869
991.3F74842417j454293k126456k837419m020334n795478p881999r975613j1898458
1007.6F28852367j3342201j4103651j4311552j3859332j2491763j0811805r913803
1021.8E40018260r866178r578824q022010n420566l030121j573801r05037p66933r75042
$$ y = [697835028, 697306991, 697942376, 698992133, 699816644, 700194538, 700117946, 699320793, 697391152, 694321513, 690940440, 688746512, 688412905, 689180851, 690267920, 691645086, 693507373, 695631862, 697360396, 698121488, 697603941, 695654213, 692495942, 688341916, 682503879, 674475491, 666285276, 660519242, 655776739, 649421990, 643700361, 642670512, 645294428, 647192419, 646708190, 645724118, 646795392, 650822878, 656379580, 661414027, 665349960, 668794811, 671968162, 674307942, 675272286, 674842417, 673388124, 671261668, 668424249, 664403915, 658608437, 650726438, 640750825, 628852367, 615510166, 601406515, 587094963, 573235631, 560743868, 549932063, 540018260, 530152082, 520573258, 512551248, 507130682, 504100561, 502526760, 501621723, 500854790, 499879748]
1040.2D99879748j637340l282428o201774r968966j3692140j5958399j4527500p619083
1056.5D26992118L480524J4223993K0895630K3807049K5169909K5672316K4620653
1070.8E64862192K1950781J8527091J5131354J2194693R807110P828593O253600N095780
1087.1F61651194M208744L481865K862393K279163J689195J176477R32634Q55982N89729
1105.5F79727376n4658q44777j191139q67903m09961l36647l58879J07526P82848O43551
1125.9F77197337o81341k389550l326714k818525j029312R74118J893342J428366N32925
1144.2F71780646K78771P44819J196862J037538K76148p14362j727223k889693m562437
1162.6F65421069p227600j0735333j2835622r096920J253903J0805368J2819111R487212
$$ y = [499879748, 498242408, 494959980, 488758206, 478789240, 465097100, 449138701, 434611201, 426992118, 430472642, 444696635, 465592265, 489399314, 514569223, 540241539, 564862192, 586812973, 605340064, 620471418, 632666111, 642473221, 650301814, 656555414, 661651194, 665859938, 669341803, 672204196, 674483359, 676172554, 677349031, 678281665, 679137647, 679727376, 679672718, 678827941, 677636802, 676768899, 676358938, 676022291, 675663412, 675770938, 676553786, 677197337, 676515996, 674126446, 670799732, 667981207, 666951895, 667926013, 669819355, 671247721, 671780646, 672059417, 672804236, 674001098, 675038636, 675314784, 674600422, 672873199, 669983506, 665421069, 658193469, 647458136, 634622514, 625525594, 626779497, 637584865, 650403976, 659891188]
1178.9F59891188N805731L280461J416743j01507j351893k479672l634632m900277
1195.2F57926142o277680p802904r550392j1474133j3332367j5126407j7329216k0460129
1211.5E56572914k4871349l0966521l9077103m8464268n6613743n9896291n5391639
1225.8B41292000m3651655k9284090j7123089r074792m757821l067986k624467j817092
1242.1A29891008N17756M341438R204179J5173465K2307814K9246091L3593238L4516498
1258.4B78791487L3139110L0299514K6203096K1287561J6512036J3140351J1746734
1272.7D31119889J2319148J4915824J8774211K1637976K1833509K0059586J7968416
1287E58628559J6162872J4283181J2021780R500563O976545M553914K371847Q80957
$$ y = [659891188, 665696919, 668977380, 670394123, 670292616, 668940723, 666461051, 662826419, 657926142, 651648462, 643845558, 634295166, 622821033, 609488666, 594362259, 577033043, 556572914, 531701565, 500735044, 461657941, 413193673, 356579930, 296683639, 241292000, 197640345, 168356255, 151233166, 142158374, 137400553, 134332567, 131708100, 129891008, 130408764, 134750202, 143954381, 159127846, 181435660, 210681751, 244274989, 278791487, 311930597, 342230111, 368433207, 389720768, 406232804, 419373155, 431119889, 443439037, 458354861, 477129072, 498767048, 520600557, 540660143, 558628559, 574791431, 589074612, 601096392, 610596955, 617573500, 622127414, 624499261, 625380218]
1303.3F25380218O67155J939118M050612N870402O689787O285965N136371L873050
1319.6F59892678K713919J625419N98251l74019j344681j902401j624703j160622j466572
1338F56957269j970113j810133j505733j702547k814650n333603r529054j5776217
1354.3F16515219k3907780l3063293m5283019o0406328o1247408l8784027n460501
1368.6C48362863K5837749M3657840M5941263L4367174J9662589P384300l432214j1145056
1384.9E10636508j1741846k246440Q873612J4625430J7450511J9271076K0845473J8998742
1401.2E96713066J4196634J0648370P612825M797935K711177J232505J7643j616359
1417.5F36313796l041208l047466l650069m841626n655110o286383m629492j575709
$$ y = [625380218, 626047373, 627986491, 632037103, 637907505, 644597292, 650883257, 656019628, 659892678, 662606597, 664232016, 664830267, 664456248, 663111567, 661209166, 659584463, 658423841, 656957269, 654987156, 653177023, 651671290, 649968743, 647154093, 641820490, 632291436, 616515219, 592607439, 559544146, 514261127, 453854799, 392607391, 353823364, 348362863, 374200612, 417858452, 463799715, 498166889, 517829478, 525213778, 521781564, 510636508, 498894662, 496648222, 505521834, 520147264, 537597775, 556868851, 577714324, 596713066, 610909700, 621558070, 629170895, 633968830, 636680007, 637912512, 637930155, 636313796, 633272588, 630225122, 626575053, 621733427, 616078317, 609791934, 605162442, 603586733]
1433.9F03586733L10243J342654J176357k02119j950562m051864o493927q006155q636892
1452.2E77074468r519636j3279915j6409219j2939393j1491239j0745466m679263K820075
1468.5E00830412Q885026J7584324K2196054J9668699J7740607J7357826J6360581
1482.8F20623529J3130784R704411P322311N968214M617750K933026J775622J729131
1499.1F67804778K018392J656830k384j356363Q05199J799166J290977O12616M06564
1517.5F75035775L62158J6748N37754P92026P15435R66310L91483k17080O24955L64363
1537.9F79589927j382232o70135J063049J481712J285196Q79943P38382P69139L39925
1556.2F84094906j540244p75814J910150J516164P21812J3530j8001R07481K49863
$$ y = [603586733, 603896976, 605239630, 606415987, 606213868, 604263306, 600211442, 593717515, 585711360, 577074468, 567554832, 554274917, 537865698, 524926305, 513435066, 502689600, 498010337, 500830412, 509715438, 527299762, 549495816, 569164515, 586905122, 604262948, 620623529, 633754313, 643458724, 650781035, 656749249, 661366999, 664300025, 666075647, 667804778, 669823170, 671480000, 671477616, 670121253, 670926452, 672725618, 674016595, 674629211, 675035775, 675397933, 675414681, 675952435, 676744461, 677459896, 678426206, 678817689, 678600609, 679225564, 679589927, 678207695, 677537560, 678600609, 680082321, 681367517, 682247460, 682985842, 683754981, 684094906, 682554662, 681778848, 683688998, 685205162, 685926974, 685940504, 685922503, 686829984, 687079847]
1574.6F87079847q39174J31071O34730J40488n2750r2507j87158k53261k86281k67505
1595F86007500j59681l2723j15991k22444k80381l94344n34534l29674j64210r81510
1615.4F82792008j370609L4928J84179o25313l55005j15514K3663L50416m99666k067446
1635.8F78351641j086414J42097q4579p47263k241552j870692j62899j833916k874017
1654.1F67592406Q64148J529634N13852k07066J33395N20169n55634j092970n18442
1672.5F68779492j041472j345694n92887p53045k427042m035175k327144j687526k542615
1690.9F52026892k875269m701674n877256n791307n853414m003406m694521p363618
1707.2F10866427r176135j1445999j4790356j9865751k7666867k8581589k4191797
$$ y = [687079847, 686240673, 686371744, 687006474, 687146962, 687094212, 687001705, 686814547, 686561286, 686275005, 686007500, 685847819, 685815096, 685699105, 685476661, 685196280, 684801936, 684267402, 683937728, 683773518, 682792008, 681421399, 681456327, 681640506, 681015193, 680660188, 680544674, 680568337, 680918753, 680419087, 678351641, 677265227, 677407324, 677322745, 676575482, 674333930, 672463238, 672300339, 670466423, 667592406, 668456554, 669986188, 670500040, 670292974, 670426369, 670946538, 670390904, 669297934, 668779492, 667738020, 666392326, 665799439, 665046394, 662619352, 658584177, 656257033, 654569507, 652026892, 649151623, 644449949, 638572693, 632781386, 626927972, 622924566, 618230045, 610866427, 601690292, 590244293, 575453937, 555588186, 527921319, 499339730, 475147933]
1721.5D75147933k4978847k7056783k8267533l2111227l8679957n5257202n9974730
1735.7B08821654m3347627l4296065k2572875o120891Q417353K4549619M5506820N9080213
1752B40038201N2804366M3619424L5666257K6298583K2430926J9192279J7065793J9906789
1768.4D77022618K4672598K9491782K7324915K0365357J6358078J4014065J1224449
1782.6F20473862Q791327P025838N437911L992080L538907L526091K991975K350807
1799F58128798K056777K285898K289057K031565J563728J371026J428127J312137R87350
1817.3F73454463Q54850Q03948M28855L07203L37362J10268L11256P47025N58376M78208
1837.7F78391814O89090M20630k16663P4386O99401N79834L87430K18392J17838K921
$$ y = [475147933, 450169086, 423112303, 394844770, 362733543, 324053586, 268796384, 208821654, 165474027, 131177962, 108605087, 102484196, 110901549, 135451168, 180957988, 240038201, 292842567, 336461991, 372128248, 398426831, 420857757, 440050036, 457115829, 477022618, 501695216, 531186998, 558511913, 578877270, 595235348, 609249413, 620473862, 629265189, 636291027, 641728938, 645721018, 649259925, 652786016, 655777991, 658128798, 660185575, 662471473, 664760530, 666792095, 668355823, 669726849, 671154976, 672467113, 673454463, 674309313, 675113261, 675542116, 675849319, 676186681, 676296949, 676608205, 677355230, 677913606, 678391814, 679080904, 679501534, 679284871, 679359257, 680058658, 680638492, 681025922, 681244314, 681362152, 681365073]
1858.1F81365073k6942P1764J73986j06394o03616k22027M33147M18841J80006K17140
1878.5F81900978L21925L98218M77016M43995J94371K56479N23508L61382K31088K50578
1898.9F85359538K17318J11759K9921r8765j58906N842J90019R0123k17259q7798P4804
1921.3F85516596m3988M6134J11639l0100j02103m6611M8995J10626M2618j19329j2636
1943.8F85521841K66373K88010K55763K05398R2566L3259L9101Q0228J12116N5254
1964.2F86949909r6679j02282n9Q941k9386n2809p8559r8765r6798r4652j22488k03669
1988.7F85982704l05831k61903q2254p3314j65284j66058j30296q6367l0637K4974
2009F84705734Q6904J05858L4988l219N6744R9539P6413L6896l040n2154o9678m6849
$$ y = [681365073, 681338131, 681409895, 681583881, 681477487, 680873871, 680651844, 681084991, 681503832, 681683838, 681900978, 682222903, 682621121, 683098137, 683542132, 683736503, 683992982, 684516490, 684877872, 685108960, 685359538, 685576856, 685688615, 685718536, 685619771, 685460865, 685466707, 685656726, 685746849, 685529590, 685441792, 685516596, 685472608, 685518742, 685630381, 685600281, 685498178, 685451567, 685500562, 685611188, 685653806, 685534477, 685521841, 685788214, 686076224, 686331987, 686537385, 686629951, 686663210, 686702311, 686782539, 686894655, 686949909, 686853230, 686750948, 686750889, 686759830, 686730444, 686677635, 686599076, 686500311, 686403513, 686308861, 686186373, 685982704, 685676873, 685414970, 685332716, 685259402, 685094118, 684928060, 684797764, 684711397, 684680760, 684705734, 684792638, 684898496, 684933484, 684930265, 684987009, 685086548, 685162961, 685199857, 685196817, 685144663, 685074985, 685028136]
2033.5F85028136n0843p1168p0035m8042j79M0770K5630m4048j16825j55032j73211
2056F84365153j86026j91331k14994k08795j42872p2539j9967J5795K5272J2100k861
2078.4F83378935Q225P4566J53422K06828K20359K30193K41995K08199J71065J43587
2098.8F85037374R5428M4405K9087L0398J0610j2159J0729L3080j3411j18196k11596
2121.2F84935749k32459k11894k14875k56002k62677k56896k55764k29597j92344j50919
2141.6F82672322j08004o2883l3021O438M1782O0797R2745J19746J06513R8229J03354
2164.1F83098018P5936M7029M6312O0320O2347O2287O9260O7949N2929L5286K265p927
2188.5F83672011K9683L3379P867M530J4961J8001L0219L7074K7657K4795M2499L7193
$$ y = [685028136, 684977293, 684906125, 684836090, 684788048, 684787869, 684828639, 684854269, 684810221, 684693396, 684538364, 684365153, 684179127, 683987796, 683772802, 683564007, 683421135, 683348596, 683328629, 683344424, 683369696, 683381796, 683378935, 683387160, 683461726, 683615148, 683821976, 684042335, 684272528, 684514523, 684722722, 684893787, 685037374, 685132802, 685177207, 685206294, 685236692, 685247302, 685235143, 685245872, 685278952, 685265541, 685147345, 684935749, 684703290, 684491396, 684276521, 684020519, 683757842, 683500946, 683245182, 683015585, 682823241, 682672322, 682564318, 682501435, 682468414, 682474852, 682516634, 682577431, 682670176, 682789922, 682896435, 682994664, 683098018, 683173954, 683220983, 683267295, 683327615, 683389962, 683452249, 683521509, 683589458, 683642387, 683677673, 683679938, 683672011, 683701694, 683735073, 683742940, 683747470, 683762431, 683780432, 683810651, 683847725, 683875382, 683900177, 683942676, 683979869]
2213F83979869K503J1266K6345J1742J1265K0504m947k2948l1471m6730o4671j04249
2237.5F83788478r5546j6987K9683j1027n8651q7619j01149o4790m9412o3956l4213
2259.9F83234811j0550l0220l1352l0815l6598l9696n3525q0347j29819j44065q7559
2282.3F82560265l7312j0908O1214J61886K35856K74956L11196L85523M32193M31776
2302.7F84806645M89831N62906N50985M72665M00782M37200N91934P31170O80625M78626
2323.1F90203369M27305M94242M10616K62857K15650K21550K45810L06964J67071n62429
2343.5F92393005j225948m45307R17256J535416J397908J019835N09322j40012o42776
2361.9F95318699j067221j409352j508951j432538j331449j326084j323998j254857
$$ y = [683979869, 683982372, 683993638, 684019983, 684031725, 684042990, 684063494, 684058547, 684035599, 684004128, 683957398, 683892727, 683788478, 683692932, 683675945, 683705628, 683694601, 683635950, 683548331, 683447182, 683382392, 683332980, 683269024, 683234811, 683224261, 683194041, 683162689, 683131874, 683095276, 683055580, 683002055, 682921708, 682791889, 682647824, 682560265, 682522953, 682512045, 682573259, 682735145, 682971001, 683245957, 683557153, 683942676, 684374869, 684806645, 685296476, 685859382, 686410367, 686883032, 687283814, 687721014, 688312948, 689044118, 689724743, 690203369, 690630674, 691124916, 691535532, 691798389, 692014039, 692235589, 692481399, 692788363, 692955434, 692393005, 691167057, 690721750, 691639006, 693174422, 694572330, 695592165, 696101487, 695961475, 695318699, 694251478, 692842126, 691333175, 689900637, 688569188, 687243104, 685919106, 684664249]
2378.2F84664249j090943q52287o39022m58419k78175j27077q0645j10447j12951o8486
2398.6F80845797m5121n0723k1994k504j2278L1769R4473J43528K00749K09272J63555
2421F81556523J23024J14024J23798J40965J40250J30475J17123O7353J5020J1862
2441.4F82540417L6180K7477l516l219L6836M8876r478q9764j14977r4712j02759j13666
2465.9F82157695j06096j07169j33693j72973j54257o6042K623J7881L6180Q7023J21117
2488.3F81682289J08480R1374Q8632N1499j2517j4484L1232P8559Q5891L8981N365
2510.8F82235301J192J5258L0995N6982N3525J3649K3365M3393p868q4639j10328r1314
2535.3F82179511p2360p5579p2181n8830p8499j10686j06335r0480r6857j22130j65046
$$ y = [684664249, 683573306, 682721019, 682081997, 681623578, 681345403, 681218326, 681137681, 681027234, 680914283, 680845797, 680800676, 680749953, 680727959, 680725455, 680713177, 680744946, 680839419, 680982947, 681183696, 681392968, 681556523, 681679547, 681793571, 681917369, 682058334, 682198584, 682329059, 682446182, 682513535, 682528555, 682540417, 682576597, 682604074, 682600558, 682597339, 682634175, 682683051, 682673573, 682583809, 682468832, 682374120, 682271361, 682157695, 682051599, 681944430, 681810737, 681637764, 681483507, 681417465, 681420088, 681437969, 681474149, 681561172, 681682289, 681790769, 681882143, 681970775, 682022274, 682009757, 681995273, 682026505, 682105064, 682190955, 682229936, 682235301, 682236493, 682251751, 682282746, 682339728, 682393253, 682406902, 682430267, 682473660, 682465792, 682381153, 682270825, 682179511, 682107151, 682031572, 681959391, 681900561, 681822062, 681711376, 681605041, 681514561, 681417704, 681295574, 681130528]
2557.7F81130528k03073k02000j79827j89781k21670k45869k39193j89782j81913k17617
2578.1F79059803k27808k56181l00467k93195k84970l08395l41475l88920l80874l06904
2598.5F75970614k43604j75178q6010j4305K086l2186k7359L6538P2658P0691O4194
2620.9F75638139O0320M0531l0458j24931j49906j21057j26719j70112k68102l46839
2641.3F74400866k92540j85310j25051q0883N364O7294Q6128J44124K04087J84953
2661.7F74409032J04010N9485P7427J04129J31548J26958R2983O4134q0824l16560
2682.1F74772322m12166l62873l15845l22163l32594l04222k76804l02553l47197l49164
2702.5F71446741l20554k48790j89483l05653n15461o42419p35580p92385o23583j68562
$$ y = [681130528, 680927455, 680725455, 680545628, 680355847, 680134177, 679888308, 679649115, 679459333, 679277420, 679059803, 678831995, 678575814, 678275347, 677982152, 677697182, 677388787, 677047312, 676658392, 676277518, 675970614, 675727010, 675551832, 675465822, 675451517, 675453603, 675421417, 675394058, 675430596, 675503254, 675573945, 675638139, 675698459, 675738990, 675708532, 675583601, 675433695, 675312638, 675185919, 675015807, 674747705, 674400866, 674108326, 673923016, 673797965, 673717082, 673722446, 673789740, 673875868, 674019992, 674224079, 674409032, 674513042, 674572527, 674649954, 674754083, 674885631, 675012589, 675105572, 675169706, 675088882, 674772322, 674360156, 673997283, 673681438, 673359275, 673026681, 672722459, 672445655, 672143102, 671795905, 671446741, 671126187, 670877397, 670687914, 670382261, 669866800, 669224381, 668488801, 667696416, 667072833, 666904271]
2722.9F66904271L02970M03047J97649J07824J81735K72334L30448L14474K82705L09527
2743.3F69606984L96669L60965P8261k08080k49922j85132k75731m16100l88265k77459
2763.7F68442190j37508N4896J73270K45989K13444j52826n38350n96821n80370o36876
2784.1F66487038m62890j33633k20359o06417o82831n00739o02066j044333j277864
2802.4F60955906j146793r43542q36492j051425j454711j467050j120925q93831q90672
2820.8F51150465r80914j191198j536847j840472k067804k408385k980412l707647
2837.1F34436786m680037n418837m938066l901601l663063l934086l956675m326999
2853.4E99617422n747021p837593j0446608j3722658j7116964j9900739k1197081j9160986
$$ y = [666904271, 667207241, 667610288, 667807937, 667915761, 668097496, 668369830, 668700278, 669014752, 669297457, 669606984, 670003653, 670364618, 670442879, 670234799, 669984877, 669799745, 669524014, 669107914, 668719649, 668442190, 668304682, 668359578, 668532848, 668778837, 668992281, 668839455, 668301105, 667704284, 667123914, 666487038, 666024148, 665890515, 665670156, 665063739, 664380908, 663880169, 663278103, 662233770, 660955906, 659809113, 658865571, 658029079, 656977654, 655522943, 654055893, 652934968, 652041137, 651150465, 650169551, 648978353, 647441506, 645601034, 643533230, 641124845, 638144433, 634436786, 629756749, 624337912, 619399846, 615498245, 611835182, 607901096, 603944421, 599617422, 593870401, 586032808, 575586200, 561863542, 544746578, 524845839, 503648758, 484487772]
2869.7D84487772j3221294o083220j44571M584014P887185R097278Q348942O278306
2886.1E01234412L599584P74622j789093l818512n569249o926358p201910o563395
2902.4D73740101n844742n159319m111111k969324k744973l819555n268812o222368
2918.7D37599897o886541p511437p957757p746041o593287n139231l595114j861662
2935C90308827l99321N95897R53168m95404m982352j1910290j8729925k3219109k5206893
2953.4C06914598k4530232k0357371j3112932m329562M398346J2425691J9701451K5610238
2969.7C06720227K9553026L1368911L1549245L1134546K9760569K6368380K2104383
2984E08559287J8784105J6546905J4934481J3241112J1092365R375512Q001864O494701
$$ y = [484487772, 471266478, 465183258, 465038687, 469622701, 477509886, 486607164, 494956106, 501234412, 504833996, 505608618, 503819525, 500001013, 494431764, 487505406, 480303496, 473740101, 467895359, 462736040, 458624929, 455655605, 452910632, 449091077, 443822265, 437599897, 430713356, 423201919, 415244162, 407498121, 400904834, 395765603, 392170489, 390308827, 389909506, 390505403, 391458571, 390963167, 385980815, 374070525, 355340600, 332121491, 306914598, 282384366, 262026995, 248914063, 244584501, 248982847, 261408538, 281109989, 306720227, 336273253, 367642164, 399191409, 430325955, 460086524, 486454904, 508559287, 527343392, 543890297, 558824778, 572065890, 583158255, 592533767, 600535631, 607030332]
3000.3F07030332N576372M993081M271865M019857M091739L465355K136230J081586
3016.6F36666417O92964P29978J051783J249433J057863J168609J649618J835227J278460
3034.9F47380352N16117R22978J711249J332104L40343m7267M75824Q35121M67300
3053.3F53934121J78695M4584o8903K71201Q38161J107395O78360j82807m01855K69592
3073.7F56668544J252413J617431Q01623j9729o4492j17004r3401K6763m05669o69837
3094.1F58996642o3658O20365M24445k62797j83761O55770Q91268J60456P6055J043380
3114.5F62358165J263022L95835o66678j397193j176953k24590L98397J03533l98874
3132.8F60654664q3625P55191P97927l10361j038373o20305K7775O53625J073241K92897
$$ y = [607030332, 612606704, 617599785, 621871650, 625891507, 629983246, 633448601, 635584831, 636666417, 637359381, 638089359, 639141142, 640390575, 641448438, 642617047, 644266665, 646101892, 647380352, 647896469, 648819447, 650530696, 651862800, 652203143, 652155876, 652631700, 653466821, 653934121, 654112816, 654157400, 654088497, 654359698, 655197859, 656305254, 656983614, 656800807, 656398952, 656668544, 657920957, 659538388, 660340011, 660320282, 660255790, 660138786, 660045385, 660072148, 659666479, 658996642, 658932984, 659553349, 659977794, 659714997, 659531236, 660187006, 661078274, 661238730, 661314785, 662358165, 663621187, 664017022, 663350344, 661953151, 660776198, 660551608, 660950005, 661053538, 660654664, 660571039, 661326230, 662124157, 661813796, 660775423, 660155118, 660182893, 660836518, 661909759, 662202656]
3153.2F62202656r99689j158595n44608j35779m3869j00613j58488j51694r3043o6042
3173.6F58750236n2690k7001k6584j9848r537N6863J71721J04785n3108q4698m1724
3196.1F58768415N3883J77383K22862K03550J87457Q9705J3053J50025L19958L41236
3216.5F60527527K28107p927j02341Q4698K51412M08173R05514J126945R5665r95040
3236.9F62522733p91430j31488L19719P69139O18696l64602p66218q7142M13537j5795
3257.3F62487149m70638k70188j6272J49787P35759J373708P55907n92530j065314
3275.6F63087368q65817n12302j79112n4538K1100L10957R20594J125813M40716m54724
3296F63840055r80675o85990M64321J443147J106799l77417j550734j519799p97629
$$ y = [662202656, 661202967, 660044372, 659499764, 659363985, 659320116, 659219503, 659061015, 658909321, 658816278, 658750236, 658697546, 658670545, 658643961, 658624113, 658614576, 658671439, 658843160, 658947945, 658894837, 658810139, 658768415, 658822298, 658999681, 659222543, 659426093, 659613550, 659703255, 659716308, 659866333, 660186291, 660527527, 660755634, 660747707, 660645366, 660730064, 660981476, 661389649, 662295163, 663422108, 663517773, 662522733, 661731303, 661599815, 661919534, 662688673, 663307369, 662942767, 662176549, 662089407, 662502944, 662487149, 662016511, 661746323, 661730051, 661879838, 662615597, 663989305, 664745212, 664152682, 663087368, 662221551, 661709249, 661530137, 661475599, 661496699, 661807656, 662728250, 663854063, 664294779, 663840055, 662859380, 662173390, 662637711, 664080858, 665187657, 664810240, 663259506, 661739707, 660942078]
3314.4F60942078k81513j31250k3484L44396O08444l3915q18491o57320j58787L46780
3334.8F60136938R17196N76795l55065o45638o44207k94328N89252M17650p93219j053214
3355.2F58852160k93970K90334K05636J22607Q11040J251340L04342j168728j421392
3373.5F58953369m73917Q8692p4208l89934m93824j76668N18977J229763Q50499m67777
3393.9F59564972p39992L88384R20534l38614j559376r76027R5606K11537j97530o13749
3414.3F56755745q03530n26488k80439l35992j60754K67029M34399J61707k920Q8274
3434.7F55597031l42131j084744j165569p32422n43177o71029p62403p95722q11756
3453.1F48688078p58469o20187m53233m30584l05295J44601N60939O55234N62310N47648
$$ y = [660942078, 660660565, 660529315, 660505831, 660850227, 661458671, 661424756, 660606265, 659948945, 659790158, 660136938, 661054134, 661630929, 661275864, 660630226, 659986019, 659691691, 660280943, 660698593, 659905374, 658852160, 658558190, 658848524, 659054160, 659176767, 659987807, 661239147, 661543489, 660374761, 658953369, 658479452, 658568144, 658493936, 658104002, 657610178, 657433510, 657952487, 659182250, 660032749, 659564972, 658824980, 659213364, 660133898, 659795284, 658235908, 657259881, 657355487, 657567024, 657369494, 656755745, 655952215, 655425727, 655145288, 654809296, 654648542, 654915571, 655349970, 655511677, 655508757, 655597031, 655254900, 654170156, 653004587, 652272165, 651728988, 651057959, 650295556, 649499834, 648688078, 647929609, 647309422, 646856189, 646425605, 646120310, 646264911, 646825850, 647481084, 648043394, 648591042]
3473.4F48591042O21497O13272M79281M12464M09484K30611j3173p8738q3387k40564
3493.8F50941789l80874l61800m92215p81119p83026o49214p46071o82831k10941j7762
3514.2F45835936l22044m18365j93178r0361l81470q34763p73609l58343j26362L7253
3534.6F42374694o8545l66628j13666K14576k75909r41277q37982n09739l88562j74165
3555F38912797O2346L13521N47826M2915j083970o80983J225055J398146N47588M60684
3575.4F41745925P00653J052379J646340J574636P3671j053453L74496J280010M14431
3593.8F47809088L04878J002610Q93652O67989N86272m11511j139462m78804J43409
3612.1F49378121O41405M30465n25534L23355J561284Q44956j274407k741933l30031
$$ y = [648591042, 649212539, 649825811, 650305092, 650717556, 651127040, 651357651, 651344478, 651265740, 651182353, 650941789, 650560915, 650199115, 649706900, 648925781, 648142755, 647493541, 646747470, 646064639, 645853698, 645835936, 645513892, 645095527, 644902349, 644811988, 644430518, 643595755, 642822146, 642463803, 642337441, 642374694, 642306149, 641939521, 641825855, 642040431, 641764522, 640823245, 639985263, 639475524, 639086962, 638912797, 638975143, 639288664, 639836490, 639879405, 638795435, 638114452, 639339507, 640737653, 641285241, 641745925, 642446578, 643498957, 645145297, 646719933, 646793604, 645740151, 646114647, 647394657, 647809088, 648113966, 649116576, 650010228, 650678217, 651264489, 650852978, 649713516, 649234712, 649378121, 650019526, 650449991, 649924457, 650247812, 651809096, 652654052, 651379645, 648637712, 648307681]
3630.5F48307681J566291R29713L80874J37865J81795N28514J37925j517892k045989
3648.8F48606777P09236J804650L08990L79026J520336O62267l36349o5625n76794
3667.2F53012514j513243q1002M5716j510679L10778J870215J527727J415253J000046
3685.6F56077325k46882j255155m28438Q47280J059652M88519l74198m86374O52194
3703.9F56333923R60291l23117j965046j375437J189947J691401O02901k44379m30941
3722.3F56439543m14372M0293P86662K95282j147688j591146K30789K027989Q35240
3740.6F57502592k412141k759695N55873j44064j671970R03368K328932Q94129j87099
3759F55009925M24326N80191l9160l62932n89371R6142R43303O07789j53244m22835
$$ y = [648307681, 649873972, 650803685, 651184559, 651322424, 651504219, 652032733, 652170658, 650652766, 648606777, 649316013, 651120663, 651429653, 651808679, 653329015, 653991282, 653654933, 653589308, 653012514, 651499271, 651418269, 651463985, 649953306, 650264084, 652134299, 653662026, 655077279, 656077325, 655830443, 654575288, 654146850, 654994130, 656053782, 656542301, 656168103, 655681729, 656333923, 657294214, 656971097, 655006051, 653630614, 654820561, 656511962, 657114863, 656870484, 656439543, 656025171, 656065464, 656852126, 657147408, 655999720, 654408574, 654639363, 656667352, 657502592, 655090451, 652330756, 652886629, 652742565, 651070595, 651973963, 654302895, 655197024, 655009925, 655434251, 656014442, 655975282, 655612350, 655022979, 655119121, 656062424, 656670213, 656516969, 656094134]
3779.4F56094134k11418l02374k54095K36392M73380L16561k81275n93900l24071j167416
3799.8F53985918j086951O53386P2718j1504J389563R48668q43883j136601k04980
3818.1F53766334j120150n43654J170099P92980K92003l4153o7354J90080q33094j580954
3838.5F52032137k40743Q43167J332581J517892O04928k094269m860282j002968L412068
3856.9F51544511K285064J36256r38952k16305J15275j058936p07448N34177J009703
3875.2F52703345O56962m92930j32144M31776j26719N1796l48448o13690P28011R50992
3895.6F53808951m36008j391053j349628n76257Q66115J481890R22025L33368j56462
3914F53502941o89030n75184Q1896J30356j56462J20163K12967l16322k98798L56197
$$ y = [656094134, 655882716, 655580342, 655326247, 655562639, 656036019, 656352580, 656071305, 655477405, 655153334, 653985918, 652898967, 653552353, 653625071, 653613567, 655003130, 655951798, 655107915, 653971314, 653766334, 652646184, 652102530, 653272629, 654065609, 654357612, 654323459, 654256105, 654446185, 653613091, 652032137, 651791394, 652634561, 653967142, 655485034, 656089962, 653995693, 649135411, 648132443, 651544511, 653829575, 653965831, 653026879, 652810574, 652925849, 651866913, 651159465, 651693642, 652703345, 653360307, 652867377, 652735233, 653167009, 653040290, 653092086, 652743638, 652129948, 652857959, 653808951, 653372943, 651981890, 650632262, 650056005, 650922120, 652404010, 653326035, 653659403, 653502941, 652813911, 652238727, 652320623, 652450979, 652294517, 652414680, 652627647, 652311325, 652012527, 652368724]
3934.4F52368724M68374P6234m05312m89175K2709P2599k45094o3062J84774R3878
3954.8F52084649k9028j07050j50025j3113O5744j08361k00093j07944j12653p6949
3975.2F51245177M8697J7106Q0407K84672Q4877l25978l20554j19746m8458j8597j132
3997.6F50926471
$$ y = [652368724, 652837098, 652913332, 652508020, 652018845, 652041554, 652114153, 651869059, 651805997, 651990771, 652084649, 652055621, 651948571, 651798546, 651785433, 651851177, 651742816, 651542723, 651434779, 651322126, 651245177, 651293874, 651310980, 651391387, 651676059, 651760936, 651434958, 651114404, 650994658, 650946200, 650927603, 650926471]
##END=$$ End of the data block
