##TITLE=Acetato de isoamila - Grupo 2 $$ Begin of the data block
##JCAMP-DX=5.00 $$ ACD/SpecManager v 10.08
##SPECTROMETER/DATA SYSTEM=Alpha
##DATE=22 Oct 2014 14:05:46
##DATA TYPE=INFRARED SPECTRUM
##DATA CLASS=XYDATA
##ORIGIN=
##OWNER=
##NPOINTS=1667
##FIRSTX=599.64648438
##LASTX=3997.64306641
##MAXX=3997.64306641
##MINX=599.64648438
##MAXY=0.74087620
##MINY=0.05724549
##XFACTOR=1.0000000000
##YFACTOR=1.000000000000000e-9
##FIRSTY=0.63893181
##DELTAX=2.03961372
##XUNITS=1/CM
##YUNITS=ARBITRARY UNITS
##XYDATA=(X++(Y..Y))
599.6 638931811 622847259 601492643 584305286 581128597 591053247 605194032 617302716 626379728
616 626379728 633291662 638979912 644126058 648910582 652672708 653977871 651484907 646030366 641530097
634.3 641530097 641779721 645993829 650663376 655112803 661376595 669903755 678616047 686149538 692833424
652.7 692833424 699187517 705120206 710328639 714710891 718677878 722860157 726914406 729047000
669 729047000 730073571 731539309 732900739 734004676 735057592 736064911 736938596 737532258 737864912
687.3 737864912 738223076 738677382 739019454 739280701 739446461 739511907 739649355 739943504 740329802 740628958
707.7 740628958 740713120 740726590 740841269 740876198 740665495 740378678 740310490 740401566 740346789 740146220 739975631
730.2 739975631 739863753 739823043 739796102 739644825 739426792 739131749 738633156 737864375 736785531 735383987
750.6 735383987 733655274 731657684 729613006 727916658 726669610 725397468 723596990 721488535
766.9 721488535 719909370 719478607 720105350 721307695 722817957 724471331 725982428 727213502 728173912
785.3 728173912 728775799 728958011 728713036 727981746 726770103 725190639 723321795 721001625 717846215
803.6 717846215 713520944 708178997 702775359 698347032 694783986 691409349 688971519 689620018 694246829
822 694246829 701042354 707449615 712245226 715348125 716975689 717538178 717694700 717908859 718116403
840.3 718116403 717926264 717016757 715312719 712841451 709903657 707329512 706020534 706327677 707951248
858.7 707951248 710191965 712385893 714117944 715115964 715301394 714749038 713598907 712103188 710573018
877 710573018 709344327 708634734 708282113 707821727 706796885 704938114 702179074 698646069 694688499
895.4 694688499 690976679 688529372 688062549 689216971 690839171 691998661 692458928 692214906 691007078
913.7 691007078 688404381 684379399 680043519 677315116 676991940 678049088 679434359 681215346 683719516
932.1 683719516 686622798 689068198 690181077 689388573 686604738 682335794 676917195 669464886 659311473
950.5 659311473 649019897 641871810 636025965 628208160 621528566 621163368 625454724 628391206
966.8 628391206 627558172 625547111 626220584 631009817 637936771 644244909 649130881 653364718 657330990
985.1 657330990 660355806 661663353 661171913 659355044 656640470 652989805 647898138 640732050 631094337
1003.5 631094337 618866086 604241848 587831557 570440829 552784741 535704851 520222723
1017.8 520222723 506744862 494508326 482534617 471125633 461818188 455752760 452645898 451380134
1034.1 451380134 450888544 450516701 450016409 448998094 446255594 440116256 429569393 414757073
1050.4 414757073 397318006 381451398 373529583 378413618 395697206 420729339 449116975 478879273
1066.7 478879273 508834243 537151098 562055111 582872272 599833548 613482118 624441683
1081 624441683 633231997 640253603 645948231 650723696 654773355 658126652 660774946 662721336 664096594
1099.4 664096594 665242672 666364789 667172194 667111039 666009963 664446235 663271010 662663460 662098885
1117.7 662098885 661444604 661333084 662045777 662556052 661353171 657976568 653469443 649765313 648452878
1136.1 648452878 649600983 651776552 653323770 653791130 654034972 654878795 656219065 657329440 657534838
1154.4 657534838 656593204 654445112 650838137 645139098 636186838 622961700 607248008 596333027
1170.7 596333027 598198175 611553967 627131283 638545454 645406187 649112999 650524259 650105298
1187.1 650105298 648138940 644778550 640097201 633974850 626167238 616418898 604514718 590330422
1203.4 590330422 573943019 555420280 534358799 509778917 480316967 444310039 400043458
1217.7 400043458 347019523 287735015 228152186 175941437 136925027 112146035 98510757
1231.9 98510757 91777109 88516533 86451679 84521011 83012186 83217353 86525142 94043650 106977507
1250.3 106977507 126698315 153630689 186117604 221202910 256166726 288690120 316831976
1264.6 316831976 339481711 356827438 370542675 383034199 396687955 413669080 435092926
1278.8 435092926 459638238 484281778 506882608 527148247 545434833 561663210 575352073
1293.1 575352073 586179793 594115376 599209905 601758182 602615118 603293955 605563343 610443950
1309.4 610443950 617547035 625583649 633125901 639295161 643828750 646834791 648538351 649083734
1325.8 649083734 648472905 646697879 644331336 642372489 641032517 639398456 637007892 634546578
1342.1 634546578 632464826 630243719 626625597 619798779 607741654 588077784 558772326 519180357
1358.4 519180357 466564268 398520619 331772059 291364223 287402004 316991836 365886062
1372.7 365886062 417107224 455202371 476780862 484526455 480102628 466993809 453232884 450786859
1389 450786859 461896390 480020553 501300037 524531126 549409747 571771979 588289857 600429595
1405.3 600429595 608861625 614056051 616841853 617970765 617964804 616158128 612127602 607820272 603054523
1423.7 603054523 596954584 589957476 582276762 576664150 574991047 575545013 576810300 577859044
1440 577859044 577586472 575478494 570972264 563357711 553847492 543961406 533500254 518443704
1456.3 518443704 498815536 483611137 470916241 459050417 453798234 457431227 468361408 488989115
1472.6 488989115 514572024 537494659 558553934 579412878 599134028 615067005 627072990
1486.9 627072990 636084020 642832875 647927821 651620030 654020905 655830204 657947779 660253406
1503.2 660253406 661371350 660462856 660742104 662272155 663799345 664988995 665933609 666642070 666751325
1521.6 666751325 667171538 667935550 668597460 669609487 670333326 670355797 671226978 672402382 671823740
1539.9 671823740 670843661 671305239 672494173 673852563 675024807 676143587 677484572 678769290 677942336
1558.3 677942336 676276207 677429974 678945601 679974556 680373132 680404663 681343019 681950927 681132615
1576.6 681132615 680913270 681442201 681579769 681498647 681421816 681282878 681095779 680898428 680650949 680452108
1597 680452108 680446208 680437446 680327713 680108547 679726899 679121196 678739786 678810060 678149879 676549613 676295638
1619.5 676295638 676649630 676184714 675801516 675580502 675458133 676010072 676092446 674067497 672207892
1637.8 672207892 671800494 671615481 671123743 668999672 666716695 666559100 664946675 660954535 660793841
1656.2 660793841 662270486 663098335 663027763 663040459 663774490 663553655 662281990 661469042 660173297
1674.5 660173297 658368945 657614410 657208622 655028522 649924457 646160781 643642008 640356719 636991918
1692.9 636991918 631685257 624864757 618142009 611119807 606662989 602094948 594627261 585508645
1709.2 585508645 574626267 560801446 541776121 513554871 483283520 457161188 428827018
1723.5 428827018 396344543 361154616 321317911 275633126 214516371 152399719 111745320
1737.8 111745320 81923239 62653802 57245485 63577995 83429128 122859187 178065971 231879026
1754.1 231879026 280284762 322225392 354484111 382096827 405360997 425752252 448650837
1768.4 448650837 475958616 507618308 536622345 558620572 576715112 592322886 604872227
1782.6 604872227 614806592 622865379 629442751 634584248 638771713 642630816 646185577 649240732
1799 649240732 651841402 654460371 657073915 659572661 661672652 663436294 665059566 666553676 667768955
1817.3 667768955 668890595 670036376 670804024 671325982 671850324 672062576 672275901 673025846 673729837
1835.7 673729837 674327910 675212085 676020980 676022351 675917208 676452994 677000105 677427709 677731931 677936137
1856.1 677936137 678005338 677997768 678052068 678303421 678427756 677926481 677490532 677714109 678129256 678441525
1876.5 678441525 678820848 679271400 679781675 680379093 681021154 681427419 681770682 682368696 682829440 683108211
1896.9 683108211 683395147 683655858 683790267 683843911 683780968 683595955 683495581 683656275 683880329 683765650
1917.3 683765650 683625937 683649182 683552504 683498204 683555722 683530152 683464527 683448017 683508813 683682442 683877230
1939.7 683877230 683886588 683871508 684113801 684420466 684690595 684935868 685110509 685218871 685306609 685404241
1960.1 685404241 685517371 685616493 685579479 685453892 685395062 685384691 685340941 685286462 685235381 685156167 685067058
1982.5 685067058 684980690 684861183 684685767 684380651 683999538 683775067 683632493 683441460 683257818 683101356
2002.9 683101356 682989538 682968020 683029175 683147907 683309495 683428288 683464348 683507860 683597147 683679402 683725595
2025.4 683725595 683715224 683651865 683582067 683542252 683514714 683465958 683395624 683326602 683301389 683321178 683332741
2047.8 683332741 683282018 683166146 683021486 682853043 682658494 682453871 682248890 682046235 681844771 681700051
2068.2 681700051 681632161 681581497 681543052 681547880 681600749 681701601 681881726 682143986 682443082 682739258 683045506
2090.6 683045506 683359325 683628380 683826745 683963597 684056759 684116006 684180975 684256732 684287608 684259892 684234858
2113.1 684234858 684236526 684195638 684055150 683846593 683599412 683322251 683032215 682723045 682421029 682127297
2133.5 682127297 681847453 681613147 681425750 681255579 681102455 681022406 681002319 680996597 681018174 681117296 681279421
2155.9 681279421 681443930 681583464 681719840 681857824 681992769 682125390 682219982 682300210 682392180 682472289
2176.3 682472289 682547092 682633936 682708621 682766736 682781577 682738841 682720602 682738364 682746649 682746708 682769597 682828665
2200.8 682828665 682898521 682927549 682933867 682973266 683039546 683085620 683098376 683115005 683131456 683129191 683111250 683086395
2225.2 683086395 683057666 683050394 683046281 683001280 682949066 682893038 682811201 682741106 682696283 682626307 682529151 682416320
2249.7 682416320 682285905 682169557 682069480 681992412 681945264 681885362 681801438 681714714 681636930 681588709 681536376
2272.2 681536376 681466460 681399226 681286573 681145906 681038022 680933416 680857301 680890143 681018054 681218863
2292.5 681218863 681499898 681842089 682230890 682647645 683080971 683563948 684076130 684547365 684955537 685295105
2312.9 685295105 685654163 686173797 686836123 687448502 687897801 688345194 688844025 689186990 689312577 689443052
2333.3 689443052 689712524 690032661 690316319 690293014 689482987 688250422 688109815 689366162 691030383
2351.7 691030383 692277789 692984760 693241358 692959011 692155123 691027403 689716995 688285351 686848283
2370.1 686848283 685461104 684132934 682926476 681832075 680846274 680051208 679508686 679179728 678956151
2388.4 678956151 678773463 678644359 678541541 678404391 678280056 678207457 678154528 678114593 678087473 678062916
2408.8 678062916 678091764 678211868 678390801 678613782 678845704 679027021 679163754 679311812 679473698 679605842
2429.2 679605842 679714978 679840505 679915249 679870963 679791868 679771900 679786801 679760456 679719865 679711878 679707468
2451.6 679707468 679656267 679552317 679444730 679349124 679222703 679054499 678893685 678731203 678533375 678323567
2472 678323567 678155243 678075612 678058326 678033829 678021014 678078890 678188145 678308904 678424656 678526640 678615928
2494.5 678615928 678685248 678711951 678719580 678771317 678898394 679044306 679132402 679179907 679222465 679265440 679313540
2516.9 679313540 679359078 679369569 679372370 679427922 679485321 679463208 679384470 679310620 679251254 679199934 679146111 679069281
2541.4 679069281 678962529 678858161 678774357 678674996 678552985 678417921 678256512 678061306 677823186 677574158
2561.8 677574158 677337408 677080870 676826179 676571727 676291704 676030338 675771713 675486624 675215304 674962223
2582.2 674962223 674689412 674381256 674025953 673622668 673187613 672743738 672323287 671925306 671594262 671421230
2602.6 671421230 671346903 671265721 671200752 671211898 671289146 671362936 671390176 671410203 671485722 671606064 671689630
2625 671689630 671658158 671501458 671314538 671163917 670992076 670784473 670543909 670222938 669897795 669671237
2645.4 669671237 669492781 669340014 669303119 669380069 669515550 669717908 669967353 670213819 670427978 670587659
2665.8 670587659 670672357 670730352 670833170 670935154 671005368 671084046 671028852 670670748 670188844 669819176
2686.2 669819176 669504881 669141710 668752909 668374896 668017685 667681396 667318583 666905880 666519821 666196346
2706.6 666196346 665902555 665544748 665018857 664320171 663433969 662438571 661663890 661446154 661808729 662371159
2727 662371159 662728846 662902594 663062215 663275242 663593292 663974285 664378226 664821744 665323317 665779412
2747.4 665779412 665927708 665710747 665400028 665183544 664945841 664566934 664099991 663715363 663576663 663663089
2767.8 663663089 663869917 664148092 664342225 664155483 663588941 662959337 662359118 661715090 661195695 660923183
2788.2 660923183 660561144 659859538 659098268 658552110 657947779 656853259 655452371 654150903 653013408
2806.5 653013408 651967049 650707603 649041057 647359133 645984292 644843578 643822730 642765284
2822.8 642765284 641410530 639594078 637404799 634973109 632140696 628579259 624122500 618546665
2839.1 618546665 612200379 606528521 602186143 598330915 594276249 590034366 585145295 578442454
2855.5 578442454 569160283 556789815 540694296 520856619 498049915 473991722 452363253
2869.7 452363253 437514871 430938751 431259096 436890483 446168572 456777781 466472715 473677248
2886.1 473677248 477632135 478146315 475584835 470667481 463830948 455653191 447378904 439916551
2902.4 439916551 433313340 427672416 423403174 420406193 417583197 413588822 408033699 401356995
2918.7 401356995 393833429 385530055 376671940 368016571 360617310 354847282 350799114 348603159
2935 348603159 347906768 348270863 349155396 348611504 343310744 330703914 310945213 286612481 260538012
2953.4 260538012 235463902 214857861 201786339 197716296 202526882 215524390 236002848 262662411
2969.7 262662411 293647915 326833665 360350639 393442720 425222695 453717828 478029102
2984 478029102 499046981 517730176 534663200 549817681 562695026 573691368 583164692 590945363
3000.3 590945363 597645402 603612363 608621001 613202572 617870033 621896744 624389827 625672340
3016.6 625672340 626624703 627679765 629057646 630688250 632132113 633552134 635389626 637469888
3032.9 637469888 639033198 639892638 641180158 643162429 644660294 645159006 645261824 645775676 646663606
3051.3 646663606 647319317 647688031 647839129 647882402 648294330 649215400 650403023 651163042 650981843 650619209
3071.7 650619209 651035488 652436316 654173970 655057490 655037761 654960275 654888868 654878259 654989839 654638350
3092.1 654638350 653977752 653919995 654567420 655043960 654879987 654744685 655344009 656230509 656457663 656571746
3112.4 656571746 657656014 658987522 659494102 658924162 657527804 656343818 656095207 656415045 656503916
3130.8 656503916 656171322 656151414 656923890 657716274 657417834 656427145 655887961 655950487 656528890 657522440
3151.2 657522440 657875240 657016158 655888557 655259073 655048430 654962063 654848814 654725671 654609740 654510081
3171.6 654510081 654427409 654346526 654282451 654303133 654399455 654461741 654523134 654654205 654707134 654638052 654599845
3194 654599845 654676020 654876232 655122280 655337214 655550063 655755460 655892968 656015098 656207621 656476319
3214.4 656476319 656790197 657084823 657219946 657206893 657290399 657559514 658017814 658971429 660163403 660336614
3234.8 660336614 659410894 658683002 658591270 658921719 659713149 660353303 659981668 659236372 659237385 659749866
3255.2 659749866 659752786 659212112 658874393 658853829 659020483 659758151 661177993 662034929 661561072 660599709
3275.6 660599709 659744084 659201324 659057617 659023643 658995271 659268498 660216033 661408544 661884248 661431491
3296 661431491 660479426 659836471 660350800 661862850 663014770 662651598 661113918 659589231 658782542
3314.4 658782542 658517122 658450544 658544004 658969283 659619153 659624219 658781171 658052325 657869220 658273101
3334.8 658273101 659320533 660044491 659729481 659032762 658358395 658072829 658743501 659315407 658644855
3353.1 658644855 657635689 657350004 657643199 657855272 657987475 658843279 660188675 660573900 659468293
3371.5 659468293 658082128 657615483 657781184 657856762 657602966 657175303 657033980 657634377 658968329
3389.8 658968329 659892440 659455299 658734202 659196377 660280406 660146236 658739984 657773256 657763839 657979488
3410.2 657979488 657970369 657517970 656783104 656378388 656261921 656006455 655871212 656187475 656695426 656929076
3430.6 656929076 656946301 657035410 656734228 655653536 654453635 653700829 653055787 652160347 651165903 650200069
3451 650200069 649189532 648150980 647294879 646747172 646271884 645906329 646127045 646948457 647920907 648856699
3471.4 648856699 649859965 650932610 651921451 652729034 653428078 654055655 654532850 654838681 655004680
3489.8 655004680 655069172 655036330 654897511 654730856 654523611 654056609 653382361 652788162 652191997 651605427
3510.2 651605427 651420355 651479483 651290417 651005566 650955617 650997162 650702775 649941385 649199009 648891866
3530.6 648891866 648900807 648978472 648823082 648480892 648547947 648943961 648735404 647705674 646774292 646220207
3551 646220207 645693302 645424306 645584285 646007359 646585107 646784544 645848274 644686282 645145059 646272361
3571.3 646272361 646737695 646930039 647320628 648134410 649658799 651314437 651388407 649716616 649235845
3589.7 649235845 650137067 650418639 650480151 651185572 651732266 651984274 652425170 652157664 650916994 650099576
3610.1 650099576 649987042 650409818 650820971 650153995 649818778 651018977 652268231 651602447 648597062
3628.5 648597062 647308648 648515821 649371445 649601817 649648547 649811268 650502503 651194215 650357485
3646.8 650357485 648165286 647878587 649213254 649592757 649866462 651196957 651863992 651665628 652033746
3665.2 652033746 652157784 650892675 650562644 650755107 649113834 648687720 650222242 651744246 653323412
3683.5 653323412 654658735 654573858 652972102 652028501 652650893 653762698 654402196 654107988 653501749
3701.9 653501749 654075205 655363142 655631006 653950691 652017176 652528167 654156566 654984295 654895127
3720.2 654895127 654479146 654017389 654019535 654936969 655675471 655062795 653469145 653016686 654699266 656065762
3740.6 656065762 654335678 651430011 651746690 651763022 649612367 649784744 652082682 653189898 652908921
3759 652908921 653132141 653827310 653969884 653577328 652745247 652433515 653265476 654280186 654545486 654044569
3779.4 654044569 653575182 653190792 652802110 652865708 653319299 653809488 653889358 653611541 653548717 652629972
3799.8 652629972 651261985 651505411 651420474 651054978 652326345 653709352 653374493 652315736 652101278
3818.1 652101278 650909901 649773240 650614917 651497245 651922226 652138591 652390003 652879000 652196050
3836.5 652196050 650437176 649926245 650534093 651600897 653131306 654302835 653041184 648086369 645826340
3854.8 645826340 648719013 651219785 651704669 650922835 650558412 650658250 649666369 648788631 649138331
3873.2 649138331 650035560 650832176 650511026 650229454 650638223 650528252 650541008 650359154 649645984 650072694
3893.6 650072694 651186287 651165783 649967790 648532748 647581577 647991478 649302304 650236070 650644958
3912 650644958 650667429 650091648 649438679 649479449 649724603 649598181 649639487 649926662 649715781 649257898
3932.3 649257898 649367869 649738908 649825752 649515212 649081290 649066150 649124622 648842156 648665607 648806632
3952.7 648806632 648986161 648958802 648731112 648543775 648532748 648555040 648477435 648291171 648078203 647916794
3973.1 647916794 647863388 647924244 647965729 648054063 648253679 648276985 648049414 647846043 647790670 647783101 647731662
3995.6 647731662 647670031
3997.6 647670031
##END=$$ End of the data block
