##TITLE=Acetato de isoamila - Grupo 1 $$ Begin of the data block
##JCAMP-DX=5.00 $$ ACD/SpecManager v 10.08
##SPECTROMETER/DATA SYSTEM=Alpha
##DATE=22 Oct 2014 14:05:46
##DATA TYPE=INFRARED SPECTRUM
##DATA CLASS=XYDATA
##ORIGIN=
##OWNER=
##NPOINTS=1667
##FIRSTX=599.64648438
##LASTX=3997.64306641
##MAXX=3997.64306641
##MINX=599.64648438
##MAXY=1.07959378
##MINY=0.28394356
##XFACTOR=1.0000000000
##YFACTOR=0.000000010000000
##FIRSTY=1.02601540
##DELTAX=2.03961372
##XUNITS=1/CM
##YUNITS=ARBITRARY UNITS
##XYDATA=(X++(Y..Y))
599.6A02601540j887846k416766j820737m6974J570803K060801J730811J204014P46632
$$ 102601540 100713694 98296928 96476191 96429217 98000020 100060821 101791632 102995646 103742278
618A03742278L90768J49154k4104k05576m36890p37846r48811p74467k37930J62852
$$ 103742278 104133046 104282200 104258096 104052520 103615630 102877784 101928973 101154506 100916576 101079428
638.4A01079428J44041O1250K67303N83720O94239O28257N43475M58252L52061K58279
$$ 101079428 101223469 101284719 101552022 102135742 102829981 103458238 104001713 104459965 104812026 105070305
658.8A05070305J93691J46461J29056J48677J06633K3687K0850L7265N4478L6562k766
$$ 105070305 105263996 105410457 105539513 105688190 105794823 105818510 105839360 105876625 105931103 105967665 105964899
681.2A05964899m53J3173N793J2005K2792J0407j788J1874L1614K4223l218j5140K205
$$ 105964899 105964446 105977619 105983412 105995417 106018209 106028616 106026828 106038702 106070316 106094539 106091321 106076181 106078386
707.7A06078386J4139J2421J1444P916J3137R989j2731j7882j561J1825P403j2111
$$ 106078386 106092525 106104946 106116390 106124306 106137443 106147432 106134701 106116819 106115258 106127083 106134486 106122375
732.2A06122375j9777j4484j5080j8752k8467n1832p0310q0108j10245j61600k01226
$$ 106122375 106102598 106088114 106073034 106054282 106025815 105973983 105903673 105823565 105713320 105551720 105350494
754.7A05350494j95288j49763j10137j16420j68932k01845j45781k5487Q0693J50335
$$ 105350494 105155206 105005443 104895306 104778886 104609954 104408109 104262328 104236841 104317534 104467869
775.1A04467869J96314K07734J89197J62184J32191R3448M7613N698m3106j06252j63698
$$ 104467869 104664183 104871917 105061114 105223298 105355489 105448937 105496550 105502248 105459142 105352890 105189192
797.5A05189192k08044k55012l36635m67122n92661o09136m93705l79193l58891k74789
$$ 105189192 104981148 104726136 104389501 103922379 103329718 102720582 102226877 101847684 101488793 101214004
817.9A01214004O6256N21565P70092P32708N62334L77428K13623J07575P1728N7864
$$ 101214004 101280260 101801825 102571917 103304625 103866959 104244387 104458010 104565585 104637313 104695177
838.3A04695177K2352l5274r6762j65618k54786l15022k80166j38676N6088K11119
$$ 104695177 104717529 104682255 104585493 104419875 104165089 103850067 103569901 103431225 103487313 103698432
858.7A03698432K81954K80869K24328J37246M5884m0961j07789j46639j58429j23489
$$ 103698432 103980386 104261255 104485583 104622829 104668713 104627752 104519963 104373324 104214895 104091406
879.1A04091406n7638j6188k5464q4948j81091k87437l84868m46844m19962k59936
$$ 104091406 104033768 104017580 103992116 103907168 103726077 103438640 103053772 102606928 102186966 101927030
899.5A01927030j1229J85251K37143J84953J03390J3352j04571k64883m31966m73321
$$ 101927030 101915801 102101052 102338195 102523148 102626538 102639890 102535319 102270436 101838470 101365149
919.9A01365149k85375n698J49285J88041K40207L27861L84462L36349J66893n9926
$$ 101365149 101079774 101074076 101223361 101411402 101651609 101979470 102363932 102700281 102867174 102807248
940.3A02807248k78974m48191n88083q28946j152927j178699p96324o23441q72588
$$ 102807248 102528274 102080083 101492000 100663054 99510127 98331428 97535104 96911663 96039075
958.6I6039075p75397l1060N59342M16142o6597k45571P0429N84805Q66199P93194
$$ 96039075 95263678 95232618 95791960 96208102 96141505 95895934 95966363 96551168 97417367 98210561
979I8210561O07288N30398N17136M17846K07222j6308j66929k54011l52567n25332
$$ 98210561 98817849 99348247 99865383 100283229 100490451 100474143 100307214 100053203 99700636 99175304
999.4I9175304p76988j074421j381368j665622j884943k008885k050925k004856j832950
$$ 99175304 98398316 97323895 95942527 94276905 92391962 90383077 88332152 86327296 84494346
1017.8H4494346j600378j461620j444089j384628j135266p44807l79694j42717l6782
$$ 84494346 82893968 81432348 79988259 78603631 77468365 76723558 76343864 76201147 76164365
1036.1G6164365j8233k9189p9423k75707o78092j211536j743186k081793j912070r72628
$$ 76164365 76146132 76116943 76037520 75761813 75083721 73872185 72128999 70047206 68135136 67162508
1056.5F7162508N74058K098215L061884L467304L605145L598315L377962K944588K436239
$$ 67162508 67736566 69834781 72896665 76363969 79969114 83567429 86945391 89889979 92326218
1074.9I2326218J975840J587403J260495J005143Q17603O70397N54598M63462L80575
$$ 92326218 94302058 95889461 97149956 98155099 98972702 99643099 100197697 100661159 101041734
1093.2A01041734L06368K37680J73068J39546J37150J06693Q428j16682j78826j31059
$$ 101041734 101348102 101585782 101758850 101898396 102035546 102142239 102150667 102033985 101855159 101724100
1113.6A01724100n5325n9819r2626l0517Q4173P1407j35744m15158n71048m73834j72561
$$ 101724100 101668775 101608956 101516330 101485813 101569986 101641393 101505649 101090491 100519443 100045609 99873048
1136.1I9873048J42080K90215K29501Q7953L5119J03462J78444J53291M3118r7227
$$ 99873048 100015128 100305343 100534844 100622797 100657916 100761378 100939822 101093113 101136231 101039004
1156.5A01039004k54357m29523o61689j036012j563149j912481j378542J82080J633424
$$ 101039004 100784647 100355124 99693435 98657423 97094274 95181793 93803251 93985331 95618755
1174.8I5618755J933330J410532Q23063M21708J57285m1580k18070l82512n43887p18587
$$ 95618755 97552085 98962617 99785680 100207388 100364673 100323093 100105023 99722511 99178624 98460037
1195.2I8460037r16744j146787j402158j669037j928413k188045k497524k916384l493475
$$ 98460037 97543293 96396506 94994348 93325311 91396898 89208853 86711329 83794945 80301470
1213.6H0301470m271698n259854o322503p124317p250756o466427m955361l265264
$$ 80301470 76029772 70769918 64447415 57323098 50072342 43605915 38650554 35385290
1229.9C5385290j892525r98545n19293l33068k81716j84422Q6602N24062J073626J749936
$$ 35385290 33492765 32494220 31974927 31641859 31360143 31175721 31262323 31786385 32860011 34609947
1250.3C4609947K568236L399342L998890M252139M220826L934872L413534K745390
$$ 34609947 37178183 40577525 44576415 48828554 53049380 56984252 60397786 63143176
1266.6F3143176K094430J662075J522809J650441K040911K591949K992756L011930
$$ 63143176 65237606 66899681 68422490 70072931 72113842 74705791 77698547 80710477
1282.9H0710477K756619K468133K227062J975113J667488J319647R67419O27416L17085
$$ 80710477 83467096 85935229 88162291 90137404 91804892 93124539 94091958 94719374 95036459
1301.3I5036459J01835P8064K77602O00875Q80104J004166R36687P57890N66882L89743
$$ 95036459 95138294 95216358 95493960 96094835 96974939 97979105 98915792 99673682 100240564 100630307
1321.7A00630307K24877O8175q0394k19202l05844k90394k20888k01488k25222k35826
$$ 100630307 100855184 100923359 100842965 100623763 100317919 100027525 99806637 99605149 99379927 99144101
1342.1I9144101k32851k65515m32003q20040j457108k381712l560459m829270o383014
$$ 99144101 98911250 98645735 98213732 97393692 95936584 93554872 89994413 85165143 78782129
1360.4G8782129q190936q090347n003780n56707L632271O117642O487805M768204K591330
$$ 78782129 70591193 62500846 57497066 56940359 60572630 66690272 73178077 77946281 80537611
1378.8H0537611Q51298o60396j740140j759094l12048J322025K200002K665019K918982
$$ 80537611 81388909 80728513 78988373 77229279 76917231 78239256 80439258 83104277 86023259
1397.1H6023259L126484K793730K006226J459009J000959N85871L03054Q8013j11360
$$ 86023259 89149743 91943473 93949699 95408708 96409667 96995538 97298592 97386605 97275245
1415.5I7275245l01534m37283m84127n98884p69812r00775r65214p18897k82961R4676
$$ 97275245 96973711 96536428 96052301 95453417 94683605 93782830 92817616 92098719 91815758 91910434
1435.9I1910434L14349J97029l8058k79897n74064r11576j155728j310247j449186
$$ 91910434 92224783 92421812 92383754 92103857 91529793 90618217 89462489 88152242 86703056
1454.3H6703056j822168k130913j781547j620818j446163o18202L22998J207095K645433
$$ 86703056 84880888 82749975 80968428 79347610 77901447 77283245 77606243 78813338 81458771
1472.6H1458771L381133K917338K602029K571076K424347J890469J361310J072449
$$ 81458771 84839904 87757242 90359271 92930347 95354694 97245163 98606473 99678922
1488.9I9678922Q97669O24908L77452K88415K82824K42066J31178k6297k8658K13658
$$ 99678922 100576591 101201499 101578951 101867366 102150190 102392256 102523434 102497137 102468479 102682137
1509.3A02682137K41697J46354N9855M5847N4598P0286J40524J50549J45531J27971
$$ 102682137 102923834 103070188 103130043 103175890 103230488 103300774 103441298 103591847 103737378 103865349
1529.7A03865349N2154K8265P4112j0025j26243L2628K15411K35569J71495J12605
$$ 103865349 103917503 103945768 104019880 104009855 103883612 103916240 104131651 104367220 104538715 104651320
1550.1A04651320Q5878M6397l4774j10197J12879K66898J64426P5733K4188N2893J00851
$$ 104651320 104737198 104783595 104748821 104638624 104751503 105018401 105182827 105258560 105282748 105335641 105436492
1572.6A05436492K3377j8299P6521Q8405K4212j0646k3007k6047k6822l2294k7490
$$ 105436492 105459869 105441570 105518091 105606496 105630708 105620062 105597055 105571008 105544186 105511892 105484402
1595A05484402j0216J967j1933k6023m2320o3169p6472o4111p2944j39416j36208k6584
$$ 105484402 105474186 105476153 105464220 105438197 105395877 105332708 105256236 105192125 105119181 104979765 104843557 104816973
1619.5A04816973k9230p1537k2424j812k02j9420j25789k24340r2101n305p9751j87063
$$ 104816973 104787743 104716206 104693782 104691970 104691768 104672348 104546559 104322219 104230118 104224813 104145062 103957999
1643.9A03957999l27754k75564j21570k20847k19989R8550J29748L8635k122K9004
$$ 103957999 103630245 103354681 103233111 103012264 102792275 102890825 103020573 103059208 103057086 103086090
1664.3A03086090J0502j12116j42634r1898j32907j67823j53911k27034l85129m82297
$$ 103086090 103096592 102984476 102841842 102749944 102617037 102449214 102295303 102068269 101683140 101200843
1684.7A01200843l38614l26979m64201n40161p68960r16850q10105p13033n34015n92018
$$ 101200843 100862229 100535250 100071049 99530888 98761928 97845078 97034973 96321940 95787925 95195907
1705.1I5195907q71408j129001j440007j866388k455139l363758l609842l288740l577417
$$ 95195907 94324499 93195498 91755491 89889103 87433964 84070206 80460364 77171624 73594207
1723.5G3594207m070098m431486n030375n662752p092809p194814n006481l640541
$$ 73594207 69524109 65092623 60062248 54399496 47306687 40111873 35105392 31464851
1739.8C1464851k298874p71621N78851K269056M897607P056400O948754O580800O085318
$$ 31464851 29165977 28394356 28973207 31242263 36139870 43196270 50145024 56725824 62811142
1758.2F2811142M838872M197687L415626K716029K765954L036505L395956L049201
$$ 62811142 67650014 71847701 75263327 77979356 80745310 83781815 87177771 90226972
1774.5I0226972K219379J782537J557898J282227J048428Q43078O31821N01406N14353
$$ 90226972 92446351 94228888 95786786 97069013 98117441 98960519 99592340 100093746 100608099
1792.8A00608099M83882L87156L37291L28469L52108L29841K85422K33996K27392K26760
$$ 100608099 101091981 101479137 101816428 102144897 102497005 102826846 103112268 103346264 103573656 103800416
1813.2A03800416J96266J55366J30033J04022N8103N2225N6267N7292R2030J18875
$$ 103800416 103996682 104152048 104282081 104386103 104444206 104496431 104552698 104609990 104702020 104820895
1833.6A04820895Q4627P2944Q1980M5932P343N3286J08064Q9192O0546L5453K1422
$$ 104820895 104905522 104978466 105060446 105106378 105113721 105167007 105275071 105364263 105424809 105460262 105481684
1856.1A05481684P510Q727R858p343m1700n2321K1351P7259O3682M0448M8625O0857
$$ 105481684 105489194 105497921 105507779 105500436 105458736 105406415 105427766 105505025 105568707 105609155 105657780 105718637
1880.5A05718637P0321P1037O0618N0854O9595Q5711O3360N7209N4621L7647J6713
$$ 105718637 105788958 105859995 105920613 105971467 106041062 106126773 106190133 106247342 106301963 106339610 106356323
1903A06356323L922j1480j8191L910K3174J0288j3841j120J0252N841J6058K1422N805
$$ 106356323 106360245 106348765 106330574 106334484 106357658 106367946 106354105 106352985 106363237 106369078 106385136 106406558 106412363
1929.5A06412363r525r012N364J8835J2208J394K3771N6803N3549L8135K8610K5153
$$ 106412363 106402838 106393826 106399190 106418025 106430233 106431627 106455398 106512201 106565750 106603885 106632495 106657648
1954A06657648K4593K1315J5986J2123N520q703j371J5354R323q71J479O67o556j1075
$$ 106657648 106682241 106703556 106719542 106731665 106737185 106728482 106727111 106742465 106751788 106750917 106752396 106753063 106746507 106735432
1982.5A06735432j2791j6940k8884l9494l1293j0108r430j9252j6332j0192n710J144
$$ 106735432 106722641 106705701 106676817 106637323 106606030 106595922 106586492 106567240 106550908 106540716 106535006 106536150
2007A06536150J0836J6606J6057J2863J1706J6702K2769K1696J3053K599r18j395n841
$$ 106536150 106546986 106563592 106579649 106592512 106604218 106620920 106643689 106665385 106678438 106681037 106680119 106678724 106672883
2033.5A06672883q965q535j0061q226L291J3208J2672O795j550j2267k0611k4915k6369
$$ 106672883 106663918 106655383 106645322 106637096 106640387 106653595 106666267 106673062 106671512 106659245 106638634 106613719 106587350
2060A06587350k6691k6440j7226j228J359l743J752J2923J8096J5926J9801L3998M5705
$$ 106587350 106560659 106534219 106516993 106515765 106517124 106513381 106515133 106528056 106546152 106562078 106581879 106615877 106661582
2086.6A06661582M6587M7219M9567M0877K7144K1827J9360J6534J8454J5902J1575
$$ 106661582 106708169 106755388 106804955 106845832 106872976 106894803 106914163 106930697 106949151 106965053 106976628
2109A06976628Q583M113J240n400j8967k7489k5368k6143l0636k9815l1113l8862l6073
$$ 106976628 106985211 106989324 106990564 106985164 106966197 106938708 106913340 106887197 106856561 106826746 106795633 106756771 106720698
2135.5A06720698k5201k0766j8633j3971q523j717P307J5045K1350K2340K0730K1089
$$ 106720698 106695497 106674731 106656098 106642127 106633604 106631887 106639194 106654239 106675589 106697929 106718659 106739748
2160A06739748K3031K6941K9481K7108K4223K3329J6427J0681J0908J3876J7226J4555
$$ 106739748 106762779 106789720 106819201 106846309 106870532 106893861 106910288 106920969 106931877 106945753 106962979 106977534
2184.5A06977534O092K062P355J3495J2004O390R334J5211J4162J0824J2839J8180
$$ 106977534 106983626 106985688 106993043 107006538 107018542 107024932 107034266 107049477 107063639 107074463 107087302 107105482
2208.9A07105482J7368J3495J1921Q023L647N162P928P736L481M53m41j740J2L469
$$ 107105482 107122850 107136345 107148266 107156289 107159936 107165098 107173026 107180762 107184243 107184696 107184255 107182515 107182527 107185996
2237.5A07185996K098j848r90k038o366r012q416n925n412p582q237l886k837m662
$$ 107185996 107188094 107186246 107185256 107183218 107176852 107167840 107159424 107153499 107148087 107140505 107132268 107128382 107125545 107120883
2266A07120883m136l743O67M995N37m471o938j2397j6499j1718j133O199J0622J5890
$$ 107120883 107116747 107113004 107113671 107118666 107119203 107114732 107107794 107095397 107078898 107067180 107066047 107072246 107082868 107098758
2294.6A07098758K1041K6607L2187L2782K6834J7882J2350J3709J5461J8072K6501
$$ 107098758 107119799 107146406 107178593 107211375 107238209 107256091 107268441 107282150 107297611 107315683 107342184
2317A07342184K8979J9968J7643L1268L8863L6454L7122L1542K4891K8968L9947L5906
$$ 107342184 107371163 107391131 107408774 107440042 107478905 107515359 107552481 107584023 107608914 107637882 107677829 107713735
2341.5A07713735j6928q3637m8971N4300J14882J09243P0775L6335R644l4535p5352
$$ 107713735 107696807 107613170 107564199 107618499 107733381 107842624 107913399 107949734 107959378 107924843 107849491
2363.9A07849491q7846r9873j07837r2721q0025p8201o3158l7074j7893p093l004n507
$$ 107849491 107761645 107661772 107553935 107461214 107381189 107302988 107239830 107202756 107184863 107177770 107174766 107169259
2388.4A07169259n651l183o556j1564j2970j1265m506K551K742N674J7441K7918L2902
$$ 107169259 107163608 107160425 107153869 107142305 107129335 107118070 107113564 107116115 107118857 107124531 107141972 107169890 107202792
2414.9A07202792L1710L2675L4273K8634K7382K5189J7667J3399J3125J6475J8573
$$ 107202792 107234502 107267177 107301450 107330084 107357466 107382655 107400322 107413721 107426846 107443321 107461894
2437.4A07461894J4841R179M173j812O91R263R310J192o747q095n984o580j0634j8132
$$ 107461894 107476735 107485914 107490087 107488275 107488966 107498229 107507539 107508731 107501984 107493889 107487905 107481325 107470691 107452559
2465.9A07452559k3889j9658j2564j1957j0741l814L576J0299J6380K0110K0969K1315
$$ 107452559 107428670 107409012 107396448 107384491 107373750 107369936 107373512 107383811 107400191 107420301 107441270 107462585
2490.4A07462585K3651K2626J4424O974N603O354J2028J8847J7893J1194K170p75K539
$$ 107462585 107486236 107508862 107523286 107530260 107535863 107542217 107554245 107573092 107590985 107602179 107604349 107603574 107606113
2516.9A07606113L195J812M494Q833J0610O950l82P16K825k587k146J812J526J371
$$ 107606113 107609308 107611120 107615614 107624447 107635057 107642007 107641625 107642341 107645166 107642579 107640433 107642245 107643771 107645142
2545.5A07645142j788o855q475j0240j5712k2829k4652k4510k9242l0327k6571k6083
$$ 107645142 107643354 107636499 107628024 107617784 107602072 107579243 107554591 107530081 107500839 107470512 107443941 107417858
2569.9A07417858k9338l0327k8789k8407k1720j5807k5547l7110l9255m7148o1619
$$ 107417858 107388520 107358193 107329404 107300997 107279277 107263470 107237923 107200813 107161558 107114410 107052791
2592.4A07052791o5529n6362m1092k8777k4116j5461L826J7083J5938J3530J2732J2326
$$ 107052791 106987262 106930900 106889808 106861031 106836915 106821454 106825280 106842363 106858301 106871831 106884563 106896889
2616.8A06896889J6296J6642R322L981L46p796j5390j8346k0659k1684k0504k1017
$$ 106896889 106913185 106929827 106939149 106943130 106943476 106935680 106920290 106901944 106881285 106859601 106839097 106818080
2641.3A06818080k1637j9109j5270r990k39J4043K8801L7444M0138M2867M2212K9075
$$ 106818080 106796443 106777334 106762064 106752074 106751835 106765878 106794679 106832123 106872261 106915128 106957340 106986415
2665.8A06986415O855r310r573L58K599p570j0324l135n972j8931l2174m2963m8078
$$ 106986415 106993270 106983960 106974387 106974745 106977344 106969774 106959450 106956315 106950343 106931412 106899238 106856275 106808197
2692.3A06808197m7123m7314m4084l5155l4225l8969m1497m1044m0566n1356p9787
$$ 106808197 106761074 106713760 106669676 106634521 106600296 106561327 106519830 106478786 106438220 106386864 106307077
2714.7A06307077j12176j32727j25277p2241P784R4116J45304J10019L8230L123K3830
$$ 106307077 106194901 106062174 105936897 105864656 105872440 105966556 106111860 106221879 106260109 106263232 106287062
2737.2A06287062P2277R1064O9034K3281j0788J168K8277K5391q964l9149m7779m7910
$$ 106287062 106359339 106450403 106519437 106542718 106531930 106533098 106561375 106586766 106577802 106538653 106490874 106442964
2761.6A06442964l8695j1623K1446L0696l147m2284k6226l45k5845o0177p7820j09732
$$ 106442964 106404269 106392646 106414092 106444788 106441641 106399357 106373131 106372786 106346941 106286764 106208944 106099212
2786.1A06099212j35016r8455m3142m9913r4759j05644q9287j01889j40333j71697
$$ 106099212 105964196 105865741 105822599 105772686 105677927 105572283 105482996 105381107 105240774 105069077
2806.5A05069077j87707j82986j77574j84965j74571j49345j31917j31977j66225k24662
$$ 105069077 104881370 104698384 104520810 104335845 104161274 104011929 103880012 103748035 103581810 103357148
2826.9A03357148k82335l47507m38547n57149o90615p65252p04825n24336l01069j63829
$$ 103357148 103074813 102727306 102288759 101731610 101040995 100275743 99570918 99046582 98745513 98581684
2847.3I8581684k37626m99904q04949j095623j419026j788586k192837k622712l019100
$$ 98581684 98344058 97844154 97039205 95943582 94524556 92735970 90543133 87920421 84901321
2865.7H4901321l203154k914190k051789q72057K02793R45317J369864J519597J382327
$$ 84901321 81698167 78783977 76732188 75860131 76062924 77008241 78378105 79897702 81280029
2884H1280029J008326N28806L9792m10193p63589r85503j085532j076895r88054q60227
$$ 81280029 82288355 82817161 82856953 82446760 81683171 80697668 79612136 78535241 77547187 76686960
2904.4G6686960p04777n23931l52203k46734k61360m21632o81942r55373j179970j306802
$$ 76686960 75982183 75458252 75106049 74859315 74597955 74176323 73494381 72539008 71359038 70052236
2924.8G0052236j297867j134002q38590n11032k53034p6186M6932O7014j59902p45546
$$ 70052236 68754369 67620367 66781777 66270745 66017711 65941525 65988457 66055471 65895569 65150023
2945.2F5150023j620710k534402l189689l429162l252572k664888j707202n33715O74960
$$ 65150023 63529313 60994911 57805222 54376060 51123488 48458600 46751398 46217683 46892643
2963.6D6892643J826793K865481L688383M214865M426593M397869M246032L984112
$$ 46892643 48719436 51584917 55273300 59488165 63914758 68312627 72558659 76542771
2979.9G6542771L591198L141045K723313K371537K088642J854051J646453J451558
$$ 76542771 80133969 83275014 85998327 88369864 90458506 92312557 93959010 95410568
2996.2I5410568J261246J079178R07570P65091O46001N13434L99888L43931L10445
$$ 95410568 96671814 97750992 98658562 99423653 100069654 100583088 100982976 101326907 101637352
3014.5A01637352K87807K70879K41458K20072K19036K27785K27952K03573J76967J89972
$$ 101637352 101925159 102196038 102437496 102657568 102876604 103104389 103332341 103535914 103712881 103902853
3034.9A03902853K09450J73974J27590J29759J54651J49798J10519Q4793Q3590Q3256
$$ 103902853 104112303 104286277 104413867 104543626 104698277 104848075 104958594 105043387 105126977 105210233
3055.3A05210233R2101J00028P8893M3154K5153M6134Q4794R0062N9426J9574L505
$$ 105210233 105302334 105402362 105481255 105524409 105549562 105595696 105680490 105770552 105829978 105849552 105853057
3077.8A05853057L0112N7638N9986N7471M9579M5407N6040N2702K9922N066Q798M8816
$$ 105853057 105883169 105940807 106000793 106058264 106107843 106153250 106209290 106261992 106291914 106296980 106305778 106354594
3102.2A06354594N3835J2219J168K6000K4438n424j2696J2040M6945P0274O0844K3186
$$ 106354594 106408429 106420648 106421816 106447816 106472254 106466830 106454134 106466174 106513119 106583393 106644237 106667423
3126.7A06667423o497l266J4007J0145j5652j8001J6725L6168K1208k432l1674m7183
$$ 106667423 106660926 106657660 106671667 106681812 106666160 106648159 106664884 106701052 106722260 106719828 106688154 106640971
3151.2A06640971j3471L1400K9218M899k944k146q631j4173n305p27j0491j3864q225
$$ 106640971 106627500 106658900 106688118 106693017 106690073 106687927 106679296 106665123 106659818 106659091 106648600 106634736 106626511
3177.7A06626511K217J5879J9466J4127Q476Q738J7964K3342J9931K1899K7073K3925
$$ 106626511 106628728 106644607 106664073 106678200 106686676 106695414 106713378 106736720 106756651 106778550 106805623 106829548
3202.2A06829548K4462L1614L4738L4034L1173K9159L2794M1020L9411K7442K3043
$$ 106829548 106854010 106885624 106920362 106954396 106985569 107014728 107047522 107088542 107127953 107155395 107178438
3224.6A07178438K4390J5891l458l051L3927N9342M3321K3091N257j9598j0872L1984
$$ 107178438 107202828 107218719 107215261 107212210 107246137 107305479 107348800 107371891 107377148 107357550 107346678 107378662
3249.1A07378662M9948J8525j0168N960K3187K1147J7989K575k8944m8149j8680L1650
$$ 107378662 107428610 107447135 107436967 107442927 107466114 107487261 107505250 107507825 107478881 107430732 107412052 107443702
3273.6A07443702M7672L4189K2173J9419J5176N233j2422l4093l7134j0753K8563N1081
$$ 107443702 107491374 107525563 107547736 107567155 107582331 107587564 107575142 107541049 107503915 107493162 107521725 107572806
3298A07572806K8086l1746p0000m7183J3352N6469M7314J5891P999J1706J908k2471
$$ 107572806 107600892 107569146 107499146 107451963 107465315 107521784 107569098 107584989 107592988 107604694 107606602 107584131
3322.5A07584131l5739l755L4129K5499p808m4000o3431l4464R728K2947J7953n459
$$ 107584131 107548392 107544637 107578766 107604265 107596457 107552457 107489026 107454562 107464290 107487237 107505190 107499731
3347A07499731m1092k4116L2401L6848m876k2018k599J20m2498o2418o640O6292P4363
$$ 107499731 107458639 107434523 107466924 107503772 107498896 107476878 107474279 107474399 107431901 107369483 107362843 107429135 107503498
3373.5A07503498L0195J526O235K2733K2459N961k2758o5565m9710L0303M0245m1306
$$ 107503498 107533693 107535219 107541454 107564187 107586646 107592607 107569849 107504284 107454574 107484877 107525122 107483816
3398A07483816p2217J5664R0158M0818l1448l8373j1516K5809L6979k599k2733k218
$$ 107483816 107411599 107427263 107517421 107558239 107526791 107488418 107476902 107502711 107539690 107537091 107514358 107512140
3422.5A07512140r668n7518q5390n8770n5122q7106l4035P5507Q3089j1754r7441j19603
$$ 107512140 107502472 107444954 107359564 107300794 107245672 107158566 107124531 107200038 107283127 107271373 107173932 107054329
3446.9A07054329q8084q0383j19555j49536j77645j88423j05071l5262j09637j27518
$$ 107054329 106966245 106885862 106766307 106616771 106439126 106250703 106145632 106110370 106000733 105873215
3467.3A05873215J09542L81088L81243J89519J5879N078J79303K14183M5168J0837
$$ 105873215 105982757 106363845 106745088 106934607 106950486 106955564 107134867 107349050 107394218 107405055
3487.7A07405055Q4328M2963o2191j04535o1178n0330j03629j0335J18589M6098q6939
$$ 107405055 107489383 107532346 107470155 107365620 107304442 107254112 107150483 107140148 107258737 107304835 107217896
3510.2A07217896j44589r5773j776J0908o5005j42598j01173J6367M3440J085m7159
$$ 107217896 107073307 106977534 106975758 106986666 106921661 106779063 106677890 106694257 106737697 106738782 106691623
3532.6A06691623j01400q4579j8072m7445j28496j19066j3554N5575K1816N36K4736
$$ 106691623 106590223 106505644 106487572 106440127 106311631 106192565 106179011 106234586 106256402 106256938 106281674
3555A06281674J2088k0969j4186J0645k2721n6827L6943J35100J18363O3455M3273
$$ 106281674 106293762 106272793 106258607 106269252 106246531 106189704 106226647 106361747 106480110 106543565 106586838
3577.5A06586838L2604J6546j323k6453M196R2948R5880M1926K4950K0361R644K5773
$$ 106586838 106619442 106635988 106634665 106608212 106612408 106705356 106801236 106843162 106868112 106888473 106898117 106923890
3601.9A06923890L6967k098m0591k6154j4639j1695j4138o3121l9840O3860P6282k4128
$$ 106923890 106960857 106958759 106918168 106892014 106877375 106865680 106851542 106788421 106748581 106812441 106888723 106864595
3626.4A06864595j56641p8308P8881P2026K8920J0133J573J2684j561r8122j92344
$$ 106864595 106707954 106629646 106708527 106780553 106809473 106819606 106821179 106833863 106832302 106734180 106541836
3648.8A06541836k7406J88589J37592J3232L4094R2983J02770Q2112J1265p9179k6596
$$ 106541836 106514430 106703019 106840611 106853843 106887937 106980920 107083690 107165802 107177067 107097888 107071292
3671.3A07071292K1267o8760J7834J51539J39737J03474K9206j11103j31929N9807
$$ 107071292 107092559 107023799 107041633 107193172 107332909 107436383 107465589 107354486 107222557 107282364
3691.7A07282364J54186J20425R1314N1820l480K3889O5744R859q3983p5150N7101
$$ 107282364 107436550 107556975 107648289 107700109 107696629 107720518 107786262 107796121 107712138 107636988 107694089
3714.1A07694089J07789N0927j7774m3381k1064L0804P8082L0255j08409j80888o8843
$$ 107694089 107801878 107852805 107835031 107791650 107770586 107801390 107879472 107909727 107801318 107620430 107551587
3736.5A07551587R7060J40810K2602j18971l9244k551q4758J1206J20354N8269j9765
$$ 107551587 107648647 107789457 107812059 107693088 107653844 107651293 107566535 107577741 107698095 107756364 107736599
3759A07736599K6083O4040Q189l0422l7360k587O0809M4966m3643q6069j4973L0124
$$ 107736599 107762682 107826722 107834911 107804489 107767129 107764542 107825351 107870317 107826674 107740605 107725632 107755756
3783.5A07755756J6725J9944J4925Q965p248m5705k6584l5298p9453K2924M5669q34
$$ 107755756 107772481 107792425 107807350 107816315 107809067 107763362 107736778 107701480 107622027 107644951 107690620 107689786
3807.9A07689786O3634O8784m2761j22010n9331n5861m6444P1430P5459L7039Q297
$$ 107689786 107753420 107822204 107779443 107657433 107598102 107542241 107495797 107567227 107642686 107679725 107688022
3830.4A07688022l3856m3237o7544p2885J2196N8817O1930R4688J00755O32j95324
$$ 107688022 107654166 107610929 107543385 107470500 107482696 107541513 107603443 107698131 107798886 107799518 107604194
3852.8A07604194j64175Q0740J26207M7135m0817m2105L708m2570n5289J5771N4097
$$ 107604194 107440019 107520759 107646966 107694101 107653284 107611179 107614887 107572317 107517028 107532799 107586896
3875.2A07586896O0702j1301m8518j3328l0041J5176M0030k2256J7690Q0371J1015
$$ 107586896 107647598 107636297 107587779 107574451 107544410 107559586 107599616 107577360 107595050 107675421 107686436
3897.7A07686436q8978r6798m2533L6096Q4794O2120L0613P999l7301m5776J0407L7086
$$ 107686436 107597458 107500660 107458127 107494223 107579017 107641137 107671750 107679749 107642448 107596672 107607079 107644165
3922.1A07644165J9180J7321Q309l4535m3070J2124N0223L5190r346m1699j5939N007
$$ 107644165 107663345 107680666 107688975 107654440 107611370 107623494 107673717 107708907 107699561 107657862 107641923 107646930
3946.6A07646930n781J0824J9133J061l696j1253k8813j7786M351j132j4735j2886
$$ 107646930 107641149 107651973 107671106 107672167 107668471 107657218 107628405 107610619 107614970 107613838 107599103 107586217
3971.1A07586217m923l803l731k611J562J4436K6154K5296J2112k110q643p486k980
$$ 107586217 107581294 107577491 107573760 107571149 107572711 107587147 107613301 107638597 107650709 107648599 107639956 107632470 107629490
3997.6A07629490
$$ 107629490
##END=$$ End of the data block
