##TITLE=Acetanilida $$ Begin of the data block
##JCAMP-DX=5.00 $$ ACD/SpecManager v 10.08
##SPECTROMETER/DATA SYSTEM=Alpha
##DATE=25 Jun 2015 11:03:10
##DATA TYPE=INFRARED SPECTRUM
##DATA CLASS=XYDATA
##ORIGIN=
##OWNER=
##NPOINTS=1765
##FIRSTX=399.76428223
##LASTX=3997.64306641
##MAXX=3997.64306641
##MINX=399.76428223
##MAXY=0.82745808
##MINY=0.40075672
##XFACTOR=1.0000000000
##YFACTOR=1.000000000000000e-9
##FIRSTY=0.82479674
##DELTAX=2.03961372
##XUNITS=1/CM
##YUNITS=ARBITRARY UNITS
##XYDATA=(X++(Y..Y))
399.8H24796736J17183l70324o18457j163006j099170m4941J84893j18613N37157N00023
420.2H22721481p49528k76983L81529o89983p63595J73748l82126o24478K62976n31554
440.6H19521487j317561R537R6440q28445j44064M1604j073122n22793L39270o16550
461H15505803m88878J33932r95517j251519j20103p90894j477539m12047o47843j850069
481.3H07605326j177072j073897k602101k244949j535654l088295m295350n713164
497.7G85874844j1491120k1656215k8855205k4141014j8403947j0995388K0523488
511.9F90855443M9630523M1758657J8376589L736555j323759l302157q048296j6079009
528.3G75604546k8042972l3592045r160340K8376937L5671413J9080400P755578M112303
$$ y = [824796736, 824913919, 824543595, 823925138, 822762132, 821662962, 821618021, 821802914, 821684301, 822221458, 822721481, 821971953, 821694970, 822076499, 821386516, 820622921, 820796669, 820414543, 819790065, 820053041, 819521487, 818203926, 818213463, 818309903, 817481458, 817337394, 817378998, 816305876, 815783083, 816122353, 815505803, 815016925, 815150857, 814155340, 812903821, 812783718, 811992824, 810515285, 810103238, 809455395, 807605326, 806428254, 805354357, 802752256, 800507307, 798971653, 795883358, 791588008, 785874844, 774383724, 752727509, 723872304, 699731290, 681327343, 670331955, 690855443, 740485966, 782244623, 800621212, 804357767, 803034008, 799731851, 791683555, 775604546, 747561574, 713969529, 704809189, 733186126, 768857539, 787937939, 795693517, 799805820]
544.6G99805820J749217J203239J948536J318753P61568J164019M24505o47188j01566
562.9H07626903k2948j062929q73864k46882q58367q52406J4544o35863j271903n76377
583.3H01239908p11262j475215j131535j229942k494633k884924l332139o530761j2713850
601.7G68735647j9235492j4878928P479250K6073218K1394908O605327j492679l39866
618G94341385L380061L441333J416207k63512q32499l63051o61612j304984q25882
636.4G98327446p18415j579702j600206j041174j257658j213789q61227j652956k844691
654.7G85557628l587187n414307p943928o645978j042783M210294N762875K865016
671G73761630L86655j269638k631724m438698o622792r009003j3975561k4713039m0785492
$$ y = [799805820, 801555037, 802758276, 804706812, 806025565, 806787133, 807951152, 808375657, 807728469, 807626903, 807603955, 806541026, 805667162, 805420280, 804561913, 803709507, 803724051, 803088188, 801816285, 801239908, 800528646, 799053431, 797921896, 796691954, 794197321, 791312397, 787980258, 781449497, 768735647, 749500155, 734621227, 742100477, 768173695, 789568603, 796173930, 794681251, 794341385, 797721446, 801162779, 802578986, 802315474, 801482975, 801119924, 800458312, 799153328, 798327446, 797609031, 796029329, 794429123, 793387949, 792130291, 790916502, 790055275, 788402319, 785557628, 781970441, 776556134, 768612206, 761966228, 760923445, 765133739, 770896614, 773761630, 774148285, 772878647, 770246923, 765808225, 759185433, 750176430, 736200869, 711487830, 670702338]
689.4F70702338m9945056l3765257K64883L2665372N4727435N2484453K9704392J0005355
705.7G66843915N73933k847791l885567m733085n195558n200863n639971o125450o102681
724.1G27686882o548583p483244q158625q996307j0580481j2279093j4089942j6792059
740.4F42758548k0208776k4398744l0478775l8133026m1518509l2355875j3010949
754.7D42653894K383322J1451662K7512967M7800928N3210378M3983936L6615074L2749176
771F98361337K5132120J6168296J0827899Q478165O898403N586505M839778M146516
787.3G80439019L398895L203989L162443K691269K438009K620160K413631K040863
803.6H02408278J993597J752913J254498J060308Q23736K22325J35064O56545P84874
$$ y = [670702338, 620757282, 586992025, 587256908, 619922280, 674649715, 727134168, 756838560, 766843915, 767417848, 764570057, 760684490, 755951405, 750755847, 745554984, 739915013, 733789563, 727686882, 721138299, 713655055, 705496430, 696500123, 685919642, 673640549, 659550607, 642758548, 622549772, 598151028, 567672253, 529539227, 488020718, 455664843, 442653894, 445037216, 456488878, 484001845, 531802773, 585013151, 628997087, 665612161, 698361337, 723493457, 739661753, 750489652, 758967817, 765866220, 771452725, 776292503, 780439019, 783837914, 787041903, 790204346, 792895615, 795333624, 797953784, 800367415, 802408278, 804401875, 806154788, 807409286, 808469594, 809293330, 809515655, 809650719, 810307264, 811092138]
822H11092138N71072N63145J82629r91106k612293m937053p185042n193233J795828
840.3G93286085O072462K524912m387140m952848M084945J1244118Q972227L956199
856.6H20800960J561642R65297O01768K37644J61410P0273k17914k86102k32399m13477
877H23249102m34816k07484m01080q78393j075566j541317k465546k911627l005326
895.4H10327947m111171o987035j2158811j8920183j9170284l205598J7669022K2357404
911.7G85801291J3743222O336689L234864K130091J630902P86901L3080Q6129J24633
930.1H13907802k89976m64261n28991j050592j410067j452386k034247l098250m446685
948.4G99132347o327152o870985n513370p797659j4810979j3745546K450764J7368078
$$ y = [811092138, 811663210, 812226355, 812408984, 811417878, 808805585, 803868532, 796683490, 791490257, 793286085, 799358547, 801883459, 797496319, 792543471, 796628416, 807872534, 816844761, 820800960, 822362602, 823327899, 823929667, 824167311, 824328721, 824398994, 824181080, 823894978, 823662579, 823249102, 822814286, 822606802, 822205722, 821327329, 820251763, 818710446, 816244900, 813333273, 810327947, 806216776, 799229741, 787070930, 768150747, 748980463, 745774865, 763443887, 785801291, 799544513, 805881202, 809116066, 811246157, 812877059, 813663960, 813697040, 813783169, 813907802, 813617826, 813153565, 812624574, 811573982, 810163915, 808711529, 806677282, 803579032, 799132347, 792805195, 785934210, 780420840, 772623181, 757812202, 744066656, 746517420, 763885498]
964.7G63885498J7941058J1118233M427433P86960K99811m43100k589703l858447k657831
983.1G88909912r45568r29296j857936l526330p064224j1944294j0219037K631187
999.4G55054414R660125J089156r258628j3782680j5016973j2212455k274573J0780215
1015.7G24038601J6022742J1783480P288933N615950K121150l435015p794023r476781
1032G46165037q339405o739557p068813n264997L317356J3498247J7069697J4139295
1048.4G66776860R605169N836248L375590K181351J385153O32584L28898K35856j01507
1066.7G90256202m58777j018941k277255l975928n838037o663680k500891N572557
1083G73095250Q929491N719900K207876Q02636J04427k40743k20597l76940o44266
$$ y = [763885498, 781826556, 792944789, 797372222, 798159182, 798458993, 798015893, 795426190, 791567743, 788909912, 787964344, 787035048, 785177112, 781650782, 774586558, 762642264, 752423227, 755054414, 764714539, 765803695, 756545067, 742762387, 727745414, 715532959, 713258386, 724038601, 740061343, 751844823, 759133756, 764749706, 766870856, 763435841, 755641818, 746165037, 737825632, 731086075, 724017262, 718752265, 722069621, 735567868, 752637565, 766776860, 776382029, 782218277, 785593867, 787775218, 789160371, 789792955, 790121853, 790357709, 790256202, 789797425, 788778484, 786501229, 782525301, 776687264, 770023584, 767522693, 773095250, 782024741, 787744641, 789952517, 790755153, 790859580, 790618837, 790398240, 790021300, 789377034]
1101.4G89377034o39439p40528j102686j233578j011550n12064K29001O24896L16143
1119.8G85307229r3878j28329j97589l64006r7095K01880K2352r2029J2993j87635
1140.1G84383893m42445m31001o03557r96053j169861j466691k459943m823089o728292
1158.5G65262961k811193L492951L679753L47733j393080k122104l590166o695032
1174.8G56171823r763122n542934Q091688J6095638J0147155J826584j316428j742423
1191.1G73967981j787960j754105j335621r72450j135111j362800j351178j303911
1207.5G62964845j167476j119316j346707j275003o72698m62652j363158k834618l621578
1225.8G49101639k396703J05023R84133l76582j890421k592087l156424m082918n144715
$$ y = [789377034, 788737595, 787997067, 786894381, 785660803, 784649253, 784137189, 784366190, 784991086, 785307229, 785213351, 785085022, 784887433, 784523427, 784426332, 784628212, 784650564, 784558535, 784571528, 784383893, 783941448, 783510447, 782906890, 781910837, 780740976, 779274285, 776814342, 771991253, 765262961, 762451768, 765944719, 769624472, 769972205, 768579125, 766457021, 762866855, 756171823, 746408701, 740865767, 748957455, 765053093, 775200248, 777026832, 775710404, 773967981, 772180021, 770425916, 769090295, 768117845, 766982734, 765619934, 764268756, 762964845, 761797369, 760678053, 759331346, 758056343, 757383645, 756920993, 755557835, 752723217, 749101639, 746704936, 746809959, 747794092, 747417510, 745527089, 742935002, 739778578, 735695660, 730550945]
1244.2G30550945o263375p668615r172201j0642171j2602806j5769482k0430743k4436355
1260.5F23565197k0133019j95920K8209090M5475900M1796506K6036024J1213362K218425
1276.8G58185565k100348l784299m477441n139590o095886p383227q762121j0141552
1293.1G10301101j1526286j2126685j1058330r180606p835090o272137m732489p525206
1309.4F40044272j6280651k6282311l2774627l3266842k5841773j1596203O531954
1323.7E00533819K6020527M4184625N8566690O0493469M4845343K3164451P378339
1338G65187263j119077n053758p078171q186042q730233r236097r761453j0381282
1354.3G05641150j1672735j3697326j7249882k3953676l0458510k9380322j5667975
$$ y = [730550945, 724287570, 716618955, 707446754, 696804583, 684201777, 668432295, 648001552, 623565197, 603432178, 603236258, 631445348, 676921248, 718717754, 744753778, 755967140, 758185565, 756085217, 752300918, 747823477, 742683887, 736588001, 729204774, 720442653, 710301101, 698774815, 686648130, 675589800, 666409194, 658574104, 652301967, 647569478, 640044272, 623763621, 597481310, 564706683, 531439841, 505598068, 494001865, 500533819, 526554346, 570738971, 629305661, 689799130, 734644473, 757808924, 765187263, 764068186, 759014428, 751936257, 743750215, 735019982, 725783885, 716022432, 705641150, 693968415, 680271089, 663021207, 639067531, 608609021, 579228699, 563560724]
1368.6E63560724Q273483K8697133L5259723K7917326J7169237R518504M429579J313567
1384.9F96139276p16865k555013k783179j60754L536523L835320J052499j760662m016280
1403.3F92570865n927920o827355p446289q629083r507954j0051370j2038887j5693962
1419.6F16448045j6729057j7307580j8241524j7719925j7966747j6569436j1061191
1433.9E00852585k970308O139010J1446595J4653325J7899275K1506906K7715623L4559071
1450.2F31802082L6815047L1285704K1496117R698450M99606l630519p087588r427190
1466.5G11451709r305954j0021507j2790919j4052629j4007032j5552163j8744469
1480.8F16977036k2770166k5787652k2862613k961695K2350907J9978464l113449k8230488
$$ y = [563560724, 571834207, 600531340, 635791063, 663708389, 680877626, 690396130, 694825709, 696139276, 695422411, 692867398, 690084219, 689923465, 693459988, 697295308, 698347807, 696587145, 692570865, 686642945, 679815590, 672369301, 663740218, 654232264, 644180894, 632142007, 616448045, 599718988, 582411408, 564169884, 546449959, 528483212, 511913776, 500852585, 497882277, 504021287, 515467882, 530121207, 548020482, 569527388, 597243011, 631802082, 668617129, 699902833, 721398950, 731097400, 731597006, 727966487, 720878899, 711451709, 702145755, 692124248, 679333329, 665280700, 651273668, 635721505, 616977036, 594206870, 568419218, 545556605, 542594910, 564945817, 584924281, 581810832, 553580344]
1497.1E53580344k9979408O46472L1918764M7440767M3060124J6895354J228333l537894
1513.4F61252856n928993p195950p770061r103715r329260r118795j0313750j0398745
1529.7E92093587j0460258j1379122r516597o872594n593420k441942k05457j637221
1546E43986976o353974j3470113j9243420j9830852j1810810Q643806L5388351M2047918
1562.4E59357882M5039951M2192996K9511571J7505824Q153499L089189P17044j701176
1578.7G03866780o372273j4886797k3710608k8491914l1901837l8283348m5997560
1593E14222443m8005462l5660714j0885953J2357056K6391208L2886684L0886084K0685553
1609.3E42876899J0804117O198704J566410m981398k516389P629812J4788091J2615561
$$ y = [553580344, 523600936, 524247408, 556166172, 603606939, 646667063, 663562417, 664790750, 661252856, 655323863, 648127913, 640357852, 631254137, 621924877, 612806082, 602492332, 592093587, 581633329, 570254207, 560737610, 553865016, 548271596, 545829654, 545624197, 543986976, 537633002, 524162889, 504919469, 485088617, 473277807, 481921613, 517309964, 559357882, 604397833, 646590829, 676102400, 693608224, 701761723, 704850912, 705567956, 703866780, 697494507, 682607710, 658897102, 630405188, 598503351, 560220003, 514222443, 466216981, 430556267, 419670314, 432027370, 458418578, 491305262, 522191346, 542876899, 553681016, 559879720, 561446130, 556464732, 553948343, 561578155, 576366246, 588981807]
1625.6E88981807O663859K094865j309454m042626p530987r276509r868503j1505067
1641.9E54207385j2322963j2182414q759439m145682o090462j5165717j9206553k2014469
1658.2D54319686k4516702k0502150q544117N427420K0865172L6021113L6671490L3264935
1674.5E33006847L0011952K2489905J7692566J7715812K0800829J7564833J3206184
1688.8F72488928J2437701J0906160J0825932J1145234J0335744J0889410Q706153
1703.1G47735262O652653O330311N179882M096568L453136L358721M106582M208505
1719.4G85121620L293991K699256K441942K025068J711250J427114J638770J677096
1735.7H02036107P71999O0l40403j66058M16875J237154K115249K693773K255678J632154
$$ y = [588981807, 595645666, 597740531, 596431077, 592388451, 584857464, 575580955, 565712452, 554207385, 541884422, 529702008, 520942569, 516796887, 510706425, 495540708, 476334155, 454319686, 429802984, 409300834, 400756717, 406184137, 427049309, 463070422, 499741912, 533006847, 563018799, 585508704, 603201270, 620917082, 641717911, 659282744, 672488928, 684926629, 695832789, 706658721, 717803955, 728139699, 739029109, 747735262, 754387915, 760718226, 765898108, 769994676, 773447812, 776806533, 780913115, 785121620, 788415611, 791114867, 793556809, 795581877, 797293127, 798720241, 800359011, 802036107, 802808106, 802808166, 802467763, 802301705, 802718580, 803955734, 806070983, 808764756, 811020434, 812652588]
1756.1H12652588J220107Q04543P08044P84457P59601O99103O30021O07610N92291
1774.5H19458365M19796L61144L14296J12176p4029k35081n87165j019299j088798
1792.8H17661405q72970n16772M8041M55856J84954j69635J79112J043498J965881
1811.2H19979370K513528K308428J435637M87089j34110k22802K11417N05686L17335
1829.6H27401578N6506j65284m80890o27220n19872n27739o62267n63682o04808r53376
1850H22352946r70185l59893L10183N72383N67794K41995m19974j160682j902878k312720
1870.3H16918969j694977l78370P38322J320958J467407R70960Q0705k43843K86937
1888.7H19467068J102149J529038J379311P67231K08140R0301M6789p6055k8968J9729
$$ y = [812652588, 813872695, 814677238, 815385282, 816169739, 816929340, 817628443, 818258464, 818866074, 819458365, 819878161, 820239305, 820553601, 820665777, 820591748, 820356667, 819769502, 818750203, 817661405, 816788435, 816271663, 816319704, 816775560, 816960514, 816790879, 816969991, 818013489, 819979370, 822492898, 824801326, 826236963, 826724052, 826589942, 826367140, 826578557, 827084243, 827401578, 827458084, 827292800, 826811910, 826184690, 825664818, 825137079, 824474812, 823911130, 823306322, 822352946, 821382761, 821022868, 821333051, 821905434, 822473228, 822715223, 822295249, 821134567, 819231689, 816918969, 815223992, 814845622, 815583944, 816904902, 818372309, 819343269, 819423974, 819180131, 819467068, 820569217, 822098255, 823477566, 824244797, 824452937, 824543238, 824590027, 824513972, 824485004, 824504733]
1909.1H24504733j30415k24948k90870n04196n82099m87507n31494n51939l22580k11001
1929.5H20667684m83811p44641p79986q33631j019060j439691k408027l977836n404889
1947.9H03576112m659176n03123M125118N328358L471493J219690l51369j258850q53598
1966.2H10094655Q65280J947284J537204Q31842M01557J6093j61409q95J57714K17736
1986.6H15907061K74658J63436n0485p7128p5579k20776k37882j27196j96278l34919
2007H15024912l18050l64780n22316m75764k95937k72036l08037l92914n08666k40206
2027.4H11326206P3135q5593k41518q344K25424J49847O1512P2658m3512j93238j70350
2049.8H11166227j66714k82526k89739k57909l86417n41866n69582n23269l44634Q703
$$ y = [824504733, 824374318, 824149370, 823858500, 823354304, 822772205, 822284698, 821753204, 821201265, 820878685, 820667684, 820183873, 819439232, 818659246, 817825615, 816806555, 815366864, 812958837, 808981001, 803576112, 798916936, 798413813, 802538931, 807867289, 811338782, 812558472, 812207103, 810948253, 810094655, 810959935, 812907219, 814444423, 815276265, 815677822, 815693915, 815532506, 815531611, 815689325, 815907061, 816181719, 816345155, 816294670, 816217542, 816141963, 815921187, 815683305, 815556109, 815359831, 815024912, 814706862, 814342082, 813819766, 813344002, 813048065, 812776029, 812467992, 812075078, 811566412, 811326206, 811399341, 811313748, 811072230, 811063886, 811289310, 811439157, 811500669, 811573327, 811529815, 811336577, 811166227, 810999513, 810716987, 810427248, 810169339, 809782922, 809241056, 808671474, 808148205, 807803571, 807812274]
2070.2H07812274K64465K62857K11775J42872r417p2658l2783o4254j32322j19746
2090.6H08263063j56641k81572l01123k43902k59757k22266o9141O914J6153P9632
2111H06831360R2387O199k5213l8862j46091k26498k28464k94507l78549l49641l46184
2133.5H04895937l96311l46899k59936k18093j43647r6202j61231k39968k87831l50416
2153.9H02395403l80814k51174J8657K50876L54826L08156J42813O4313R3937J5259
2174.3H03012252j65343l09587m02152m52221m31240l54766k37108q9645K7478P7963
2194.6H00675631N7876l5942j51515k32398k93374l14951k77162k37703k18869j69515
2215G98802078p8380L0994J66833K60532K08855O5506m2677j29164k26199k52307k42591
$$ y = [807812274, 808076739, 808339596, 808551371, 808694243, 808684826, 808612168, 808579385, 808515131, 808382809, 808263063, 808106422, 807824850, 807523727, 807279825, 807020068, 806797802, 806728661, 806735575, 806751728, 806831360, 806923747, 806929946, 806904733, 806865871, 806719780, 806493282, 806264818, 805970311, 805591762, 805242121, 804895937, 804499626, 804152727, 803892791, 803674698, 803531051, 803434849, 803273618, 803033650, 802745819, 802395403, 802014589, 801763415, 801782072, 802032948, 802387774, 802695930, 802838743, 802903056, 802996993, 803012252, 802846909, 802537322, 802135170, 801682949, 801251709, 800896943, 800659835, 800570190, 800597668, 800675631, 800733507, 800697565, 800546050, 800313652, 800020278, 799705327, 799428165, 799190462, 798971593, 798802078, 798723698, 798754692, 798921525, 799182057, 799390912, 799456418, 799413741, 799284577, 799058378, 798806071, 798563480]
2237.5G98563480k79367k72274k12967k37942l00586l01957l46482m72069n55038n84006
2257.9G95000792n28872k76268j4246l0279j81198k39849l29733m10557k28047L0041
2278.3G92791784J56998L15369M18543K80917J45495J53065O3002p0214l0995l3378
2298.7G94190586j93477k42829k48075m05729m86493m75585o99044j045882j184762
2317G89208710j028120n51522o139J45435n4002j93655l08156p22647j163840j115382
2337.4G84210682m70579O33717J579642J508117O10232o7234k86579m42862n82815
2355.8G86692321l79264j12116p7427j8060J04427J26720J51038J08778q9824j68621
2376.2G86337972j31429k11834k46644j06693m1663j05918p6055k8789j62125k73526
$$ y = [798563480, 798284113, 798011839, 797798872, 797560930, 797260344, 796958387, 796611905, 796139836, 795584798, 795000792, 794471920, 794195652, 794181406, 794151127, 793969929, 793730080, 793400347, 792989790, 792761743, 792791784, 792948782, 793264151, 793682694, 793963611, 794109106, 794262171, 794325173, 794254959, 794223964, 794190586, 793997109, 793754280, 793506205, 793100476, 792613983, 792138398, 791439354, 790393472, 789208710, 788180590, 787629068, 787622929, 787768364, 787714362, 787520707, 787212551, 786489904, 785326064, 784210682, 783740103, 784373820, 785953462, 787461579, 788071811, 788004577, 787717998, 787275136, 786692321, 786313057, 786200941, 786123514, 786105454, 786209881, 786336601, 786487639, 786596417, 786506593, 786337972, 786206543, 785994709, 785748065, 785641372, 785599709, 785493791, 785417736, 785388947, 785226822, 784953296]
2396.6G84953296k76863l55184l47555q6188J75595L07679M11689L55602J09970n8412
2417G85189629j36674k64227l07620k11060k19166l36051l26753k77340k92897j79887
2437.4G82637954k0862o4075j42157j10090j75237l33250m00066m92633o26802m67122
2457.8G79805660k7358K83241L70383L21865J16229r6500j76489k41637l31462l34501
2478.1G79689431k99871l37481l60072l00169l09944l97980m02272l80456l57330j85490
2498.5G76358366P331Q047j8001O4314O9439r000o2287k32577m87149o02186o68168
2521G74428129p39753n38051p4089K75910M07100M02570K35080P093j76370m34816
2541.4G73792803p29680p98464n95927k78234M3094K40862K21074J38581J34587R5308
$$ y = [784953296, 784676433, 784321249, 783973694, 783887506, 784063101, 784370780, 784782469, 785138071, 785248041, 785189629, 785052955, 784788728, 784481108, 784270048, 784050882, 783714831, 783388078, 783110738, 782817841, 782637954, 782617092, 782553017, 782410860, 782300770, 782125533, 781792283, 781392217, 780899584, 780272782, 779805660, 779778302, 780061543, 780431926, 780753791, 780870020, 780773520, 780597031, 780355394, 780023932, 779689431, 779389560, 779052079, 778692007, 778391838, 778081894, 777683914, 777281642, 776901186, 776543856, 776358366, 776365697, 776373744, 776355743, 776420057, 776489496, 776480496, 776418209, 776185632, 775698483, 775096297, 774428129, 773688376, 773150325, 773076236, 773352146, 773759246, 774161816, 774396896, 774403989, 774227619, 773792803, 773063123, 772264659, 771668732, 771390498, 771433592, 771674454, 771895528, 772034109, 772168696, 772264004]
2561.8G72264004J3530L874J20j0908P2360J65760J40965N0426k7359j21831k33830
2584.2G72317111k84433l21329l78966l41356k44677k04622j70172j45197k34663l71635
2604.6G69620061m70162o05940p96974r72271j115203j161814r33051l73840L17633
2623G63508439Q46565J037359R48966P93933O73771M94838K63930J00314l1531j82986
2643.4G68453598k88486l35217l50475l42369l48091m02511m66764n15341n91755o36995
2663.7G64175594n44131l83258k77817k22147k23517k28107j28627o1154j69993l17514
2684.1G61619329m09424n44131p09057p98285q25941q24213o95527l86417J2219L99709
2704.5G56838262O68407P22944O10292M39585K05695%j3351O8009Q1598M2856l8028
$$ y = [772264004, 772277534, 772281408, 772281528, 772270620, 772342980, 772508740, 772649705, 772700131, 772672772, 772550941, 772317111, 772032678, 771711349, 771332383, 770991027, 770746350, 770541728, 770371556, 770226359, 769991696, 769620061, 769149899, 768543959, 767746985, 766774714, 765659511, 764497697, 763564646, 763190806, 763508439, 764355004, 765392363, 766341329, 767135262, 767809033, 768303871, 768567801, 768668115, 768636584, 768453598, 768165112, 767829895, 767479420, 767137051, 766788960, 766386449, 765919685, 765404344, 764812589, 764175594, 763631463, 763248205, 762970388, 762748241, 762524724, 762296617, 762167990, 762106836, 761936843, 761619329, 761209905, 760665774, 759956717, 759158432, 758332491, 757508278, 756812751, 756426334, 756438553, 756838262, 757506669, 758229613, 758839905, 759279490, 759485185, 759485185, 759471834, 759539843, 759621441, 759664297, 759626269]
2727G59626269j73747k36154k24590l12805m55678n29468n88417o26743n85258n73873
2747.4G55319536o66082p47979p40588p13348o81043n98967n24878m79102m21882m14789
2767.8G49330878m80771m81248m45246n65887p37667q51691j066923j357019j555800
2786.1G41788626j743079k036631k285838k367377k289236j943707j274169l84748
2802.4G27463841N94140J496613K073168K245248K228141K097487J773179J410186
2818.8G41382003J095950O71030K11775j43886m85718p79986r35555j057029j230955
2837.1G38727629j438558j645863j792490j807929j671850j555383j553834j425266
2853.4G25836456j003623l46124M54664J172721J525581J499772J239240Q31545M54902
$$ y = [759626269, 759452522, 759216368, 758991778, 758678973, 758223295, 757693827, 757105410, 756478667, 755893409, 755319536, 754653454, 753905475, 753164887, 752451539, 751770496, 751171529, 750646651, 750167549, 749745667, 749330878, 748850107, 748368859, 747923613, 747357726, 746620059, 745768368, 744701445, 743344426, 741788626, 740045547, 738008916, 735723078, 733355701, 731066465, 729122758, 727848589, 727463841, 728057981, 729554594, 731627762, 733873010, 736101151, 738198638, 739971817, 741382003, 742477953, 743148983, 743360758, 743216872, 742731154, 741951168, 741015613, 739958584, 738727629, 737289071, 735643208, 733850718, 732042789, 730370939, 728815556, 727261722, 725836456, 724832833, 724486709, 724941373, 726114094, 727639675, 729139447, 730378687, 731210232, 731665134]
2871.8G31665134K82407J97947R7394J48833L29971L78907K40564n662l35872o34492
2892.2G32365131q00013r49621j169503j295030j272559j263440j190662r52304p71165
2910.5G22700834q33749j102388j455129j721978j767635j648367j401841p61330L42428
2928.9G12350845J379431J913666J955092J613677J103818P14243M54247J13308k84552
2947.2G21313775n49615p16328r29416j161039j364529j580953j765848j915812k057970
2965.6G09272265k022564j656890j062631l90769K51294O85930P79390N93662L24846
2984G06774533J27137L2424p4148l82125q25524j156986j370371j517534j504421j435697
3004.4F98667288j593411k051532k772868l753126m690706m996837m231810k325118
$$ y = [731665134, 731947541, 732145488, 732242882, 732391715, 732721686, 733100593, 733341157, 733335495, 732999623, 732365131, 731565118, 730615497, 729445994, 728150964, 726878405, 725614965, 724424303, 723471999, 722700834, 721867085, 720764697, 719309568, 717587590, 715819955, 714171588, 712769747, 712008417, 712350845, 713730276, 715643942, 717599034, 719212711, 720316529, 721030772, 721485019, 721598327, 721313775, 720764160, 720047832, 719118416, 717957377, 716592848, 715011895, 713246047, 711330235, 709272265, 707249701, 705592811, 704530180, 704139411, 704390705, 705076635, 705856025, 706449687, 706774533, 706901670, 706934094, 706859946, 706477821, 705652297, 704495311, 703124940, 701607406, 700102985, 698667288, 697073877, 695022345, 692249477, 688496351, 683805645, 678808808, 674576998, 672251880]
3020.7F72251880L08395K718389L973305L772259K339780K27034j908481l525138m154801
3039F76002622l599346k234817j057088r65118j949966l562153n382895o465137n392015
3057.4F45394087k034366J526951L407002L661454K839207J345158r3877r28223j051963
3075.7F54065430o31451k385O33121J179457J503586J681567J848161J881838J649677
3094.1F63809001J292825J100064J199662J354814J126587K86818r60350k085090k530098
3112.4F64594233k106190j384437j249254j980125l328562m929304o343305p157088
3128.8F36115968p059812n762935l138542K48611L255307N084992N735457N508304
3145.1F39987350M712522L741920K769887J690567O77943K7179l84748p47203j068414
$$ y = [672251880, 672560275, 675278664, 679251969, 683024228, 685364008, 685591042, 683682561, 680157423, 676002622, 672403276, 670168459, 669111371, 668146253, 666196287, 662634134, 657251239, 650786102, 645394087, 643359721, 644886672, 648293674, 651955128, 654794335, 656139493, 656045616, 655117393, 654065430, 653433979, 653431594, 654064715, 655244172, 656747758, 658429325, 660277486, 662159324, 663809001, 665101826, 666201890, 667401552, 668756366, 669882953, 670169771, 669209421, 667124331, 664594233, 662488043, 661103606, 659854352, 657874227, 654545665, 649616361, 643273056, 636115968, 629056156, 623293221, 620154679, 620403290, 623658597, 628743589, 634479046, 639987350, 644699872, 648441792, 651211679, 652902246, 653580189, 653607368, 653222620, 652475417, 651407003]
3163.4F51407003j385390j775563k239823k731324l206849l619194m025280m498482
3179.8F27925098n010843n502224n834461n801498n206168l924310j969099M18007
3196.1E95094502K656281M089832M443348L819525K543867J138746P6831m71413m99189
3214.4F12892330j95265q9228n76020j494646k428352l136993l617108l980934m348696
3232.8E93025088m812240n315423n752325o174147o578625o820559o838799o684243
3249.1E44048727o328941n730927m863798l587723j825571K05278K033413L113091
3265.4E27063549L000795J668275l76344k376020l920019n113601n995214o436289
3281.7E07515132o506681o358981n923033m995763l624946k045363l65734J374751
$$ y = [651407003, 650021613, 648246050, 646006227, 643274903, 640068054, 636448860, 632423580, 627925098, 622914255, 617412031, 611577570, 605776072, 600569904, 596645594, 594676495, 595094502, 597750783, 601840615, 606283963, 610103488, 612647355, 613786101, 613862932, 613391519, 612892330, 612697065, 612607837, 612031817, 610537171, 608108819, 604971826, 601354718, 597373784, 593025088, 588212848, 582897425, 577145100, 570970953, 564392328, 557571769, 550732970, 544048727, 537719786, 531988859, 527125061, 523537338, 521711767, 521917045, 523950458, 527063549, 530064344, 531732619, 531356275, 528980255, 525060236, 519946635, 513951421, 507515132, 501008451, 494649470, 488726437, 483730674, 480105728, 478060365, 477694631, 479069382]
3298D79069382L079593M642844N959869O832361P243723P398843P386804P200599O882250
3316.4E35696268O483615N981683N438030N039811M872084M842281M791022M602193
3332.7E77746987M301250L960669L581763L165662K763212K443194K196610J969934
3349F02129281J697421J374185J107454R51111Q22604O05941L80099K84254J97947
3367.4F09550297q4161m48227n98431n84722o05046o80566p96437q43883p57158n92530
3387.8F03559136m00722m39882p25806p63535m61340l29554o69122r77278p86781n19931
3408.2E97485185m94838n14865n54383n89251m56155l31700l35812k50220o3777L7849
3428.6E93932033J251N9307K42829J76132r2924j30891P2240L08812M74334M83453
$$ y = [479069382, 482148975, 486791819, 492751688, 499584049, 506827772, 514226615, 521613419, 528814018, 535696268, 542179883, 548161566, 553599596, 558639407, 563511491, 568353772, 573144794, 577746987, 582048237, 586008906, 589590669, 592756331, 595519543, 597962737, 600159347, 602129281, 603826702, 605200887, 606308341, 607259452, 608082056, 608687997, 609068096, 609352350, 609550297, 609466136, 609017909, 608419478, 607834756, 607229710, 606549144, 605752707, 604908824, 604151666, 603559136, 603158414, 602718532, 601992726, 601229191, 600767851, 600438297, 599769175, 598791897, 598005116, 597485185, 596990347, 596475482, 595921099, 595331848, 594875693, 594543993, 594208181, 593957961, 593894184, 593932033, 593933284, 593992591, 594235420, 594411552, 594318628, 594187737, 594259977, 594568789, 595043123, 595526576]
3449E95526576M69625N42820O33895P51018Q43764P83503P87675J039386J172304Q70884
3469.4F03421450M77135M86493P64549J012265J055003Q51810P89642R57429R77099
3487.7F10792875Q90315R24706J027704J098334J026154R66251J057148J004875Q67784
3506.1F19656146R87231J233399J380742J316726J124382J079798J207948J350939
3522.4F29337311J307368J164019J194060J306713J378178J487553J497925J354873
3538.7F40028000J385808J551032J558840J331151J115978J221179J444221J445651
3555F51081860J361489J409531J372099J116514J183272J818358K050281J632035J450300
3573.4F64475739J606286J742065J856148J895129J724184J668453J941681J990676
$$ y = [595526576, 595996201, 596539021, 597172916, 597923934, 598767698, 599551201, 600338876, 601378262, 602550566, 603421450, 603898585, 604385078, 605149627, 606161892, 607216895, 608068705, 608858347, 609815776, 610792875, 611683190, 612607896, 613635600, 614733934, 615760088, 616726339, 617783487, 618788362, 619656146, 620643377, 621876776, 623257518, 624574244, 625698626, 626778424, 627986372, 629337311, 630644679, 631808698, 633002758, 634309471, 635687649, 637175202, 638673127, 640028000, 641413808, 642964840, 644523680, 645854831, 646970809, 648191988, 649636209, 651081860, 652443349, 653852880, 655224979, 656341493, 657524765, 659343123, 661393404, 663025439, 664475739, 666082025, 667824090, 669680238, 671575367, 673299551, 674968004, 676909685, 678900361]
3589.7F78900361J717687J731932J943529J968562J890838J789749J545966J379668
3606F92868292J606882J824439J746952J563132J370311J635372J949609J408040O64711
3624.4G06637740N59092J398861J884043J236558R20177Q53061P25329P17044N30482
3642.7G15462387J16765K26438J247823J483381L88086J50502Q43584R80318N47886
3661.1G21447170J82330j38044k44558J10328J81198j62243L03685P70510L97265J71601
3681.5G23019242Q6904R1314N53310R70125P41065N13732L22700Q404k6882K05100
3701.9G26485014R1910l01301m13656j133N41449L42488j16944k30968j41800l6061
3722.3G26218998N7042P5877k11895m36425j68562M04298Q23617L30747p25985r00149
$$ y = [678900361, 680618048, 682349980, 684293509, 686262071, 688152909, 689942658, 691488624, 692868292, 694475174, 696299613, 698046565, 699609697, 700980008, 702615380, 704564989, 705973029, 706637740, 707196832, 708595693, 710479736, 711716294, 712636471, 713489532, 714214861, 714931905, 715462387, 715579152, 715805590, 717053413, 718536794, 718924880, 719075382, 719918966, 720899284, 721447170, 721629500, 721491456, 721246898, 721357226, 721538424, 721376181, 721679866, 722450376, 722847641, 723019242, 723106146, 723197460, 723750770, 724720895, 725461960, 725975692, 726298392, 726306796, 726279914, 726485014, 726576924, 726275623, 725861967, 725860834, 726402283, 726744771, 726627827, 726396859, 726255059, 726218998, 726276040, 726351917, 726140022, 725703597, 725535035, 725939333, 726762950, 727093697, 726367712, 725467563]
3742.7G25467563o9380M0352k17020K59280L06845k19822k68638N8293J14560j55807
3763.1G25316226k66850j59263R4592J62304j61886l55542j94132l636j01447j59800
3783.5G24170566n4241n0783r8288k65956m54187l98755l58224k21372J30654J5616
3803.9G22415030r894K62379p3731n87999n36621j54197j65046l695L78132J669l59416
3826.3G21166611l15965k67148k70426k22623p749J85371J15037M8220k8432m24146
3846.7G19978750r62079r99629J35004J102805K07544n52953n47468j62781p74k64824
3867.1G17933595j15990K63154J39773j18375l35753l25262j48476o1154N3525j94251
3887.5G17090786m54367j71899r0778m20750n32150l06308J05381M64737L91066K8611
$$ y = [725467563, 725398183, 725438535, 725221515, 725480795, 725787640, 725567818, 725299180, 725357473, 725472033, 725316226, 725049376, 724890113, 724984705, 725147009, 724985123, 724629581, 724435449, 724431813, 724330366, 724170566, 724116325, 724065542, 723967254, 723701298, 723247111, 722848356, 722490132, 722268760, 722399414, 722415030, 722405136, 722667515, 722593784, 722005785, 721469164, 721314967, 721149921, 721146226, 721524358, 721526027, 721166611, 720850646, 720583498, 720313072, 720090449, 720082700, 720268071, 720383108, 720431328, 720402896, 719978750, 719016671, 718017042, 718152046, 719254851, 719462395, 718909442, 718361974, 718199193, 718198419, 717933595, 717817605, 718080759, 718220532, 718102157, 717766404, 717441142, 717292666, 717231512, 717285037, 717090786, 716636419, 716464520, 716373742, 715952992, 715420842, 715114534, 715219915, 715684652, 716075718, 716104329]
3907.9G16104329j19269j47701k69532k20537L099Q345j19686j04129j22071k74837
3928.3G14738011k05695L6835L2187j51754l03864l21150j62422q1063j46568j03116
3948.7G13331401j5437p5519j65701j60456j19269r1433r2626j28508j15871l1531
3969.1G12335050K9862J7762k5332m5359q0645q8811l8087j12832k55465k19703r0659
3991.5G11425781o1214j11520j33753
3997.6G11119294
$$ y = [716104329, 715985060, 715837359, 715567827, 715347290, 715350389, 715358734, 715239048, 715134919, 715012848, 714738011, 714532316, 714569151, 714601338, 714449584, 714145720, 713824570, 713662148, 713581085, 713434517, 713331401, 713315964, 713240445, 713074744, 712914288, 712795019, 712703586, 712610960, 712482452, 712366581, 712335050, 712364912, 712382674, 712357342, 712311983, 712231338, 712142527, 712104440, 711991608, 711736143, 711516440, 711425781, 711364567, 711253047, 711119294]
##END=$$ End of the data block
