##TITLE=Ac. p-aminobenzoico - Patricia e Janine $$ Begin of the data block
##JCAMP-DX=5.00 $$ ACD/SpecManager v 10.08
##SPECTROMETER/DATA SYSTEM=Alpha
##DATE=14 Apr 2015 08:11:20
##DATA TYPE=INFRARED SPECTRUM
##DATA CLASS=XYDATA
##ORIGIN=
##OWNER=
##NPOINTS=1765
##FIRSTX=399.76428223
##LASTX=3997.64306641
##MAXX=3997.64306641
##MINX=399.76428223
##MAXY=0.75265926
##MINY=0.25694621
##XFACTOR=1.0000000000
##YFACTOR=1.000000000000000e-9
##FIRSTY=0.58585596
##DELTAX=2.03961372
##XUNITS=1/CM
##YUNITS=ARBITRARY UNITS
##XYDATA=(X++(Y..Y))
399.8 585855961 584954321 585791349 590946972 598701954 604934931 609002888 612888634 617381692 622580707
418.1 622580707 626937032 629215062 629947007 629899919 631067455 632817864 633138955 633346081 634639323
436.5 634639323 635502458 635929823 637275934 638753653 638942599 638907850 640222192 641612470 641961038
454.8 641961038 642704487 643611133 642710805 640787363 640268326 640826583 640162826 638772726 637882769
473.2 637882769 636137486 632596970 628731608 625542104 620784819 612309575 601292729 587764382
489.5 587764382 569077075 546230912 525601804 515290141 521403491 542608380 569714129 595707119
505.8 595707119 618290901 634572625 644073546 647831738 647624493 646376848 644923866 642179072
522.1 642179072 638932526 636556208 633677542 628689945 622756064 616964459 609040976 596720755
538.5 596720755 580340147 559877038 534520686 507094383 484045655 470468640 470061392 485073477
554.8 485073477 512192011 542998075 570613146 593058884 610729754 623120189 630442798 635514438
571.1 635514438 640193343 643398643 644810557 646436453 648257792 648429871 647624195 647682250 647631586
589.4 647631586 645724356 643026054 640811622 637712777 632626832 626894414 621082246 613962352
605.8 613962352 605050921 594115317 578277290 556012332 533073187 518072963 519719601 553795755
622.1 553795755 624935985 699082434 737279296 739551544 725588620 702156305 676554143 669604182
638.4 669604182 682435274 695354462 699336290 697813928 695795238 694180250 691855550 690078020
654.7 690078020 690046608 690220654 689622641 689722121 690221369 688674629 686863661 688585460 690276027
673.1 690276027 689772606 688243926 687330067 686183214 683322072 679357529 674549103 666632593 653326094
691.4 653326094 634677589 613060713 595490515 595904589 622731566 661168694 687931240 698296249
707.7 698296249 701140702 701852381 701065838 699776769 698979437 697996199 696240783 694625735 693647027
726.1 693647027 692165196 689673364 687408924 685658753 683121622 679792285 676912606 674263358
742.4 674263358 670542479 665875673 660980642 655107856 647268295 637724280 626213491 610955894
758.7 610955894 590947866 564807832 527591527 476592213 424070984 399351180 423957139
773 423957139 481007457 532426655 562957823 582469404 600782156 618707657 633539855 643563390
789.3 643563390 648930728 651426613 652733505 652907670 651666582 649903297 648290873 646104753 642621338
807.7 642621338 637857139 631600380 624766171 620523691 620600581 622522652 623110533 622410238 620830357
826 620830357 616132379 606325686 591430962 570813477 542000711 504969656 469716400 453294694
842.4 453294694 460589290 481250226 509546518 546149254 585021377 616617322 637692273 650128067
858.7 650128067 656092048 657668889 656846941 654213607 649642587 643958092 638230383 632357061 625931084
877 625931084 619380713 613069057 606517315 599685609 593723834 589493513 586772919 585514128 586100101
895.4 586100101 588003159 589934230 591299474 592212796 592408538 591442347 589702904 587897241 585901320
913.7 585901320 583444536 581099451 579436541 578268886 577591717 578145623 580242991 583273590 586930215
932.1 586930215 591588676 597075284 602492630 607574582 612762034 617830575 621910751 624759853
948.4 624759853 626915753 629163861 631559491 632571161 630481780 626299798 624002874 626895905
964.7 626895905 635062456 644967914 651973248 655271292 656765580 657224417 657163084 657468796 657994330
983.1 657994330 657993197 657710433 657819092 657990038 657696724 657462478 657755196 657825232 657085776 656097174
1003.5 656097174 655015409 653022766 650500417 649381697 650242090 651558876 652287662 652703047 652783036
1021.8 652783036 652151108 651235402 650655866 650039315 648863375 647650898 646890521 646035254 644739032
1040.2 644739032 643536210 642560005 641148031 639195859 637377262 635661066 633264542 630137980
1056.5 630137980 626798391 623135865 618895590 614660025 611131191 608244181 605972707 605037928
1072.8 605037928 605779767 607351601 608888328 610338926 611597240 612100363 611810446 611315191 610708356
1091.2 610708356 609553039 607887805 606086910 603907704 600870967 597219050 593398511 589170873
1107.5 589170873 584222555 578976870 573864400 568273723 561464310 553517699 543733001 529888630
1123.8 529888630 512225449 498641104 501337290 522757590 549006402 565452158 571341872 572310150
1140.1 572310150 570622027 566385865 559868932 551474392 541605055 530603945 518771291 506136835
1156.5 506136835 491733968 473601192 449659526 418487102 380255491 337569088 296632409
1170.7 296632409 270013690 274036914 317294061 393783778 487966090 582277834 660218596
1185 660218596 709864378 730079472 729592204 718403459 703085601 687734187 674786448 664889157
1201.3 664889157 657509089 651887178 647003114 641528487 634757698 627018213 618806243 610281110
1217.7 610281110 601805627 593887746 586552143 579553723 573035061 567211807 561831057 556620836
1234 556620836 551709831 547093928 542329371 537140489 531613231 525680125 519010961 511503756 503340662
1252.3 503340662 494527519 484901994 474471807 463264525 451112747 437809855 423350602 407897562
1268.6 407897562 391632169 375269353 359926254 345573813 330822766 314707428 297669977
1282.9 297669977 281184286 267618328 260230213 261756271 272481740 290740192 316538453 350378364
1299.2 350378364 383944780 400213480 390214115 364350855 341676682 331629694 332596511 339014083
1315.6 339014083 344346881 346558452 348344952 351824999 360577643 381084651 415991575 459497482
1331.9 459497482 501255274 532385886 547045767 544482470 536180437 538633525 558346748 589971662
1348.2 589971662 623587191 652179062 673500597 687086344 693491876 694493413 691069663 684317827
1364.5 684317827 676621079 668956637 661554396 654000759 644699991 634284198 623880923 613031268
1380.8 613031268 602215409 592690885 583486915 573354065 564003229 555828571 547635794 539592206
1397.1 539592206 531964242 524965107 518319428 509747565 498577386 485492617 470153660 453290880
1413.5 453290880 436541349 418850154 400360078 391761303 402108192 433175564 478104323
1427.7 478104323 524386108 553881764 557321906 530072749 476062119 428595126 409522414
1442 409522414 428726137 481100619 548067570 607613146 652145386 686468363 716282547 735264897
1458.3 735264897 739150167 739253104 738711059 735726655 732366920 730499327 727431953 720711410 712767184
1476.7 712767184 705594122 699153721 693443537 689763546 688226640 685671568 679273903 672394156
1493 672394156 666873276 659729779 649850786 640505195 633965611 627854884 614055693 596355438
1509.3 596355438 581194401 566996455 553432882 541529238 535536468 537386358 543899477 551947713
1525.6 551947713 560472250 568932772 577371955 582896173 583869457 583785772 581597090 573872387 564507604
1544 564507604 555660248 548105180 540921032 533704221 527194917 522164941 513998032 497731179
1560.3 497731179 484829903 473852724 461213738 444373816 420993447 401832253 402356297 431122601
1576.6 431122601 457974017 462144762 453022331 436663359 414609492 388630122 360609114 331620574
1593 331620574 302641958 277201682 260527700 256946206 268694311 293700844 327122003 363762975
1609.3 363762975 395474344 413359463 410480529 383778006 352402508 328311384 312437475
1623.5 312437475 310245663 319614291 332073301 340289414 343344808 345123798 355498880 377855659
1639.9 377855659 407223642 434537262 451520860 450243205 437090605 410032839 361996353
1654.1 361996353 328781039 309915870 296305627 287385583 282884926 282045543 283364594 285120070
1670.5 285120070 286646992 288593501 290732950 293317914 297229618 304307312 316055924 329104900
1686.8 329104900 344212532 363328785 383545250 407441497 434015781 458556205 483506292
1701.1 483506292 503256261 521175444 540191650 557137191 573434472 590739250 609517753
1715.3 609517753 628668070 643204570 653963327 664985240 676229537 686988533 697827160
1729.6 697827160 708215654 717671514 723467886 726661861 729302406 730148017 729506373 729031980 729436815
1748 729436815 730273545 731421173 733940125 738247514 742973804 747054756 749714732 750413835 750834525
1766.3 750834525 751840413 752659261 751290083 747752368 745083272 744280875 744298220 744336605 744548917
1784.7 744548917 745113909 746575892 748957872 750247777 749681115 749340653 749799848 749919593 749094844
1803 749094844 748330653 748365283 748745441 748496771 747664988 747237146 747196734 747065008 747199059 747878730
1823.4 747878730 748321772 748376608 748099208 746858001 745519280 744877636 744599342 744658470 745305657 745612979
1843.8 745612979 744446039 742618084 740868330 739436269 738555908 737994850 737452447 737032592 736966312
1862.2 736966312 737398446 738316774 738817155 737827897 736268818 735233665 734757185 734506667 734117687
1880.5 734117687 733646214 733433187 733538151 733419001 732580066 731616735 730735183 729276359 727342129
1898.9 727342129 725290418 722928941 720051408 716886759 714300334 713403821 714273512 716078222 718099952
1917.3 718099952 719915450 721792877 723696232 724807262 725014269 724952638 725266397 725961864 726603985
1935.6 726603985 727280617 728388250 729494214 729659796 729174554 728818893 728572726 728313208 728210568
1954 728210568 728211939 727959156 727425396 726988435 726853907 726654649 725975633 725165248 724613011 724157333
1974.4 724157333 723774076 723631561 723550558 723234951 722794652 722491682 722216785 721688986 720827579 719866037
1994.8 719866037 718956351 718005538 717135847 716400981 715512991 714348793 713096619 711764157 710229099
2013.1 710229099 708852053 708239734 708389342 708685458 708693683 708530366 708418548 708155930 707619965 706986248
2033.5 706986248 706189930 705159962 704162538 703320861 702367306 701209247 700148642 699370265 698711038
2051.9 698711038 698201358 698166490 698575079 699030340 699483991 700161874 700859368 701235533 701395452 701529503
2072.3 701529503 701404572 700784087 699971855 699334741 698781550 698215783 697890580 697852910 697706759 697318375
2092.7 697318375 697056592 696983457 696726501 696231067 695778430 695339441 694622219 693699241 692899704 692149520
2113.1 692149520 691142023 690034389 689118028 688203156 687090397 686089635 685417473 684772372 683990598
2131.4 683990598 683358908 682988048 682581782 682077646 681760967 681629539 681384802 681041658 680826902 680609703
2151.8 680609703 680154502 679668665 679426312 679239333 678900599 678616107 678472579 678161979 677657008 677291512
2172.2 677291512 677049398 676588297 675898552 675285339 674751878 674045801 673239172 672607303 672051013 671309888
2192.6 671309888 670504272 669845045 669140339 668162167 667127311 666288197 665511549 664710701 664134681
2211 664134681 663877130 663693786 663469315 663314998 663127005 662644446 661958516 661371231 660874367 660297215
2231.4 660297215 659727633 659315944 658941567 658423007 657846630 657342672 656775355 656034708 655287743 654619217
2251.8 654619217 653866410 653039098 652403295 651984155 651521146 650937200 650372088 649832606 649202645 648515940
2272.2 648515940 647891760 647289753 646601558 645898163 645266354 644598007 643801451 642973006 642183304 641321242
2292.5 641321242 640316486 639235258 638113379 636915326 635688961 634536505 633421719 632246494
2308.9 632246494 631075978 630071640 629162192 628033996 626560628 625042856 623794019 622723937
2325.2 622723937 621603608 620416939 619314313 618296862 617168128 615927339 614693463 613520622
2341.5 613520622 612768590 613031685 613779366 613534510 611679792 608846903 606077433 603829861 602211475
2359.9 602211475 601125181 600453079 600240886 600524664 601128221 601779580 602457762 603297293 604220092
2378.2 604220092 605010331 605515003 605672240 605430901 604802012 603966355 603113711 602231741 601247728 600222349
2398.6 600222349 599232435 598250449 597258806 596357703 595600188 594892442 594193935 593567312 592971385 592288017
2419 592288017 591535807 590805292 590052485 589171588 588187039 587165415 586053729 584777832 583393991
2437.4 583393991 581991673 580573618 579161048 577867687 576726615 575633943 574587762 573737323
2453.7 573737323 573125005 572629273 572202504 571897745 571659088 571336389 570891976 570360720 569682360 568773866
2474.1 568773866 567680597 566470563 565108240 563649237 562323332 561279714 560440242 559669197 558907330
2492.4 558907330 558070421 557025969 555766404 554410636 553012431 551521719 549926758 548326552
2508.7 548326552 546779573 545221448 543628991 542062223 540532589 539000154 537432015 535807610
2525.1 535807610 534114540 532352030 530547619 528714597 526841104 524959564 523180485 521615326
2541.4 521615326 520323157 519383848 518931806 519012570 519515097 520347714 521555603 523230433 525412500
2559.7 525412500 528129816 531385243 534988642 538565159 541826427 544612408 546729803 548007250
2576 548007250 548417807 548040152 546946883 545259118 543249846 541259170 539661109 538891554 539287984
2594.4 539287984 540856242 543242276 545959890 548574209 550709605 552069843 552561104 552320778 551497340
2612.8 551497340 550164282 548471928 546638846 544792175 542990863 541396677 540198922 539413631
2629.1 539413631 538918018 538555264 538143992 537514448 536607206 535505950 534285367 532946408 531562090
2647.4 531562090 530283868 529151022 528056681 526982665 526021183 525170922 524392366 523773015 523413181
2665.8 523413181 523228407 523142636 523256063 523630142 524240971 525189221 526734889 529094338 532291651
2684.1 532291651 536194861 540604651 545231104 549696743 553742409 557262480 560156584 562373638
2700.5 562373638 564004123 565180898 565953553 566350520 566499650 566523492 566394329 566058934 565588117
2718.8 565588117 565064311 564480662 563893855 563432157 563136935 562974572 562887073 562788963 562531829 562013149
2739.2 562013149 561334372 560640752 559855998 558789670 557447851 555969059 554391086 552710116 550986290
2757.6 550986290 549302816 547692358 546172678 544823825 543679774 542644799 541626513 540582478
2773.9 540582478 539413750 538040698 536548078 535074770 533640921 532229185 530920088 529751241
2790.2 529751241 528609574 527456820 526412070 525459647 524449706 523374856 522293866 521164179
2806.5 521164179 519915581 518562555 517160892 515735686 514341652 513107002 512165785 511597753 511457324
2824.9 511457324 511775374 512461901 513351083 514367282 515519857 516811371 518157959 519416928 520459592
2843.2 520459592 521113157 521234035 520895123 520274401 519444823 518462241 517489970 516665816 515983462 515417635
2863.6 515417635 515007794 514750957 514568090 514422238 514347076 514361441 514477491 514722109 515086114 515492737
2884 515492737 515860736 516205072 516566813 516900480 517134726 517229378 517140150 516844392 516330719 515572071
2904.4 515572071 514622808 513619721 512731493 512073755 511592031 511230111 511038423 511086762 511411846 511954725
2924.8 511954725 512615442 513192356 513338804 512938261 512188852 511231542 510116577 509002805 508008003
2943.2 508008003 507024229 505923033 504802823 503828943 502900481 501899064 500955045 500180900 499570280
2961.5 499570280 499056458 498629093 498374492 498331606 498492897 498801291 499147594 499534726 500001490 500464261
2981.9 500464261 500924408 501503825 502267778 503197014 504122555 504858553 505432308 505897343 506329596 506940424
3002.3 506940424 507782221 508771241 509906471 511118770 512161255 512870073 513350785 513796210 514293969
3020.7 514293969 514831364 515341103 515772521 516145349 516428530 516544402 516454160 516196847 515902936 515588939
3041.1 515588939 515087664 514164805 512653589 510962546 510096431 510508358 511833251 513767481 516124845
3059.4 516124845 518558502 520794094 522771716 524501383 525999665 527336657 528580427 529801071
3075.7 529801071 531073689 532360077 533573151 534725070 535885394 537084877 538267910 539381623
3092.1 539381623 540476978 541612089 542760730 543849528 544843793 545762420 546613693 547375083 548074424
3110.4 548074424 548795938 549541414 550277591 551022828 551765978 552508771 553315222 554175138 555010021 555831552
3130.8 555831552 556671500 557473540 558159649 558734477 559256256 559752285 560315788 561117053 562151909
3149.2 562151909 563198507 564077318 564768076 565315306 565783262 566220224 566629708 567006052 567326486
3167.5 567326486 567631960 567974508 568283200 568546593 568834722 569120944 569328308 569417179 569370508 569186211
3187.9 569186211 568834782 568254232 567449987 566445351 565169513 563621283 561965883 560321629 558739960
3206.3 558739960 557299793 556066871 555050015 554130733 553077996 551656365 549681664 547112584
3222.6 547112584 544176877 541422307 539654016 539653480 541754663 545634866 550513506 555578828 560289323
3240.9 560289323 564374804 567740381 570473969 572905183 575414598 578158677 581091642 584061444
3257.3 584061444 586826146 589159131 590979993 592290342 593123794 593589246 593808234 593810737 593575537
3275.6 593575537 593124449 592499614 591738164 590859711 589871049 588787317 587626994 586357415 584907949
3294 584907949 583309114 581623316 579835534 577917993 575875521 573707223 571356654 568774581 565934300
3312.3 565934300 562766373 559200168 555227697 550902009 546245992 541228771 535877824 530270278
3328.6 530270278 524412394 518238425 511719882 504882634 497725099 490136236 482008725 473279059
3345 473279059 463717908 453042567 441156060 428017348 413588256 398428023 384230793 373701543
3361.3 373701543 370028466 375679165 390601277 411205500 431432039 445107192 448571354 442944169
3377.6 442944169 434475541 431379378 438672453 455897719 479596704 506146371 531915903 553391695
3393.9 553391695 568907797 579067647 585214794 588521183 589860976 589886069 588982999 587305486
3410.2 587305486 584995151 582228899 579159081 575797975 571988821 567714632 563168406 558420718
3426.5 558420718 553396583 548041165 542469800 536877632 531338871 525928855 520676970 515371501
3442.9 515371501 509578288 502460003 493038297 480471313 464029729 444587022 426042229 414368480
3459.2 414368480 414222956 425198644 441163719 454407036 460955799 462445974 463582665 468173623
3475.5 468173623 477476507 490718395 506077170 521523476 535665691 547827423 557759523 565794230
3491.8 565794230 572493613 578125417 582762241 586805999 590518296 593484342 595785797 598104119
3508.1 598104119 600435495 602466345 604255140 605924010 607597947 609433055 611390173 613080561
3524.4 613080561 614267290 615161061 616024971 617100596 618467391 619792283 620927930 622315645 624121010
3542.8 624121010 625759184 626634955 627196908 628077149 628962457 629656911 630611300 631951809 633482099
3561.1 633482099 635350645 637489736 638761222 638711274 638713419 639466047 640639484 641893983 643215120
3579.5 643215120 644798994 646934688 649359465 650826335 651209474 652060390 653649747 655214131 656578183
3597.9 656578183 657842815 658972383 660397887 662447274 664584458 666302025 667875290 669391215
3614.2 669391215 670894265 672216415 672538459 672433674 673491001 675910771 677877486 677747309 677199483
3632.5 677199483 677215457 677479267 677960098 678719759 679992795 682348371 685614645 687405229 685818195
3650.9 685818195 683789790 683039367 682636082 682047486 681600928 681504607 682185650 683790267 685217440
3669.2 685217440 685608506 685949326 685483217 683166623 680952251 679792643 679916024 681515276 683765173
3687.6 683765173 684405565 682834864 681225300 680517614 680562973 681042552 681111753 680630863 680891395 682378888
3708 682378888 683841884 683387637 681634367 680522799 680387795 680721819 680926442 680619359 679911435
3726.4 679911435 679699361 680833578 682953656 684080839 682853699 681238472 681110561 681949437 682254136
3744.7 682254136 682222486 682644963 681986094 679742157 678159416 677669883 677108049 676147223 675689280
3763.1 675689280 675852299 676053703 675802648 674838006 673844159 673705697 674316585 674571693 674009323 673424780
3783.5 673424780 672920644 672292054 671831489 671797156 672315419 673157394 673988581 674601316 674258888 673180342
3803.9 673180342 672170818 670799077 669592381 669611573 670646131 671662390 672322631 672361493 670885265
3822.2 670885265 669184625 668355942 668059945 668243110 668876290 669787407 670612991 670555294 669480562
3840.6 669480562 667980492 666542172 665992200 667054176 669328570 670348167 668231487 666162729
3856.9 666162729 665570736 665993452 666653574 666761696 666745007 666821897 666315854 665265620 664245009 663983941
3877.3 663983941 664475322 664793611 664702892 664177418 663382709 663049281 662741840 662064254 661976159 662812412
3897.7 662812412 663761675 663927019 662970245 661317527 659942210 659250915 659151196 659536421 659985483
3916 659985483 659901977 659487188 659304559 659212410 658966839 658904791 659053862 658801079 658067107 657497287
3936.4 657497287 657459497 657745123 657836199 657631338 657530963 657433629 657024086 656575501 656315148 656139433
3956.8 656139433 656033278 655974865 655806780 655547440 655390263 655360878 655317605 655195713 655029356 654826581
3977.2 654826581 654609561 654461265 654374301 654232502 654050231 653883815 653708935 653530359 653308809 653029203
3997.6 653029203
##END=$$ End of the data block
