##TITLE=Ac. p-aminobenzoico (Dalila e Oseias) $$ Begin of the data block
##JCAMP-DX=5.00 $$ ACD/SpecManager v 10.08
##SPECTROMETER/DATA SYSTEM=Alpha
##DATE=14 Apr 2015 08:11:20
##DATA TYPE=INFRARED SPECTRUM
##DATA CLASS=XYDATA
##ORIGIN=
##OWNER=
##NPOINTS=1765
##FIRSTX=399.76428223
##LASTX=3997.64306641
##MAXX=3997.64306641
##MINX=399.76428223
##MAXY=0.83470887
##MINY=0.45086393
##XFACTOR=1.0000000000
##YFACTOR=1.000000000000000e-9
##FIRSTY=0.73158401
##DELTAX=2.03961372
##XUNITS=1/CM
##YUNITS=ARBITRARY UNITS
##XYDATA=(X++(Y..Y))
399.8 731584013 729135633 728483558 732217789 738617003 743010104 743991613 744508862 747356355 751777530
418.1 751777530 753465414 752627790 753376186 755973101 757720649 757121921 755739629 756267726 758638740
436.5 758638740 759987473 759147882 758010924 758809984 760772169 761215925 759956121 759565234 761444211
454.8 761444211 763622761 763115644 760909915 760324359 761854291 762846947 761543036 759577870 759000480
473.2 759000480 759350896 758556128 755701661 752490997 750527680 748179436 742708206 733553767 721925557
491.5 721925557 709149003 696293175 687152445 687879384 699870288 717062414 733523309 746944487
507.9 746944487 755640686 760630250 763662815 764470041 762763202 760226786 759017110 759109199 758593321
526.2 758593321 756463766 753945291 751978755 749580443 744951189 737434864 727460086 714990675
542.5 714990675 699192703 680727601 663511992 652807593 652642608 663358569 680619955 699055314
558.9 699055314 716019034 730232000 740407109 746535003 750330031 753540099 756525040 758613229
575.2 758613229 759507060 760100126 761141181 762156785 762223780 761463523 760839820 760635614 760017633 758217752
595.6 758217752 755523622 752582133 749483049 745732725 741250873 736605227 731491625 723463953
611.9 723463953 710776389 696268737 685635328 685854137 707052350 749173522 790015936 810326099
628.2 810326099 813216090 807952404 796236873 782431841 778887272 786412358 793950975 796591640
644.5 796591640 796131432 795205891 794902325 794589996 793733180 792975903 793164551 794012368 794566572 794491887
664.9 794491887 794309735 794876099 795767248 795981526 795553267 795152068 795121729 794919074 793749690 791457415
685.3 791457415 788390100 784434617 778365374 768670499 755866528 744937479 744864821 759814382
701.6 759814382 780573726 794810772 800786257 802940845 803625166 803285122 802586317 802270651 802332699
720 802332699 802132964 801306367 800272286 799648046 799344122 798683167 797403097 795999885 794971108
738.3 794971108 794087410 792739928 790761709 788523972 786205053 783460140 779844761 775176108 769305646
756.7 769305646 761753738 751721859 737109542 713501036 677604198 636525214 613188505 627571702
773 627571702 667975903 703975379 723538876 734610796 745031536 755729437 764750719 771112502
789.3 771112502 775050163 777128458 778028250 778368354 778401494 778075159 777372777 776490688 775485158
807.7 775485158 773865283 771054268 767830908 766145468 766637802 767918169 768628418 768788815 768305898
826 768305898 766054630 761200786 753414273 741675138 723923981 699100852 672962844 658451498
842.4 658451498 661709487 676312804 696399689 720644057 745005906 764035761 776081681 782733083
858.7 782733083 785917401 786944509 786592603 785162449 782789052 779754102 776466787 773199797 769887924
877 769887924 766352773 762623250 758905292 755408466 752224267 749475956 747519016 746753514 747143626
895.4 747143626 748103738 748999119 749565840 749860764 749907434 749477863 748443246 747172713 746146798
913.7 746146798 745395303 744618833 743727624 743083715 743150055 744047880 745532513 747379720 749697208
932.1 749697208 752682924 756129682 759495199 762497365 765320778 768164277 770803988 772654712
948.4 772654712 773512602 774303377 775766671 776678622 775253594 772035420 769880176 771090209 775706232
966.8 775706232 781529307 785726249 787663460 788555086 789067864 789154172 788912475 788757086 788962662
985.1 788962662 789265573 789212644 788862288 788712800 788950980 789217949 789102852 788608670 788030922 787447393
1005.5 787447393 786488175 785063446 783978879 784052789 785047770 785948753 786097348 785725594 785394549
1023.9 785394549 785277843 785079241 784496129 783696949 783133805 782883942 782566726 781895101 781055152 780401587
1044.3 780401587 779880166 779105425 777923226 776562929 775268793 773878157 771955907 769408882 766671777
1062.6 766671777 764239609 762186706 760298073 758644700 757737160 757918775 758845210 759813428 760426939
1081 760426939 760770857 761023998 761108577 760797322 760127187 759404123 758717537 757754862 756128013 753808618
1101.4 753808618 751138210 748400986 745488584 742104471 738319993 734589875 730942607 726877928
1117.7 726877928 722151458 716368496 708035409 696603417 687012017 688221693 702521205 720338404
1134 720338404 731432438 735301554 736052752 735306978 732941687 729086399 723942101 717438221 709690750
1152.4 709690750 701243401 692266345 681666255 667532146 648042619 621653557 587414145 546042204
1168.7 546042204 503152430 473789454 477432430 521377385 592713058 669261873 734363914
1183 734363914 781113744 808786035 820340633 821084797 816206336 809125006 801697433 794948757
1199.3 794948757 789500177 785447121 782362640 779597163 776450098 772420466 767488658 762047827
1215.6 762047827 756519318 751127720 745953977 741090596 736642480 732641160 728991032 725558341
1231.9 725558341 722300053 719167471 716009200 712757468 709511757 706282854 702911556 699198723
1248.2 699198723 694974124 690082967 684417486 677936375 670587182 662274778 652922511 642409444
1264.6 642409444 630606532 617620051 603789747 589807332 576483667 563664317 550103724
1278.8 550103724 534848034 518056631 500963748 486118376 477344722 477855027 487805575 504991710
1295.2 504991710 528931856 559681177 589273870 602818549 593088448 569201052 548074663
1309.4 548074663 539043128 541169405 548787773 555136204 558029175 559694111 561909556 568380773
1325.8 568380773 585534334 615118742 650579453 682590842 704862833 714417160 711970091 706059575
1342.1 706059575 707795382 720912099 740967691 761206269 777577460 789150178 796052396 798941791
1358.4 798941791 798924088 796658635 792928159 788752794 784304202 779813349 775422752 770379722 764696479
1376.7 764696479 758748531 752508283 746504962 741509736 736985028 732044518 727396429 723334193
1393.1 723334193 719425201 715691924 712070882 708480060 704613805 698996484 690917015 680629492
1409.4 680629492 668135941 654188573 639752746 623716116 606649995 598286569 606203318 630873382
1425.7 630873382 665021002 698089182 717925191 719441473 699412227 659316719 622783065
1440 622783065 608280122 624792874 665883839 713924289 752556026 778703928 797299385 812442064
1456.3 812442064 821914136 824144602 824472606 824581504 823699594 822423756 821489155 820039809 817318618
1474.7 817318618 814010680 810577154 807123840 804162920 802439511 801674068 800189853 796899378
1491 796899378 793478549 790563881 786603630 781120658 775723398 771544993 767259002 758585989 747768223
1509.3 747768223 737824202 727794886 717784286 708921492 704396844 705800056 711082041 717598379
1525.6 717598379 724193692 730092824 735400081 738820672 739440203 739036322 737121284 732268929 726858497
1544 726858497 721780479 717027903 711930990 706622839 701750338 697593987 691192448 679995775
1560.3 679995775 671001375 662692428 652718306 639047086 619625509 602861106 601858795 625024617
1576.6 625024617 647849262 651732802 644057751 630275488 611613691 588936746 563283622 535259068
1593 535259068 505610943 477860719 457831830 450863928 459851205 482609749 513723314 547371089
1609.3 547371089 575603724 591043949 589088678 567712605 541230023 519357502 504340768
1623.5 504340768 502214193 511270523 523485184 531518281 534487188 536632955 546651006 566569567
1639.9 566569567 591626704 614177823 628761590 630215228 621698081 601041019 562976837 535244405
1656.2 535244405 518129706 505286515 497007012 493057191 492181331 493087053 494485974 495489001
1672.5 495489001 496689528 498138517 499942780 502689421 508392632 519526303 532620847 547399104
1688.8 547399104 565559089 583980978 604709923 627016544 646917880 666867435 682288706
1703.1 682288706 695647597 709796309 722276211 733579397 744600773 755858421 767451346
1717.4 767451346 776669979 783359468 789741218 796020806 801780879 807342768 812542140 817335546
1733.7 817335546 820403218 822043657 823347270 823830485 823514462 823105395 823134959 823600411 824442506
1752 824442506 825902343 828107119 830415368 832342207 833659947 834119141 834300995 834547281 834708869
1770.4 834708869 834042907 832476497 831170678 830656946 830646992 830765188 830945492 831237495 831863105 832830667
1790.8 832830667 833436131 833340049 833219588 833284736 833282471 833060443 832834005 832763731 832778037 832676053 832439125
1813.2 832439125 832297444 832200766 832073987 832088768 832297206 832397759 832365334 832169294 831603110 831110656
1833.6 831110656 830898523 830689490 830523729 830688179 830838323 830333650 829425573 828566611 827924907 827506125
1854 827506125 827181399 826858699 826567709 826450109 826643527 827044308 827148736 826607108 825991571 825705230
1874.4 825705230 825538516 825284839 825001955 824836671 824762702 824702859 824533105 824107766 823635995 823222041
1894.8 823222041 822570920 821571052 820356309 819075346 817737818 816172421 814622462 813944161 814425528
1913.2 814425528 815428853 816398501 817278147 818297625 819330454 819942236 820109129 820092261 820179522
1931.5 820179522 820528090 821000755 821379781 821691513 822010994 822183251 822142959 821949124 821680665 821528614
1951.9 821528614 821564674 821617186 821477830 821130335 820773304 820636094 820613921 820340037 819825113 819416642
1972.3 819416642 819263458 819233716 819122970 818887413 818671942 818570197 818485558 818266213 817882657 817408383
1992.7 817408383 816973150 816607356 816172540 815629423 815102994 814663053 814179301 813471675 812544525 811615586
2013.1 811615586 810937643 810624480 810613215 810705721 810687304 810573280 810578346 810591996 810372055 810002923 809611619
2035.6 809611619 809166074 808620274 808011711 807437003 806944489 806440294 805882812 805415988 805208683 805273890
2056 805273890 805465877 805660546 805900812 806269646 806669176 806948602 807076633 807094872 807030439 806851149
2076.4 806851149 806511939 806065619 805675209 805484474 805446923 805379212 805233121 805115283 805091798 805089653
2096.8 805089653 804991364 804764390 804507077 804278195 803997397 803610682 803148508 802682400 802232385 801736236
2117.1 801736236 801152587 800549269 800027847 799606025 799213469 798787296 798365355 798044324 797840118 797662497
2137.5 797662497 797443688 797228754 797125518 797118664 797067165 796898603 796685457 796531200 796418548 796275020
2157.9 796275020 796085298 795919895 795842588 795768917 795581341 795342624 795155644 794990301 794788122 794504344
2178.3 794504344 794128537 793760240 793468595 793178916 792819619 792387784 791944206 791577458 791244924 790796757
2198.7 790796757 790206254 789621532 789154172 788750708 788323820 787934482 787726998 787708938 787714124 787598550
2219.1 787598550 787369072 787096620 786807656 786475420 786102295 785764873 785523951 785355151 785172164 784901142
2239.5 784901142 784560740 784224093 783912957 783571780 783157587 782710612 782302916 781959832 781646609 781318069
2259.9 781318069 780998349 780735552 780492783 780176282 779759228 779324293 778935015 778556168 778119624 777640998
2280.3 777640998 777206957 776836038 776485682 776119888 775697410 775241554 774823964 774403930 773889661 773301065
2300.7 773301065 772769749 772354662 771972716 771554291 771123171 770750463 770442069 770105183 769662142 769167304
2321.1 769167304 768737376 768395901 768025279 767543256 767023683 766545832 766085863 765524387 764816701 764138460
2341.5 764138460 763681412 763367772 763040960 762666881 762190282 761538684 760774195 759937286 758978367 758041441
2361.9 758041441 757241249 756515682 755825937 755217493 754763961 754454672 754208207 753935218 753590286 753207386
2382.3 753207386 752835929 752436817 751924992 751295567 750639975 750037968 749458134 748799324 748073697 747391820
2402.7 747391820 746805668 746301055 745808482 745275080 744751096 744300485 743891716 743453324 742967069 742459059
2423.1 742459059 741930246 741346538 740691006 739958882 739161253 738319397 737419426 736448050 735446513
2441.4 735446513 734471738 733565986 732751429 732015729 731350899 730782330 730334699 729981780 729679108 729431033
2461.8 729431033 729242265 729036510 728734732 728336096 727858722 727275193 726541817 725683928 724748194 723773301
2482.2 723773301 722852588 722084820 721488595 720990181 720482707 719880939 719140053 718277633 717354774 716393113
2502.6 716393113 715356469 714236557 713090122 711981952 710899889 709788263 708656788 707560718
2518.9 707560718 706510425 705434859 704258204 702992260 701712132 700457335 699179411 697828710
2535.3 697828710 696432590 695090234 693933129 693011642 692315280 691894770 691829026 692136228 692727149
2553.6 692727149 693516374 694576323 696061552 698032200 700378180 702889621 705370188 707687616
2569.9 707687616 709714711 711267233 712184548 712442756 712163627 711456060 710339069 708885252 707338214
2588.3 707338214 706110358 705576897 705849230 706834733 708366096 710217178 712086141 713634491 714607596
2606.6 714607596 714963913 714848876 714368403 713515282 712321401 710943103 709602177 708421409 707392335
2625 707392335 706509054 705833852 705447018 705279887 705083191 704658389 704004228 703231096 702395320 701470912
2645.4 701470912 700457394 699466705 698622525 697899938 697188139 696448028 695732534 695129514 694694936
2663.7 694694936 694390714 694150448 694011629 694070041 694328964 694749594 695383489 696388423 697972178
2682.1 697972178 700233340 703034282 706102490 709229529 712297022 715143561 717554927 719433606
2698.4 719433606 720868528 722009838 722885787 723426461 723657429 723708391 723698080 723644495 723467946 723138809
2718.8 723138809 722752571 722406745 722121656 721833527 721524179 721335471 721313238 721307397 721160829 720822096
2739.2 720822096 720378935 719932377 719438612 718753159 717809439 716705859 715601325 714519680 713359118
2757.6 713359118 712126672 710977137 710011899 709175408 708367884 707599878 706919909 706257224 705460131
2775.9 705460131 704465866 703384042 702360272 701434016 700577140 699752569 698919892 698107302 697416782
2794.3 697416782 696833730 696203589 695449948 694662035 693912864 693136871 692262232 691253781 690138698
2812.6 690138698 689045250 688023746 687059939 686246693 685745239 685647488 685877025 686303258 686867952
2831 686867952 687554896 688374579 689298630 690204382 690988958 691611648 691981316 691992104 691654801 691077709
2851.4 691077709 690367699 689602911 688881338 688245535 687659025 687159538 686790645 686507642 686332345 686295927
2871.8 686295927 686260462 686165631 686160445 686291397 686490655 686745107 687027693 687259972 687404513 687529862
2892.2 687529862 687695444 687783062 687659621 687380612 686997652 686448216 685753047 685060441 684498131 684075475
2912.6 684075475 683701932 683342338 683067083 682975352 683141828 683535695 684097469 684655309 684835613 684544921
2933 684544921 684031308 683411837 682721555 682093620 681549549 680943131 680184066 679378092 678682625 677993298
2953.4 677993298 677203059 676466465 675865054 675392151 675023615 674724460 674546719 674517810 674622118 674830079
2973.8 674830079 675095260 675458789 675878823 676172078 676399529 676787317 677387059 678140819 678876519 679395854
2994.2 679395854 679768562 680102110 680407405 680805862 681371748 682123899 683105230 684181988 685036719
3012.5 685036719 685511053 685771704 686022103 686309755 686610281 686875820 687099993 687376261 687699497 687899351
3032.9 687899351 687830627 687589109 687430263 687315047 686984062 686257839 685092628 683848321 683145165
3051.3 683145165 683189154 683764994 684724331 685966611 687283754 688529193 689677894 690675914 691492498
3069.6 691492498 692218781 692994654 693964183 695092082 696099997 696866870 697539985 698219061 698964417
3088 698964417 699754238 700401843 700928450 701565206 702369213 703195810 703890383 704464018 705089808 705760241
3108.4 705760241 706287861 706758142 707333207 707937181 708491504 708967268 709328711 709650099 710056305 710574150
3128.8 710574150 711121321 711598277 712027252 712469637 712849677 713040769 713075817 713151336 713470995 714055419
3149.2 714055419 714675307 715053260 715122640 715084672 715106964 715130389 715097070 715020001 714905918 714803278 714733958
3171.6 714733958 714648128 714493155 714300811 714162588 714018822 713760018 713380158 712871253 712261319 711575508
3192 711575508 710746288 709704459 708466053 707105637 705674946 704190791 702692509 701270223 700024426
3210.3 700024426 698951900 697919846 696772754 695386767 693637729 691448390 688946724 686521590
3226.7 686521590 684754610 684227645 685150504 687226474 689953744 692856848 695559680 697859704 699701250
3245 699701250 701142132 702361941 703582227 704960406 706491828 708008945 709369123 710489094 711318135
3263.4 711318135 711904585 712281048 712421775 712321103 711980820 711442292 710795105 710058212 709200203 708236277
3283.8 708236277 707178295 706034422 704869747 703664303 702266574 700683713 699061930 697465122
3300.1 697465122 695913076 694342792 692624927 690708578 688579917 686225414 683694720 680990875
3316.4 680990875 678005576 674680769 671053231 667175114 663081467 658781707 654259562 649494529
3332.7 649494529 644482851 639192998 633561194 627512038 620963752 613843620 606041312 597343981
3349 597343981 587465346 576215804 563684583 550432205 537741244 527824879 523521543 526956797
3365.4 526956797 537892044 553090692 567533970 576665401 578114212 572777867 565147877 561265945
3381.7 561265945 564961672 575960934 591386974 608054817 623212039 634932399 642906129 648007035
3398 648007035 651006877 652303219 652377605 651841640 650981903 649785221 648255527 646411955 644367397
3416.3 644367397 642302692 640138447 637735605 635228693 632761478 630246043 627484739 624569535
3432.7 624569535 621698976 618732870 615578532 612432539 609354496 606032252 601804554 595998168
3449 595998168 588058829 577392399 564519942 552240133 544795573 545356929 553574264 565163136
3465.3 565163136 574685633 579385579 580569506 581662774 585269809 592052579 601201117 611328840
3481.6 611328840 621232748 630174816 637723446 643802166 648793936 653066337 656757534 659930110
3497.9 659930110 662775636 665428996 667649209 669460833 671314955 673291504 675208390 676973403
3514.2 676973403 678574324 680135548 681834757 683710933 685420752 686755300 687962711 689239204
3530.6 689239204 690704107 692401767 694039464 695446670 697011769 698922098 700758934 702093542
3546.9 702093542 703174293 704434991 705790520 707113028 708564639 710231662 711963415 713687122
3563.2 713687122 715545058 717368126 718725979 719855726 721228361 722953260 724868953 726849437
3579.5 726849437 728917062 731179059 733574867 735635161 737231910 738912523 740887105 742976606
3595.8 742976606 745089471 747120678 748959959 750793517 752807796 754906237 756889880 758810997
3612.1 758810997 760681093 762460768 764284194 765873611 767043173 768347025 770101130 771857798
3628.5 771857798 772874713 773514569 774324179 775260031 776199162 777130008 778166950 779539347 781278789
3646.8 781278789 782696605 782838941 782475352 782557607 782946587 783246398 783392787 783487976 783829629 784549892
3667.2 784549892 785220444 785479069 785680354 785553157 784782708 784118593 783865809 784121454 785016239 786294758
3687.6 786294758 786900938 786404073 785841942 785659373 785746872 786000907 786103785 785956323 786065638 786647677
3708 786647677 787187457 786976039 786356091 786025643 786038876 786224961 786336720 786196709 785867810 785720944
3728.4 785720944 786110044 786921024 787438333 787065089 786361396 786068439 786122143 786026299 785907626 786069393
3748.8 786069393 785844088 784987569 784415245 784286320 784120440 783779681 783605635 783636630 783658922 783506036
3769.2 783506036 783096731 782714128 782654107 782891810 783015966 782771051 782488465 782218754 781871259 781620264
3789.6 781620264 781565666 781688929 781859338 782007039 782147765 781962574 781517744 781134784 780585706 780070484
3810 780070484 780016124 780317485 780554235 780669510 780612350 780018985 779384375 779055417 778877616 778859854
3830.4 778859854 779002726 779324114 779659152 779559970 779064775 778509021 777998567 777752697 778001606 778640151
3850.8 778640151 778846145 778036594 777338147 777137935 777246535 777399719 777313173 777198195 777170777 776965141
3871.2 776965141 776570678 776184320 776104331 776313961 776396275 776320636 776094973 775696576 775464475 775284231
3891.6 775284231 774988711 774925649 775174022 775427520 775419891 775023282 774386525 773903370 773669600 773603976
3912 773603976 773688078 773783565 773694634 773487210 773338139 773244619 773159146 773134291 773138463 773004949 772729158
3934.4 772729158 772495747 772430778 772481263 772449493 772318661 772275805 772284925 772161245 771933019 771742940 771664619
3956.8 771664619 771656215 771596551 771458566 771313906 771201611 771129072 771086156 771039724 770943642 770779133 770620108
3979.3 770620108 770550907 770548642 770510137 770396590 770254791 770122528 769977808 769793510 769642353
3997.6 769642353
##END=$$ End of the data block
