##TITLE=Ac. p-acetamidobenzoico - Oseias e Dalila $$ Begin of the data block
##JCAMP-DX=5.00 $$ ACD/SpecManager v 10.08
##SPECTROMETER/DATA SYSTEM=Alpha
##DATE=07 Apr 2015 09:02:46
##DATA TYPE=INFRARED SPECTRUM
##DATA CLASS=XYDATA
##ORIGIN=
##OWNER=
##NPOINTS=1765
##FIRSTX=399.76428223
##LASTX=3997.64306641
##MAXX=3997.64306641
##MINX=399.76428223
##MAXY=1.01610065
##MINY=0.00185711
##XFACTOR=1.0000000000
##YFACTOR=0.000000010000000
##FIRSTY=1.00000000
##DELTAX=2.03961372
##XUNITS=1/CM
##YUNITS=ARBITRARY UNITS
##XYDATA=(X++(Y..Y))
399.8 100000000 101571178 101610065 100997412 100000000 99942726 99533290 98863566 97947645 96445644 94532061
420.2 94532061 93065095 91158360 86536384 77665269 68023854 66256905 74853945 86295348
436.5 86295348 93734509 97111553 98544866 99204683 99621326 99910569 100000000 99943775 99829125 99781197
456.9 99781197 99802512 99705112 99455333 99253631 99144721 98963267 98580676 98124087 97797346 97551328
477.3 97551328 97166860 96520007 95705760 94868326 93888396 92408550 90093875 86508340 80784017
495.6 80784017 72010291 60484487 50228751 49316555 59568435 73453188 84082395 90088743
511.9 90088743 92698181 93436497 93338603 92907757 92393988 91810501 90987611 89714038 87853003 85320812
532.3 85320812 81930923 77162927 70388252 61411041 51132470 41881371 36905897 38687560
548.7 38687560 46967345 58654064 69952065 78531271 83995843 87074971 88641751 89218009
565 89218009 88870412 87341636 84364754 80723113 79087937 81237429 84997720 87592882 88761365
583.3 88761365 89184713 89111030 88583767 87692744 86503786 84913164 82639766 79427218 75122106
601.7 75122106 69624722 63614988 60178632 63406605 72692376 82220948 87938672 90163714 90474296
620 90474296 89998281 89442736 88997483 88145369 86320156 84600216 84836060 86238146 86768168 86241418
640.4 86241418 85414338 84952712 84982955 84971046 84579515 83956462 83218515 82352990 81326050 80060911
660.8 80060911 78548038 76910681 74533421 70855671 67526466 63821417 57896882 50286329 45784828
679.2 45784828 48603255 55104226 59013444 59202880 57520354 55054629 51662242 46536165 40029553
697.5 40029553 34738308 33183736 35310376 39424238 44115815 48764110 53181380 57261950 60917395
715.9 60917395 64108092 66889966 69330722 71523911 73552203 75382656 76980215 78421885 79807884
734.3 79807884 81129891 82280022 83197892 83951759 84614271 85111541 85295022 85110778 84606171 83671510
754.7 83671510 81803930 78467935 73010272 63153070 47195902 31273282 27482247 39057311
771 39057311 56388569 70154577 78265691 82173645 83778703 84391940 84477788 83902204 82257903
789.3 82257903 79153061 74576491 69699121 67416710 70204276 76750124 83067399 86633116 87269312
807.7 87269312 85509688 82538748 80681098 81336558 83079892 83874923 83345616 81945020 79812175
826 79812175 76733851 72569054 67841953 64263123 63982129 67257255 71561486 74009913 73506051
844.4 73506051 70558190 66050357 60103393 53400677 49781889 52801144 59142524 62035900 58964169
862.8 58964169 51581663 44325799 44402903 55170536 70314020 81455904 86857885 88903594
879.1 88903594 89527458 89590740 89404821 89005959 88384527 87628436 86855471 86083364 85231870 84254789
899.5 84254789 83181113 82037479 80757785 79234695 77433079 75393510 73131144 70588744 67713475
917.8 67713475 64524102 61098433 57525349 53912175 50414944 47259346 44702947 42920557 41911721
936.2 41911721 41577458 41869107 42772922 44239783 46172366 48438066 50780344 52690220 53779346
954.5 53779346 54679680 56514597 58813763 59948522 60021293 61019838 63977897 68030357 71917099
972.9 71917099 74672610 75667554 74769199 72114867 68960452 68259406 71171522 74925947 76899165
991.3 76899165 77143723 76490331 75303882 73657650 71572006 69054848 66080189 62616396 58775485
1009.6 58775485 55012411 52077776 50489521 50366145 52340895 57234478 63959384 69855571 73372954
1028 73372954 74702460 74533558 73335350 71362466 68889290 66485244 65083587 65511006 67768776
1046.3 67768776 70954323 74027485 76463979 78240162 79499674 80349100 80858928 81114304 81219745
1064.7 81219745 81229985 81119573 80849773 80446100 79955178 79383457 78709072 77928305 77084929 76245928
1085.1 76245928 75458777 74714184 73961288 73154038 72256565 71183735 69807196 67984390 65550840
1103.4 65550840 62415171 58912599 56056303 54836124 55062592 55516106 55391294 55115318 55508476
1121.8 55508476 56033069 54558849 50519919 47970566 51303911 58546710 64520544 67442793 68386781
1140.1 68386781 68420309 68038487 67429715 66637063 65689051 64684641 63725966 62788647 61728281 60392886
1160.5 60392886 58653301 56371295 53350991 49265879 43799025 37291840 30986834 26244661
1176.9 26244661 24095444 25270876 30318102 39552966 50984001 60019940 64100820 64566362
1193.2 64566362 63549763 62123996 60683328 59386635 58253002 57202405 56141901 55071789
1209.5 55071789 54039830 53031409 52054113 51185417 50417858 49613187 48658717 47557372 46367005
1227.9 46367005 45100048 43734866 42285538 40792432 39234513 37505975 35512096 33254257
1244.2 33254257 30804634 28201512 25411016 22369835 19053052 15540636 12067657 9038553
1260.5 9038553 7006539 6623734 8639491 13407116 19767998 25127167 27536675 26977614 24408843
1278.8 24408843 20768915 16784681 12970455 9635641 6968020 5072271 3931661 3434476 3467547
1297.2 3467547 4063938 5392179 7308505 8861444 8907875 7395526 5411988 4253716 4772642
1315.6 4772642 6826658 9410737 12073424 15631010 20795150 27017432 32959539 37585783 40805945
1333.9 40805945 43372041 46317521 50130355 54053068 57046676 58635360 58696085 57354140 54804331
1352.3 54804331 51178831 46548137 41034830 34793273 28626430 24554859 23473595 24365355 25977111
1370.6 25977111 27770278 29817638 31881315 33555946 34551501 34654191 33849949 32135808 29864517
1389 29864517 27667993 25531098 23229420 20881011 18532246 16433996 14933035 14286347 14893457
1407.3 14893457 16614544 18684499 19966625 19760354 17872475 14626433 11689742 9739611 8797319
1425.7 8797319 9283835 11668705 15895149 21293609 28347263 36192676 42207301 46951261 51042128
1444.1 51042128 54418749 57312036 59652853 61453813 62829620 63929337 64663029 64843464 64525896
1462.4 64525896 63666266 62510681 61455870 60303175 58645135 56683350 54642773 52514356 50438046
1480.8 50438046 48733065 47486880 46177486 44068614 41099626 38063362 34654191 30284497
1497.1 30284497 25920790 22461565 19658813 16489419 12123124 8943769 7288273 6096391
1513.4 6096391 4979600 3798469 2920437 2516734 2609509 3154483 4171495 5567357 7578629
1531.8 7578629 10721727 14121558 17752257 23729181 31057894 37412572 43353680 48895454 54255456
1550.1 54255456 59023017 62842619 65682626 67959875 69702548 70366788 70514721 70566726 70579237
1568.5 70579237 70391560 69671077 67624307 63145095 57509011 51383305 43793017 34912151 25639635
1586.8 25639635 17743632 13402058 13539253 16936189 21124013 23999071 24455942 22080247 17720602
1605.2 17720602 14069238 15021685 22504626 33472809 44300553 52120501 54838055 54371345
1621.5 54371345 52246231 49365318 46050817 42378607 38936466 35406190 30942690 27042630
1637.8 27042630 24431127 22212917 20079760 17571035 14915414 13066164 11005540 7953798
1654.1 7953798 5867209 4401864 3027415 1833496 1013625 575674 327097 195836 185711
1672.5 185711 276572 446926 660804 884265 1205519 1754657 2393235 3058402 3861852 4652511
1692.9 4652511 5509108 6553618 8254589 11462853 15297392 19859394 25214595 30099136 34454498
1711.3 34454498 38655147 43115467 48434004 53596157 57656002 61452979 65154064 68375158
1727.6 68375158 71102297 73339731 75469482 77379584 78716016 79966724 81435549 83003974
1743.9 83003974 84513313 85807192 86919034 87866652 88554984 89024121 89345211 89518613 89584130
1762.2 89584130 89685553 89818388 89931399 89984530 90049064 90294486 90602428 90767407 90741014 90607417
1782.6 90607417 90426636 90280229 90203428 90167487 90258223 90523243 90806240 90994954 91074318 91075414 91072220
1805.1 91072220 91166240 91426647 91832340 92343837 92950606 93651724 94362944 94938433 95311761 95527643
1825.5 95527643 95630521 95639503 95664012 95732117 95787132 95845151 95916635 95949310 95944458 96019465 96180105 96350187
1850 96350187 96497416 96605879 96676463 96719337 96737140 96728545 96689713 96603340 96486443 96424270 96405613 96338141
1874.4 96338141 96211344 96051770 95866323 95660627 95445520 95230776 95029360 94905192 94884109 94930255
1894.8 94930255 95056581 95261949 95491892 95681906 95772201 95739090 95627803 95518446 95447588 95416307
1915.2 95416307 95487583 95759320 96189582 96682972 97159493 97527939 97744733 97793663 97683114 97490048
1935.6 97490048 97348154 97358394 97533852 97817659 98098207 98289001 98351157 98238337 97908735 97407550
1956 97407550 96927774 96734267 96931553 97362852 97817999 98205292 98498040 98687905 98796457 98854631
1976.4 98854631 98888618 98918515 98953342 98992735 99038112 99089962 99141943 99196249 99250919 99289018 99320316 99364001
2000.9 99364001 99404520 99418932 99404466 99372876 99329281 99265641 99170542 99055922 98948991 98845011 98714268
2023.3 98714268 98567271 98455626 98368919 98247910 98071921 97863263 97658610 97484481 97347224 97227472
2043.7 97227472 97093356 96936518 96774536 96614969 96449894 96274239 96086019 95880842 95651776 95389146
2064.1 95389146 95097613 94792742 94478822 94158918 93843615 93563151 93359172 93257660 93256676 93334800
2084.5 93334800 93471020 93646240 93831944 93984628 94059670 94032025 93909997 93726259 93521416 93337655
2104.9 93337655 93213981 93170929 93199986 93272835 93361962 93454528 93541199 93606627 93634140 93615001 93549621
2127.3 93549621 93455017 93356287 93262595 93170577 93073666 92968130 92851382 92715263 92553264 92370707 92177987
2149.8 92177987 91981798 91774279 91537464 91271043 90997934 90749043 90551311 90417975 90341789 90314698
2170.2 90314698 90327215 90352273 90365440 90363824 90356767 90348661 90331101 90284634 90198976 90083176 89954257 89827138
2194.6 89827138 89707863 89592016 89473414 89353114 89231199 89104027 88975966 88855743 88738251 88606268
2215 88606268 88445497 88259763 88066763 87877578 87690890 87500733 87306637 87110204 86909682 86701119
2235.4 86701119 86481369 86263651 86077434 85944295 85865158 85822952 85801464 85793930 85777926 85714966 85584736
2257.9 85584736 85395634 85180497 84984952 84827507 84684628 84529680 84359103 84174234 83973980 83762270
2278.3 83762270 83546579 83334851 83122110 82891035 82632500 82351518 82059199 81767845 81492597 81255656
2298.7 81255656 81076193 80953133 80866283 80797654 80738002 80674493 80593526 80480963 80316317 80092615 79833078
2321.1 79833078 79568124 79309756 79047126 78772616 78516114 78311116 78150314 78015405 77893889 77763528
2341.5 77763528 77596241 77412748 77283603 77179718 77006316 76734602 76419497 76104790 75797987 75493211
2361.9 75493211 75195062 74904108 74598807 74280292 73971939 73675370 73383945 73108101 72854894 72610867
2382.3 72610867 72359091 72086871 71793175 71492475 71195251 70903450 70620239 70347106 70080137 69812661
2402.7 69812661 69534647 69235754 68917668 68595254 68279427 67972422 67677200 67402327 67151564 66918719
2423.1 66918719 66696209 66474128 66242152 65991503 65719759 65429771 65119219 64785492 64431953 64066118
2443.5 64066118 63696736 63321209 62924576 62492108 62017584 61513382 61007518 60526568 60078305 59660083
2463.9 59660083 59269714 58903718 58562148 58244050 57947356 57664567 57371080 57039636 56663972 56254649
2484.3 56254649 55831152 55419105 55033726 54675788 54344857 54041469 53757876 53473717 53162223 52804101
2504.7 52804101 52392095 51929885 51429278 50898427 50341493 49767530 49179617 48572701 47951877 47330734
2525.1 47330734 46719000 46121949 45543319 44981077 44432366 43903223 43403217 42939204 42520210 42166239
2545.5 42166239 41907585 41776460 41799486 41992378 42355567 42874786 43520701 44259328 45069259 45938662
2565.8 45938662 46851853 47784880 48708123 49588409 50391775 51083618 51624829 51976460 52117157 52052712
2586.2 52052712 51813388 51449293 51025915 50620621 50312805 50163865 50204200 50428379 50788343 51204610
2606.6 51204610 51592445 51887178 52052766 52078825 51979208 51779509 51505560 51189345 50867015 50559253
2627 50559253 50270236 49997059 49728039 49450755 49160022 48855227 48537335 48213273 47906575 47640961
2647.4 47640961 47410244 47188616 46958247 46720335 46482715 46242476 45999709 45771962 45586070 45468599
2667.8 45468599 45444623 45541680 45786145 46194199 46765429 47483420 48323697 49256110 50243098 51245201
2688.2 51245201 52226126 53152949 54004842 54777658 55471212 56072658 56554389 56879807 57013243 56946987
2708.6 56946987 56708473 56339508 55895895 55451506 55075282 54810363 54679215 54696989 54860139 55143201
2729 55143201 55520004 55957800 56405556 56802970 57088107 57206666 57135832 56886142 56484365 55966264
2749.4 55966264 55368024 54724014 54073250 53456384 52903152 52421719 51998341 51614362 51249218 50873142
2769.8 50873142 50453216 49965394 49410117 48809904 48194319 47588372 47013265 46487698 46020445 45609856
2790.2 45609856 45243704 44907597 44599259 44321370 44068038 43827236 43587923 43342939 43092805 42843965
2810.6 42843965 42596918 42353296 42126629 41930264 41771731 41661808 41610235 41614348 41666126 41752470 41856721
2833 41856721 41972151 42108920 42284897 42498776 42731643 42973968 43222070 43473428 43733802 44009757
2853.4 44009757 44305319 44613853 44908667 45149562 45306113 45375493 45369524 45305270 45209381 45107067 45006904
2875.9 45006904 44911668 44829923 44769770 44729379 44703951 44703755 44742626 44824448 44952813 45126486 45332032
2898.3 45332032 45560119 45805898 46050084 46262267 46414486 46485731 46457201 46320897 46098918 45829898
2918.7 45829898 45535076 45209578 44854558 44520268 44296151 44232377 44295588 44410715 44520319 44609371
2939.1 44609371 44687515 44760969 44817397 44843283 44846833 44839635 44814059 44765335 44706953 44639489 44555771 44455853
2963.6 44455853 44335407 44195104 44040233 43870631 43694216 43533275 43413433 43352470 43343481 43360996
2984 43360996 43382543 43390000 43373075 43334869 43285435 43241319 43224356 43253344 43340731 43490335 43691471 43912119
3008.4 43912119 44111416 44256622 44323969 44305575 44212136 44057539 43856779 43629542 43397731 43194553
3028.8 43194553 43064994 43055552 43199423 43488124 43863744 44249791 44564793 44756192 44885719 45144451
3049.2 45144451 45703232 46523494 47401443 48175433 48803347 49297479 49665150 49883220 49903747 49689731
3069.6 49689731 49276838 48845825 48673928 48923638 49482328 50061685 50442821 50607646 50713652 50958133
3090 50958133 51399040 51922572 52366555 52608168 52590150 52344781 51999748 51732510 51683748 51905686
3110.4 51905686 52374589 53005987 53699982 54400134 55084419 55751324 56424844 57123047 57828933 58512348
3130.8 58512348 59170568 59832704 60520071 61216050 61885661 62515217 63100106 63618493 64054865 64406008
3151.2 64406008 64661205 64818341 64894670 64895499 64803576 64602989 64283001 63820761 63185489 62357306 61338443
3173.6 61338443 60183048 59032696 58100843 57562160 57437843 57592559 57832336 58013010 58083230 58096099
3194 58096099 58184421 58472246 58986419 59642202 60295379 60815513 61141592 61293405 61345655 61383092 61436647
3216.5 61436647 61457050 61376071 61152148 60765886 60220098 59527975 58701557 57754821 56684303 55480945
3236.9 55480945 54160661 52734905 51200145 49563250 47833058 46016276 44152418 42309114
3253.2 42309114 40545082 38902014 37405217 36062527 34848359 33706355 32583201 31450400
3269.5 31450400 30310768 29201865 28164852 27195966 26237693 25206137 24032618 22705945 21278982
3287.8 21278982 19835487 18450573 17158791 15951143 14823925 13829355 13055465 12584411 12476796
3306.2 12476796 12775345 13509220 14687233 16288744 18284361 20652163 23342830 26276785 29380488
3324.6 29380488 32587114 35829964 39076859 42327112 45578155 48812652 51999044 55094141
3340.9 55094141 58046252 60811764 63353986 65646958 67708898 69573897 71236229 72689986
3357.2 72689986 73966050 75100988 76108968 76995850 77787650 78521043 79209381 79832101 80373925
3375.5 80373925 80846643 81271791 81662208 82006890 82292229 82524240 82707238 82863849 83025563 83170229
3395.9 83170229 83270133 83344465 83424097 83506197 83558828 83576322 83583206 83593053 83605993 83616126 83613199 83607912
3420.4 83607912 83618397 83637226 83653593 83670783 83692002 83719480 83754444 83795321 83839798 83884072 83931452 83985597
3444.9 83985597 84052253 84140188 84235662 84321338 84403187 84497905 84609014 84722579 84838998 84967679 85099715
3467.3 85099715 85213917 85300457 85382742 85489202 85616183 85729957 85823411 85930175 86047798 86149174
3487.7 86149174 86245036 86350989 86460704 86578667 86711872 86841184 86940378 87027436 87137306 87260753
3508.1 87260753 87394249 87555230 87720031 87860239 87988055 88109797 88211238 88285089 88336122 88364851
3528.5 88364851 88365871 88344818 88356864 88468504 88684523 88989729 89353019 89704156 90010875 90282881
3548.9 90282881 90497482 90671784 90867126 91078728 91275328 91457868 91612768 91699380 91802025 92059672
3569.3 92059672 92369372 92612106 92815340 93024904 93258494 93521565 93766564 93918109 94045347 94307160
3589.7 94307160 94609404 94839412 95065838 95335013 95597857 95861477 96135134 96342701 96485180 96654755
3610.1 96654755 96855450 97075474 97281504 97410041 97569120 97832364 98082793 98179150 98116076 98219121
3630.5 98219121 98496974 98720020 98883873 99020433 99135602 99245447 99309796 99231517 99072576 99156481
3650.9 99156481 99433911 99601704 99674672 99803066 99915427 99965459 100000000 99965280 99784684 99686086 99655002
3673.3 99655002 99457073 99363059 99474192 99601245 99742562 99875259 99889296 99825382 99907017 100095797
3693.7 100095797 100230753 100273883 100223207 100113857 100081038 100121152 100097597 99947733 99830967 99944663
3714.1 99944663 100121355 100183439 100141037 100066423 100000000 100001860 100081301 100109649 99973410 99775821 99732465
3736.5 99732465 99878585 100024343 99940658 99684817 99632657 99622720 99468458 99479741 99665654 99767995 99769086
3759 99769086 99835265 99946928 99981976 99953836 99907011 99919438 100010192 100078237 100063336 100000000 99997848 100019705
3783.5 100019705 100020051 100044906 100098193 100147855 100147414 100081074 100026703 99933732 99809080 99853820 99908549 99911189
3807.9 99911189 100028241 100164974 100146985 100003839 99925172 99830008 99774849 99898040 100001943 100038171 100040758
3830.4 100040758 100019503 100000000 99894255 99730974 99719226 99816561 99925661 100051630 100144064 100049281 99653804
3852.8 99653804 99456120 99696994 99923205 99972463 99904597 99873209 99893045 99812084 99726516 99761611 99854201
3875.2 99854201 99944460 99919510 99876636 99918854 99931216 99968952 99991703 99931133 99969840 100092149 100094521 99958652
3899.7 99958652 99805140 99724889 99790084 99940509 100040472 100079417 100083101 100025594 99959838 99969333 100001347 99992323
3924.2 99992323 99991935 100005734 99969870 99931008 99968946 100029755 100048435 100020885 99983400 100000000 100042832 100065243
3948.7 100065243 100096512 100137866 100160182 100169122 100179327 100183094 100188661 100216305 100257730 100295746 100321829 100332141
3973.1 100332141 100343335 100363970 100376797 100383329 100389838 100385523 100368071 100346172 100330651 100324500 100318575 100313854
3997.6 100313854
##END=$$ End of the data block
