##TITLE=Ac. p-acetamidobenzoico - Nicole e Lucas $$ Begin of the data block
##JCAMP-DX=5.00 $$ ACD/SpecManager v 10.08
##SPECTROMETER/DATA SYSTEM=Alpha
##DATE=07 Apr 2015 09:02:46
##DATA TYPE=INFRARED SPECTRUM
##DATA CLASS=XYDATA
##ORIGIN=
##OWNER=
##NPOINTS=1765
##FIRSTX=399.76428223
##LASTX=3997.64306641
##MAXX=3997.64306641
##MINX=399.76428223
##MAXY=1.01167583
##MINY=0.00651350
##XFACTOR=1.0000000000
##YFACTOR=0.000000010000000
##FIRSTY=1.00000000
##DELTAX=2.03961372
##XUNITS=1/CM
##YUNITS=ARBITRARY UNITS
##XYDATA=(X++(Y..Y))
399.8 100000000 101025367 101167583 100778723 100000000 99975699 99834692 99594009 99184763 98312956 96941757
420.2 96941757 95761120 94362974 90983915 84074360 76032001 73967969 80389404 89269030 95009434
438.5 95009434 97637111 98790967 99308389 99590635 99757648 99832034 99827433 99822617 99866349 99836600 99689019
461 99689019 99534458 99428815 99333459 99199712 99018961 98812175 98578620 98297107 97958076 97588563
481.3 97588563 97175914 96650070 95919460 94894910 93407094 90997565 86814708 79770124 69528711
499.7 69528711 59775746 58730400 68104833 80121171 88535112 92995542 94960105 95586938 95629990
518.1 95629990 95492333 95320064 95033973 94481897 93612993 92417610 90752029 88332671 84720147
536.4 84720147 79361695 71812385 62476283 53354204 47767958 48498669 55445457 65500110 74991292
554.8 74991292 81967908 86379856 88954657 90304875 90800327 90590835 89553404 87407339 84589106
573.1 84589106 83149558 84669602 87609476 89695066 90554756 90734947 90567786 90136254 89402950
591.5 89402950 88318616 86861104 84922826 82254797 78566074 73687917 68233216 64826882 66578579
609.8 66578579 72302711 77379251 79652256 80073500 80388254 81655020 83588904 85534924 86800277
628.2 86800277 86747080 86172837 86678064 87933385 88564563 88464910 88127345 87915522 87945664 88011229
648.6 88011229 87919497 87669623 87271941 86747551 86139691 85389686 84432614 83362478 81807178 79221076
669 79221076 76659542 73625517 68501365 61404854 56565565 58358294 63970768 67606503 68016922
687.3 68016922 66779971 64838600 62022185 57385367 50893325 44974566 42598483 44225243 48199260
705.7 48199260 52894831 57543343 61900049 65837854 69283706 72253150 74853688 77136761 79130226
724.1 79130226 80901319 82487905 83908248 85192168 86360031 87410253 88339174 89154953 89856553
742.4 89856553 90422857 90827048 91041255 91046309 90807509 90177244 88789260 86264563 81940222 73143893
762.8 73143893 57174218 40201557 36361361 49299267 67181587 79902321 86665297 89830291
779.1 89830291 91205645 91751581 91808945 91356426 90138096 87755477 83994734 79654050 77212811
797.5 77212811 79035896 84247261 89488661 92604935 93548155 92823815 91168845 90006137 90285408
815.8 90285408 91209549 91548157 91044068 89933801 88259405 85800463 82327962 78122437 74625033
834.2 74625033 73933119 76595443 80528587 83118618 83264834 81225425 77516478 72042459 65347743
852.6 65347743 61227208 63605785 69635463 72618330 69768280 62348658 54727322 54571372 65316015
870.9 65316015 80086452 90453631 95195025 96945721 97538835 97651440 97492635 97141755 96669745
889.3 96669745 96123219 95508689 94831252 94099796 93318224 92459327 91480672 90342212 89015633 87479073
909.7 87479073 85711807 83686602 81374669 78759885 75833356 72607827 69138187 65542245 61993641
928 61993641 58721477 55986679 54006994 52873236 52561581 53029656 54216599 56012142 58281732
946.4 58281732 60878658 63520348 65639186 66765082 67520529 69190615 71478128 72704464 72800714
964.7 72800714 73705274 76509577 80310273 83784747 86131454 86953926 86117643 83571470 80353028
983.1 80353028 79327857 81898165 85602534 87772822 88261980 87840134 86900437 85540235 83768362
1001.4 83768362 81564409 78883201 75668836 71982175 68225288 65152818 63326347 62821782 64175600
1019.8 64175600 68249029 74139422 79398412 82602519 83911484 83896983 82930690 81219506 79005235
1038.2 79005235 76814693 75533378 75927383 77959150 80763561 83387482 85367560 86684477 87459177
1056.5 87459177 87793905 87773335 87501073 87142950 86813927 86448169 85924149 85212654 84317178 83233750
1076.9 83233750 81983143 80621266 79208887 77785987 76373780 74950200 73482966 71959901
1093.2 71959901 70347661 68587345 66642904 64453983 61878377 58797199 55438513 52587932
1109.6 52587932 51041240 50698441 50660300 50320864 49964517 50179040 50625306 49773839 47062132 45342612
1129.9 45342612 48031631 53896803 59062058 62030113 63486260 64216077 64649916 64986825 65276480
1148.3 65276480 65520144 65748763 66001469 66240287 66326845 66085386 65404373 64246321 62462533 59635609
1168.7 59635609 55218709 49165198 42432693 36606410 33300239 33623019 38043994 46651134 57603693
1187.1 57603693 66755491 71609211 73115152 73081768 72494930 71760571 71069044 70482343 69959414
1205.4 69959414 69423103 68861854 68301845 67718095 67115647 66581136 66136819 65665352 65036750 64217693
1225.8 64217693 63243312 62122798 60840452 59422040 57927650 56351298 54571438 52443063 49921688
1244.2 49921688 47070152 43928286 40433559 36457089 31900513 26814884 21505634 16612442
1260.5 16612442 13128448 12229430 14996625 21562065 29972771 36922482 40327030 40292001 37778324
1278.8 37778324 33651486 28643164 23383504 18371746 14033955 10721766 8586501 7533196
1295.2 7533196 7358573 8053776 9843837 12565136 14945333 15290657 13221374 10096142 7963244
1313.5 7963244 8384921 11239321 14849772 18273638 22481887 28409621 35408336 41933727 46875831
1331.9 46875831 50212342 52786678 55650687 59270418 62998438 65966034 67763335 68243682 67468733
1350.2 67468733 65573913 62632376 58591127 53389049 47041205 40348274 35602981 34098879
1366.6 34098879 34877780 36515412 38383728 40534917 42729250 44566214 45720476 45952830 45283365
1384.9 45283365 43676868 41317761 38832200 36360514 33715439 30951208 28082272 25426093
1401.2 25426093 23459724 22572960 23304760 25514659 28213498 29947028 29830042 27595034 23502420
1419.6 23502420 19477229 16533476 14887115 15180942 17943418 22945578 29224545 37034541 45274508
1437.9 45274508 51379669 56081086 60093260 63409311 66235453 68492991 70259172 71743262
1454.3 71743262 73172826 74203640 74459839 74314588 73862374 73128724 72383660 71637756 70558137
1472.6 70558137 69049364 67229503 65212274 63207054 61600161 60567075 59655344 58035421 55343735
1491 55343735 52241218 48580340 43756998 38624093 34239224 30527022 26271990 20347333 15701917
1509.3 15701917 13049613 11121546 9279399 7280234 5729810 4971346 5047798 5876583 7439480
1527.7 7439480 9571577 12569708 17024024 21709879 26566756 33908814 42099983 48580134 54213065
1546 54213065 59203458 63788050 67728287 70878339 73337382 75468886 76862103 77196348 77276897
1564.4 77276897 77442777 77685231 77769256 77334207 75928432 72632068 68000901 62527955 55379462
1582.8 55379462 46369216 36068156 26513368 20833555 20756543 24860482 29876101 33216438 33707091
1601.1 33707091 30870119 25508097 20796984 21628027 30186754 42384955 53571391 60826606
1617.4 60826606 62978756 62295747 60121161 57121158 53660160 49981883 46718082 43595123 39715791
1635.8 39715791 36073470 33391365 31059530 28780419 26023921 22938040 20554416 17807327
1652.1 17807327 13722216 10607161 8195958 5864782 3768783 2249996 1389850 893222 651350
1670.5 651350 668639 920087 1352758 1859495 2393585 3130530 4305267 5581258 6865304 8341571
1690.9 8341571 9729700 11124267 12706164 15181826 19722953 24985147 30856451 37315005 42865577
1709.2 42865577 47584954 51976019 56458825 61426121 65872771 69187111 72213113 75117987
1725.5 75117987 77643591 79811031 81628698 83322251 84643781 85509843 86413288 87483466 88601625
1743.9 88601625 89704198 90680653 91473502 92022550 92375141 92657745 92854780 92945504 92945939 92927754
1764.3 92927754 92992115 93150932 93329555 93467146 93546379 93599254 93621397 93553978 93402255 93215376 93052959
1786.7 93052959 92983228 93038207 93157631 93275887 93410522 93547028 93614340 93580240 93531179 93570775 93736035
1809.2 93736035 93981725 94281179 94676483 95174795 95693493 96147978 96508056 96741897 96851975 96875036
1829.6 96875036 96829742 96780533 96777731 96805501 96857822 96955866 97069436 97126204 97154766 97218555 97307855 97388273
1854 97388273 97444320 97483969 97509611 97516310 97518075 97539634 97551709 97488481 97376055 97267830 97168016 97059417
1878.5 97059417 96927100 96769273 96599305 96449012 96333557 96236336 96176875 96191895 96276689 96408921
1898.9 96408921 96558416 96684819 96758389 96767741 96709239 96607369 96529830 96544600 96682066 96921766 97234988
1921.3 97234988 97599751 97947663 98217076 98380578 98423362 98356605 98229712 98131114 98153311 98322225
1941.7 98322225 98553818 98748219 98874927 98917234 98842752 98615772 98246235 97864264 97686338 97819144
1962.1 97819144 98163629 98549718 98865837 99088019 99243242 99350232 99416655 99458420 99494189 99532652
1982.5 99532652 99573088 99622065 99684769 99754101 99807185 99832034 99851412 99885434 99928689 99966383 99991453 100000000
2007 100000000 99995798 99976140 99945480 99906009 99852794 99777198 99683362 99578869 99481601 99430096 99401510 99332869
2031.5 99332869 99216884 99078822 98939711 98818088 98717523 98625135 98527265 98416978 98299110 98178196
2051.9 98178196 98055339 97930461 97797668 97648972 97481447 97288150 97059959 96805078 96534830 96257246
2072.3 96257246 95988411 95751882 95573997 95476621 95461404 95517761 95637870 95805913 95991063 96147603
2092.7 96147603 96233553 96237022 96173465 96057791 95907724 95760906 95661336 95630854 95658308 95718825 95796674
2115.1 95796674 95890343 95988935 96066397 96105510 96108139 96083891 96038568 95973873 95900613 95838130 95786065 95724177
2139.6 95724177 95638996 95534950 95423537 95306951 95176947 95031542 94876289 94711530 94529146 94325948
2160 94325948 94124645 93963110 93862015 93811721 93796319 93807995 93834674 93861908 93878043 93879533 93876141 93873233
2184.5 93873233 93853992 93798912 93712568 93617851 93530703 93450791 93369776 93282890 93195254 93108934 93016815 92920977
2208.9 92920977 92835009 92758828 92673016 92559946 92424631 92284071 92144620 92004830 91864318 91724765
2229.3 91724765 91583157 91432410 91267461 91090232 90917736 90772903 90667510 90600723 90570194 90570247 90582740
2251.8 90582740 90584040 90551090 90468490 90338856 90184861 90039730 89921457 89822203 89725018 89613271 89478898
2274.2 89478898 89331573 89181793 89029044 88871485 88707119 88530010 88339680 88138127 87918687 87686557
2294.6 87686557 87467092 87287647 87161559 87077993 87020391 86988264 86980098 86974806 86943704 86871684 86764270
2317 86764270 86630726 86473483 86293006 86100078 85912788 85736763 85565621 85399914 85260415 85164452
2337.4 85164452 85094464 85014004 84895074 84722364 84538347 84394920 84282410 84158814 84001106 83816576
2357.8 83816576 83611935 83387882 83142078 82870692 82575220 82258445 81926662 81600153 81291652 81000292
2378.2 81000292 80724299 80457115 80191803 79928750 79669929 79411459 79152018 78898430 78656793 78424770
2398.6 78424770 78194445 77962530 77726871 77477878 77208257 76926440 76646340 76376152 76121247 75883192
2419 75883192 75660002 75450462 75250220 75052118 74849099 74632478 74397928 74142492 73863584 73563129
2439.4 73563129 73245656 72920114 72592670 72256052 71897352 71505427 71072024 70604116 70128566 69672233
2459.8 69672233 69242102 68837500 68457907 68099976 67764330 67451960 67162651 66891563 66616786 66309190
2480.2 66309190 65955716 65563506 65155196 64753848 64369440 64007801 63675094 63373166 63094670 62817854
2500.6 62817854 62515646 62170261 61770427 61315876 60821986 60300082 59750021 59174955 58580059 57967234
2521 57967234 57342851 56711346 56076318 55449581 54840434 54247504 53666890 53098494 52549183 52029973
2541.4 52029973 51551545 51131904 50800806 50594240 50543267 50664562 50959027 51412219 51997244 52681947
2561.8 52681947 53438747 54254586 55120689 56015038 56904739 57755643 58536458 59218240 59767842 60144997
2582.2 60144997 60321152 60296202 60096759 59770393 59378737 58988804 58670282 58490527 58493584 58680570
2602.6 58680570 59005368 59393269 59768140 60068756 60256284 60315508 60252607 60087407 59845901 59560168
2623 59560168 59262723 58973032 58697253 58433604 58173627 57906419 57622987 57319123 56996822 56667441
2643.4 56667441 56352746 56069678 55814886 55572516 55327046 55071467 54809475 54545152 54282868 54033476
2663.7 54033476 53815544 53658342 53592843 53642327 53827530 54167068 54666132 55309695 56072623 56929529
2684.1 56929529 57847285 58781296 59691656 60555106 61360508 62103361 62777591 63366139 63845664 64189380
2704.5 64189380 64367855 64364845 64191020 63883406 63498420 63100958 62750137 62491560 62356472 62360400
2724.9 62360400 62496853 62745476 63087201 63493043 63916510 64305276 64605772 64767945 64763135 64588422
2745.3 64588422 64263022 63821143 63298422 62729156 62144923 61576658 61057675 60608810 60223329 59882754
2765.7 59882754 59565562 59242260 58882421 58463007 57978600 57440782 56873363 56306303 55764699 55260652
2786.1 55260652 54795480 54367852 53973967 53604972 53255755 52927321 52616942 52323091 52041638 51759201
2806.5 51759201 51467913 51172888 50882095 50603765 50348610 50124085 49936703 49798638 49717072 49688688
2826.9 49688688 49707815 49762425 49837345 49925074 50031894 50177908 50369865 50588137 50814492 51046842
2847.3 51046842 51291424 51551944 51827061 52116883 52411652 52686352 52910131 53056848 53120780 53113729
2867.7 53113729 53051031 52950293 52833551 52716845 52605581 52504647 52421558 52362406 52330315 52323598 52343833
2890.1 52343833 52403092 52512842 52670157 52858812 53069514 53301024 53538841 53755212 53916639 53996325
2910.5 53996325 53982407 53870636 53672862 53414416 53113741 52778721 52419150 52078551 51836997 51747411
2930.9 51747411 51785290 51876086 51958644 52017516 52065837 52114159 52155864 52174556 52165979 52141118 52102506 52046841
2955.4 52046841 51979232 51901203 51813358 51714367 51595396 51452595 51290846 51121324 50951511 50790262
2975.8 50790262 50660813 50583780 50557572 50559276 50560337 50544417 50512576 50469911 50418842 50368553 50338626 50352144
3000.3 50352144 50423193 50554413 50734919 50932473 51111037 51243234 51307571 51296610 51219648 51090801
3020.7 51090801 50919944 50721818 50523770 50362414 50279069 50304550 50455326 50722921 51055825 51388860
3041.1 51388860 51654714 51801372 51876187 52055943 52507126 53193158 53922486 54559636 55075675 55474848
3061.5 55474848 55759418 55906314 55873054 55633092 55212432 54760259 54535353 54707426 55180579 55679655
3081.9 55679655 55991381 56101155 56154674 56321007 56658226 57081717 57449681 57655418 57649839 57449377
3102.2 57449377 57158202 56926626 56870896 57035756 57404268 57911235 58469319 59017813 59532970 60020828
3122.6 60020828 60510331 61020869 61537927 62038660 62525886 63018227 63524759 64033705 64524323 64985961
3143 64985961 65412575 65790522 66107357 66354579 66518068 66597897 66615975 66581243 66481155 66298223 66016448
3165.5 66016448 65620041 65090293 64408046 63568050 62608862 61634535 60809147 60284716 60095888 60136682
3185.9 60136682 60246313 60310060 60292071 60234207 60232276 60376489 60690957 61117977 61545300 61868495 62045789
3208.3 62045789 62092417 62064058 62023789 61987203 61920530 61776811 61520374 61137766 60631633 60018456 59323710
3230.7 59323710 58557123 57710916 56785429 55788583 54717094 53559238 52303201 50940514 49474916
3249.1 49474916 47939080 46382764 44848886 43380302 42014599 40769953 39631158 38549066
3265.4 38549066 37474194 36378154 35258421 34150812 33103073 32116866 31134519 30069426 28845820
3283.8 28845820 27441770 25905675 24324319 22773388 21291012 19879176 18543884 17345412
3300.1 17345412 16387558 15770766 15563723 15814516 16554347 17783131 19472817 21579002 24045831
3318.4 24045831 26789019 29700619 32685813 35668811 38578209 41374263 44055992 46625715
3334.8 46625715 49077860 51406807 53595138 55611062 57433534 59050918 60459000 61683053
3351.1 61683053 62755144 63679671 64455450 65100157 65641600 66090268 66444653 66722971 66955107 67155761
3371.5 67155761 67315739 67424685 67489588 67520082 67525387 67509741 67458510 67369497 67259705 67147017 67042398
3393.9 67042398 66934061 66812795 66699165 66618389 66560280 66503859 66452378 66416895 66401649 66406614 66429943
3416.3 66429943 66466254 66508150 66554135 66614294 66697270 66805547 66936797 67094219 67284161 67497730 67728555
3438.8 67728555 67989069 68281937 68595606 68926620 69258493 69580179 69906515 70247048 70598596 70954031
3459.2 70954031 71305704 71659398 72025484 72385746 72714186 73022562 73344386 73686075 74036086 74381572
3479.6 74381572 74711734 75032389 75353789 75667548 75966209 76270294 76593941 76921386 77235204 77550364
3500 77550364 77874970 78171712 78437167 78719431 79025805 79335529 79639113 79927641 80211514 80508184
3520.4 80508184 80813456 81094277 81337118 81558686 81748527 81911337 82113498 82387727 82707530 83086491
3540.8 83086491 83536732 83999753 84397250 84725302 85034752 85336858 85628885 85933846 86260396 86589950
3561.1 86589950 86918271 87269068 87627184 87924778 88184935 88471669 88790202 89129448 89482260 89835382
3581.5 89835382 90197617 90586686 90962750 91279507 91588771 91934907 92292923 92643201 92984349 93307817
3601.9 93307817 93630528 93980443 94342905 94676590 94987100 95286191 95579416 95882267 96139902 96326631
3622.3 96326631 96529132 96812904 97136050 97350037 97476912 97618079 97771877 97928345 98087275 98252267
3642.7 98252267 98457778 98727083 98972636 99045438 99035043 99083269 99174911 99244535 99288696 99328035 99393427
3665.2 99393427 99505836 99617720 99660569 99683291 99663430 99528104 99392241 99331158 99365693 99520558 99761194
3687.6 99761194 99923843 99914438 99870580 99867058 99881738 99897081 99880546 99827152 99815249 99882382 99968261 99971020
3712.1 99971020 99907768 99869758 99867576 99879956 99894476 99896640 99867731 99839073 99867654 99946958 100000000 99974895
3736.5 99974895 99883264 99848396 99896079 99916053 99883568 99901760 99908894 99831104 99774694 99783146 99795467 99783039
3761 99783039 99795485 99837869 99874777 99897617 99883819 99844688 99840742 99890548 99933100 99921894 99894655 99865586
3785.5 99865586 99839932 99845505 99878734 99923652 99965996 100004435 100050235 100047588 100000238 99977797 99938059 99886411
3810 99886411 99894118 99957538 100008297 100040162 100070345 100021231 99938220 99903405 99900514 99919945 99955970 100000000
3834.4 100000000 100041616 100025296 99980086 99941880 99892581 99861884 99906087 100025666 100094962 99994528 99891925
3856.9 99891925 99870735 99902147 99951470 99979198 100000274 100019991 99998277 99946505 99898803 99896920 99940115 99972618
3881.4 99972618 100002468 100023246 100004506 99995333 99994409 99975801 99986845 100043774 100096345 100101078 100055420 99981093
3905.8 99981093 99924046 99903643 99915111 99956095 99997908 100007820 100003278 100006485 100002480 99984813 99980444 99999130 100008655
3932.3 100008655 99987155 99956095 99950260 99975902 99997491 100000000 100016093 100057089 100088882 100091517 100083923 100087237
3956.8 100087237 100106466 100131953 100147414 100153971 100169146 100196695 100225830 100247991 100261092 100271165 100285852 100300014
3981.3 100300014 100301957 100295091 100292826 100296235 100298774 100295711 100285387 100272667
3997.6 100272667
##END=$$ End of the data block
