##TITLE=Ac. p-acetamidobenzoico - Mirela e Fran $$ Begin of the data block
##JCAMP-DX=5.00 $$ ACD/SpecManager v 10.08
##SPECTROMETER/DATA SYSTEM=Alpha
##DATE=07 Apr 2015 09:02:46
##DATA TYPE=INFRARED SPECTRUM
##DATA CLASS=XYDATA
##ORIGIN=
##OWNER=
##NPOINTS=1765
##FIRSTX=399.76428223
##LASTX=3997.64306641
##MAXX=3997.64306641
##MINX=399.76428223
##MAXY=1.00145197
##MINY=0.13721232
##XFACTOR=1.0000000000
##YFACTOR=0.000000010000000
##FIRSTY=1.00000000
##DELTAX=2.03961372
##XUNITS=1/CM
##YUNITS=ARBITRARY UNITS
##XYDATA=(X++(Y..Y))
$$ plain form
399.8 100000000 99602354 99825877 100000000 99903232 99108160 98739040 99201202 99708128 99221963 97875935
420.2 97875935 97253770 97300035 96442062 93462878 89625221 88570881 91530222 95337361 97104782
438.5 97104782 97340184 97607833 98298120 98702645 98328876 97699255 97694117 98346370 98811728 98489356
458.9 98489356 97968745 98126167 98887104 99365324 99055469 98509884 98542660 99081093 99307352 98794019
479.3 98794019 98075193 97921455 98234940 98141503 97206455 95918167 94784147 93304354 90370369
497.7 90370369 85615784 80946010 80381066 84715801 90104848 93504620 95044541 95895749 96591830
516 96591830 96819109 96335125 95679450 95503175 95730704 95638680 94839585 93707061 92730987 91714281
536.4 91714281 89827842 86481106 82013911 77643120 75052941 75505674 78676629 82917136 86802262
$$ packed form
399.8A00000000l97646K23523J74123r6768p95072l69120M62162N06926m86165j346028
420.2I7875935o22165M6265q57973k979184l837657j054340K959341L807139J767421
438.5I7104782K35402K67649O90287M04525l73769o29621n138O52253M65358l22372
458.9I8489356n20611J57422P60937M78220l09855n45585L2776N38433K26259n13333
479.3I8794019p18826j53738L13485r3437r35048j288288j134020j479793k933985
497.7I0370369m754585m669774n64944M334735N389047L399772J539921Q51208O96081
516I6591830K27279m83984o55675j76275K27529r2024p99095j132524r76074j016706
536.4I1714281j886439l346736m467195m370791k590179M52733L170955M240507L885126
$$ plain form
554.8 86802262 89753592 91531175 92119366 91995716 91850126 91865665 91554397 90431374 88850886
573.1 88850886 87997746 88542193 89590406 89987195 89736688 89487076 89492178 89420670 88879907 87954092
593.5 87954092 87073606 86356002 85394639 83727270 81335074 78780878 77255225 77841866 79884672
611.9 79884672 81604910 82427317 82820731 83059222 83146131 83098388 83138204 83406889 83682013 83935910
632.3 83935910 84567720 85665333 86911905 88006145 88671571 88967687 89321703 89983052 90736467
650.6 90736467 91142172 91042387 90802091 90849477 91061282 90941459 90362531 89442271 88425744 87766290
671 87766290 86835223 84718120 81508541 79411322 80537754 83349472 84934878 84895390 84318221
689.4 84318221 83651489 82444406 80007142 76509064 73460168 72417051 73385030 75225675 77128285
$$ packed form
554.8H6802262K951330J777583N88191j23650j45590J5539l11268j123023j580488
573.1H8850886q53140N44447J048213L96789k50507k49612N102p1508n40763r25815
593.5H7954092q80486p17604r61363j667369k392196k554196j525653N86641K042806
611.9G9884672J720238Q22407L93414K38491Q6909m7743L9816K68685K75124K53897
632.3H3935910O31810J097613J246572J094240O65426K96116L54016O61349P53415
650.6I0736467M05705r9785k40296M7386K11805j19823n78928r20260j016527o59454
671H7766290r31067k117103l209579k097219J126432K811718J585406l9488n77169
689.4H4318221o66732j207083k437264l498078l048896j043117R67979J840645J902610
$$ plain form
707.7 77128285 79054904 81089187 82956666 84305501 85184240 86025351 87084514 88129073 88797128
726.1 88797128 89101565 89447421 90119332 90886235 91311991 91364574 91454935 91886431 92444277 92677712
746.5 92677712 92496860 92299998 92420179 92624748 92316324 91232449 89454406 85968703 78553683
764.9 78553683 69175512 65950930 71988565 80872130 87188977 90529788 91864544 92333901 92849141
783.2 92849141 93543047 93935865 93627936 92705935 91519415 90396154 89892733 90619916 92393911
801.6 92393911 94340515 95743495 96169204 95411426 94014138 93287164 93948323 95144719 95721459
819.9 95721459 95587176 95315915 95135701 94631660 93336499 91475749 90081072 90158176 91578358
838.3 91578358 93084258 93652594 93251741 92270911 90775388 88405639 85408539 83745015 85131681
$$ packed form
707.7G7128285J926619K034283J867479J348835Q78739Q41111J059163J044559O68055
726.1H8797128L04437L45856O71911P66903M25756N2583R0361M31496N57846K33435
746.5I2677712j80852j96862J20181K04569l08424j083875j778043l485703p415020
764.9G8553683r378171l224582O037635Q883565O316847L340811J334756M69357N15240
783.2I2849141O93906L92818l07929r22001j186520j123261n03421P27183J773995
801.6I2393911J946604J402980M25709p57778j397288p26974O61159J196396N76740
819.9I5721459j34283k71261j80214n04041j295161j860750j394677P7104J420182
838.3I1578358J505900N68336m00853r80830j495523k369749k997100j663524J386666
$$ plain form
856.6 85131681 87935936 89040703 87438375 83990663 80804116 81248248 86363399 92584974 96563256
875 96563256 98506802 99574888 100012684 99873161 99608248 99666142 99953717 100000000 99626434 99176013
895.4 99176013 99074572 99239951 99186647 98678458 98022151 97629416 97444409 97002345 96043146 94844395
915.8 94844395 93814862 92920458 91744208 90061593 88149565 86448419 85085684 83887535 82760221
934.1 82760221 81879324 81521416 81759816 82348621 83006495 83751732 84828705 86245179 87481928
952.5 87481928 87970835 87995112 88468164 89503372 90205491 90167940 90127927 90872216 92359912 93930888
972.9 93930888 94784427 94547111 93403780 91610920 90055168 90330112 92342055 94260538 95265001
991.3 95265001 95604676 95333153 94510365 93519247 92682707 91860861 90642565 88874507 86862928
$$ packed form
856.6H5131681K804255J104767j602328l447712l186547M44132N115151O221575L978282
875I6563256J943546J068086M37796j39523k64913N7894K87575M6283l73566m50421
895.4I9176013j01441J65379n3304n08189o56307l92735j85007m42064r59199j198751
915.8I4844395j029533q94404j176250j682615j912028j701146j362735j198149j127314
934.1H2760221q80897l57908K38400N88805O57874P45237J076973J416474J236749
952.5H7481928M88907K4277M73052J035208P02119l7551m0013P44289J487696J570976
972.9I3930888Q53539k37316j143331j792860j555752K74944K011943J918483J004463
991.3I5265001L39675k71523q22788r91118q36540q21846j218296j768058k011579
$$ plain form
1009.6 86862928 85061532 83709866 82754439 82158965 82391930 84028029 86587518 88706744 89604944
1028 89604944 89582950 89249754 88784689 87949860 86631465 85215539 84348923 84346509 84888494 85386419
1048.4 85386419 85596985 85666770 85671926 85406303 84682614 83635181 82593518 81720936 80850232 79731995
1068.8 79731995 78387862 77051985 75812042 74510014 72992611 71360534 69885010 68716717
1085.1 68716717 67765909 66861439 65966451 65182424 64560032 63973606 63250077 62361425 61419505 60497797
1105.5 60497797 59612250 58905804 58637249 58892012 59444290 59985882 60411501 60822570 61167145 61002988
1125.9 61002988 60113657 59481418 60345697 62270671 63942230 64925700 65411687 65577894 65649247 65899152
1146.3 65899152 66449344 67189276 67945129 68690234 69524175 70463175 71320611 71839803 71925342 71631384
$$ packed form
1009.6H6862928j801396j351666r55427n95474K32965J636099K559489K119226Q98200
1028H9604944k1994l33196m65065q34829j318395j415926q66616k414N41985M97925
1048.4H5386419K10566O9785N156k65623p23689j047433j041663q72582q70704j118237
1068.8G9731995j344133j335877j239943j302028j517403j632077j475524j168293
1085.1F8716717r50808r04470q94988p84027o22392n86426p23529q88652r41920r21708
1105.5F0497797q85547p06446k68555K54763N52278N41592M25619M11069L44575j64157
1125.9F1002988q89331o32239Q64279J924974J671559R83470M85987J66207P1353K49905
1146.3F5899152N50192P39932P55853P45105Q33941R39000Q57436N19192Q5539k93958
$$ plain form
1166.7 71631384 70866835 69263148 66643280 63548106 60952306 59797466 60738623 63857847 68715304
1185 68715304 74157345 78549492 81129891 82272536 82584578 82567209 82594162 82745922 82835937 82715499
1205.4 82715499 82482713 82364845 82415247 82427198 82244480 82010692 81964999 82107109 82197207 82069564
1225.8 82069564 81835854 81708020 81708771 81642944 81341165 80833453 80238909 79540294 78555739 77150977
1246.2 77150977 75371671 73306394 70848435 67673278 63495684 58350271 52787215 48092511
1262.5 48092511 46129450 48382923 54510194 62016892 68041116 71296060 72015589 70828837 68275201
1280.9 68275201 64731735 60376239 55340123 50008720 45098019 41344911 39137486 38489380 39461723
1299.2 39461723 42222288 46167594 49298927 49460405 46260297 41371611 37761688 38130450 42239922
$$ packed form
1166.7G1631384p64549j603687k619868l095174k595800j154840R41157L119224M857457
1185F8715304N442041M392147K580399J142645L12042j7369K6953J51760R0015j20438
1205.4H2715499k32786j17868N0402J1951j82718k33788m5693J42110R0098j27643
1225.8H2069564k33710j27834P51o5827l01779n07712n94544o98615r84555j404762
1246.2G7150977j779306k065277k457959l175157m177594n145413n563056m694704
1262.5D8092511j963061K253473O127271P506698O024224L254944P19529j186752k553636
1280.9F8275201l543466m355496n036116n331403m910701l753108k207425o48106R72343
1299.2C9461723K760565L945306L131333J61478l200108m888686l609923L68762M109472
$$ plain form
1317.6 42239922 47220758 51416242 55709285 60894227 66316289 70870304 74049819 76149863
1333.9 76149863 77857614 79710698 81745619 83553869 84908897 85846883 86315072 86157757 85310948
1352.3 85310948 83880323 81912899 79237777 75532383 71008003 67308372 65794057 66040385 66996992
1370.6 66996992 68095672 69341749 70697170 71957940 72816336 73064435 72852349 72278035 71298814
1389 71298814 70057166 68536854 66575354 64277565 61701429 59133613 57072783 55987900 56489331
1407.3 56489331 58448184 60914552 62629116 62866634 61325294 57969910 54264742 51197898 49281943
1425.7 49281943 49493477 52336270 57138538 62484103 68148339 73328519 76804316 79371703 81502146
1444.1 81502146 83141333 84422445 85466588 86430562 87344849 88144124 88537288 88613617 88708591 88737577
$$ packed form
1317.6D2239922M980836M195484M293043N184942N422062M554015L179515K100044
1333.9G6149863J707751J853084K034921J808250J355028R37986M68189j57315q46809
1352.3H5310948j430625j967424k675122l705394m524380l699631j514315K46328R56607
1370.6F6996992J098680J246077J355421J260770Q58396K48099k12086n74314r79221
1389G1298814j241648j520312j961500k297789k576136k567816k060830j084883N01431
1407.3E6489331J958853K466368J714564K37518j541340l355384l705168l066844j915955
1425.7D9281943K11534K842793M802268N345565N664236N180180L475797K567387K130443
1444.1H1502146J639187J281112J044143R63974R14287P99275L93164P6329R4974K8986
$$ plain form
1464.5 88737577 88504696 88185102 87984639 87783962 87333238 86551362 85611260 84736735 84137648 83819407
1484.9 83819407 83468741 82641983 81229591 79672843 77794671 75027061 71724784 68700677 66032392
1503.2 66032392 62567532 56732029 51293206 47547516 44416139 41063026 37045971 33458662
1519.5 33458662 31129941 30599973 31836563 34395060 37647846 41638798 46782747 51628596 56016558
1537.9 56016558 61730349 67366612 71414560 74834794 77872461 80622625 82927394 84803927
1554.2 84803927 86410254 87920964 88808256 88964063 89066041 89335340 89680785 89830089 89617825
1572.6 89617825 89024836 87668157 85623229 82956177 79106092 73700935 66606241 58844233 53169817
1590.9 53169817 51984406 54642618 58368939 61047781 61825973 60140944 56132436 52142441 52461171
$$ packed form
1464.5H8737577k32881l19594k00463k00677m50724p81876r40102q74525n99087l18241
1484.9H3819407l50666q26758j412392j556748j878172k767610l302277l024107k668285
1503.2F6032392l464860n835503n438823l745690l131377l353113m017055l587309
1519.5C3458662k328721n29968J236590K558497L252786L990952N143949M845849M387962
1537.9E6016558N713791N636263M047948L420234L037667K750164K304769J876533
1554.2H4803927J606327J510710Q87292J55807J01978K69299L45445J49304k12264
1572.6H9617825n92989j356679k044928k667052l850085n405157p094694p762008n674416
1590.9E3169817j185411K658212L726321K678842P78192j685029m008508l989995L18730
$$ plain form
1609.3 52461171 58712411 67020887 73772907 77673906 78790122 78449649 77146953 75222582 73048860
1627.6 73048860 70903814 69194096 67678374 65642273 63571340 62013763 60648710 59238082
1643.9 59238082 57323176 54961443 53017628 50345725 45526519 41177678 37166354 32569036
1660.3 32569036 27360553 22423011 18707231 15790772 13896717 13721232 15087289 17340207 19568989
1678.6 19568989 21620293 23969084 27076533 29974005 32528275 35219246 37658441 40029097
1694.9 40029097 42519042 45630288 50382036 55199248 59847826 64422792 67941689 70694679
1711.3 70694679 73191082 75728106 78393859 80608088 82258666 83883160 85549593 87023878
1727.6 87023878 88231772 89197600 90138227 90943944 91497099 91968644 92425525 92962044 93625540 94276810
$$ packed form
1609.3E2461171O251240Q308476O752020L900999J116216l40473j302696j924371k173722
1627.6G3048860k145046j709718j515722k036101k070933j557577j365053j410628
1643.9E9238082j914906k361733j943815k671903m819206m348841m011324m597318
1660.3C2569036n208483m937542l715780k916459j894055j75485J366057K252918K228782
1678.6A9568989K051304K348791L107449K897472K554270K690971K439195K370656
1694.9D0029097K489945L111246M751748M817212M648578M574966L518897K752990
1711.3G0694679K496403K537024K665753K214229J650578J624494J666433J474285
1727.6H7023878J207894R65828R40627Q05717N53155M71545M56881N36519O63496O51270
$$ plain form
1748 94276810 94713962 94884413 95015883 95275271 95551705 95685571 95653135 95624220 95775336 96054399
1768.4 96054399 96263856 96277732 96225971 96302444 96460342 96507853 96388650 96250099 96245950 96384275 96526003
1790.8 96526003 96508700 96440375 96533364 96741658 96853042 96765226 96650511 96703744 96924829 97126633 97190869
1813.2 97190869 97243512 97443545 97768998 98055226 98190755 98201001 98242950 98378581 98463458 98417211 98328984
1835.7 98328984 98321366 98453051 98645860 98717618 98613125 98546416 98637784 98787898 98842931 98782957 98743832
1858.1 98743832 98827320 98961586 99015683 98970854 98907173 98902208 98946941 98939306 98819149 98682940 98661125
1880.5 98661125 98724580 98721141 98594147 98445433 98402077 98480386 98555952 98517567 98447210 98498255 98667830
1903 98667830 98799169 98769760 98634040 98559463 98623013 98733717 98763084 98724192 98783380 98996001 99210125
$$ packed form
1748I4276810M37152J70451J31470K59388K76434J33866l2436k8915J51116K79063
1768.4I6054399K09457J3876n1761P6473J57898M7511j19203j38551m149J38325J41728
1790.8I6526003j7303o8325R2989K08294J11384q7816j14715N3233K21085K01804O4236
1813.2I7190869N2643K00033L25453K86228J35529J0246M1949J35631Q4877m6247q8227
1835.7I8328984p618J31685J92809P1758j04493o6709R1368J50114N5033n9974l9125
1858.1I8743832Q3488J34266N4097m4829o3681m965M4733p635j20157j36209k1815
1880.5I8661125O3455l439j26994j48714m3356P8309P5566l8385p0357N1045J69575
1903I8667830J31339k9409j35720p4577O3550J10704K9367l8892N9188K12621K14124
$$ plain form
1925.4 99210125 99278432 99220073 99172539 99222672 99299878 99291915 99222726 99227357 99367189 99542218 99602300 99509019
1949.9 99509019 99382615 99342304 99348944 99286580 99159735 99111360 99247605 99496835 99661690 99646443 99566120
1972.3 99566120 99583709 99712825 99807757 99763012 99659640 99657893 99788928 99913740 99899316 99782413 99732322
1994.8 99732322 99826431 99946463 99945015 99843943 99801612 99891007 100000000 99994439 99874681 99796444 99850714
2017.2 99850714 99941915 99917263 99761355 99630094 99673390 99812448 99841130 99707431 99556482 99536723 99620575
2039.6 99620575 99645782 99530369 99380106 99339813 99399590 99407476 99271357 99081177 98990226 99015361 99024004
2062.1 99024004 98906755 98713106 98592079 98590088 98589051 98470294 98279482 98174888 98231083 98347145 98379529
2084.5 98379529 98332793 98347038 98496294 98674536 98724008 98627520 98528123 98543620 98616701 98606569 98487896
$$ packed form
1925.4I9210125O8307n8359m7534N0133P7206p963o9189M631J39832J75029O0082r3281
1949.9I9509019j26404m0311O640o2364j26845m8375J36245K49230J64855j5247q0323
1972.3I9566120J7589J29116R4932m4745j03372j747J31035J24812j4424j16903n0091
1994.8I9732322R4109J20032j448j01072m2331Q9395J08993n561j19758p8237N4270
2017.2I9850714R1201k4652j55908j31261M3296J39058K8682j33699j50949j9759Q3852
2039.6I9620575K5207j15413j50263m0293N9777P886j36119j90180r0951K5135Q643
2062.1I9024004j17249j93649j21027j991j037j18757j90812j04594N6195J16062L2384
2084.5I8379529m6736J4245J49256J78242M9472r6488r9397J5497P3081j0132j18673
$$ plain form
2106.9 98487896 98388320 98424226 98552066 98621857 98571646 98505974 98552686 98688602 98769087 98712587 98605371
2129.4 98605371 98590660 98678416 98735136 98663819 98533261 98484403 98547441 98602432 98535210 98389482 98306513
2151.8 98306513 98333645 98362958 98276758 98100734 97974503 97979099 98037177 98016286 97913176 97855240 97919399
2174.3 97919399 98030794 98057771 97975814 97899282 97934109 98031789 98052621 97950220 97830874 97815776 97884941
2196.7 97884941 97907954 97814798 97687531 97651893 97712243 97748727 97674948 97550839 97502595 97547442 97568053
2219.1 97568053 97471875 97313994 97228658 97255808 97288442 97213852 97059929 96954578 96958375 96988386 96930850
2241.6 96930850 96798515 96717441 96761429 96858221 96882129 96810687 96742487 96756434 96806628 96784282 96664220
2264 96664220 96549821 96540463 96599412 96604472 96504742 96382612 96341944 96372831 96369940 96271068 96136487 96072197
$$ packed form
2106.9I8487896r9576L5906J27840O9791n0211o5672M6712J35916Q0485n6500j07216
2129.4I8605371j4711Q7756N6720p1317j30558m8858O3038N4991o7222j45728q2969
2151.8I8306513K7132K9313q6200j76024j26231M596N8078k0891j03110n7936O4159
2174.3I7919399J11395K6977q1957p6532L4827R7680K0832j02401j19346j5098O9165
2196.7I7884941K3013r3156j27267l5638O0350L6484p3779j24109m8244M4847K0611
2219.1I7568053r6178j57881q5336K7150L2634p4590j53923j05351L797L0011n7536
2241.6I6930850j32335q1074M3988R6792K3908p1442o8200J3947N0194k2346j20062
2264I6664220j14399r358N8949N060r9730j22130m0668L0887k891r8872j34581o4290
$$ plain form
2288.5 96072197 96088213 96081781 95978272 95833075 95765001 95806879 95863885 95839864 95761460 95737100 95809525
2310.9 95809525 95895636 95892715 95807147 95734018 95733285 95754254 95702428 95567536 95444703 95421076 95455557 95439821
2335.4 95439821 95351535 95272976 95277119 95310611 95251155 95125234 95050728 95072460 95155513 95196903 95130455 95006782
2359.9 95006782 94917542 94868684 94771761 94572663 94337147 94166267 94070578 93969244 93806517 93622148
2380.2 93622148 93496013 93444061 93392307 93270773 93101639 92968369 92910290 92875493 92789751 92653352 92536628
2402.7 92536628 92481554 92443538 92345643 92179346 92018014 91925013 91878891 91806895 91679931 91550595 91483951
2425.1 91483951 91464818 91411334 91284442 91137737 91037029 90974426 90884799 90732569 90557265 90421271
2445.5 90421271 90327495 90209752 90013748 89769298 89551616 89384300 89223486 89026123 88809764 88630265
$$ packed form
2288.5I6072197J6016o432j03509j45197o8074M1878N7006k4021p8404k4360P2425
2310.9I5809525Q6111k921q5568p3129p33K0969n1826j34892j22833k3627L4481j5736
2335.4I5439821q8286p8559M143L3492n9456j25921p4506K1732Q3053M1390o6448j23673
2359.9I5006782q9240m8858r6923j99098k35516j70880r5689j01334j62727j84369
2380.2I3622148j26135n1952n1754j21534j69134j33270n8079l4797q5742j36399j16724
2402.7I2536628n5074l8016r7895j66297j61332r3001m6122p1996j26964j29336o6644
2425.1I1483951j9133n3484j26892j46705j00708o2603q9627j52230j75304j35994
2445.5I0421271r3776j17743j96004k44450k17682j67316j60814j97363k16359j79499
$$ plain form
2465.9 88630265 88505387 88389677 88233840 88051361 87898886 87797713 87700367 87545031 87329304 87113804
2486.3 87113804 86946189 86803800 86636537 86439902 86262405 86141205 86049318 85922194 85730851 85508931
2506.7 85508931 85299319 85095650 84852821 84549665 84221464 83917272 83636189 83331853 82979327 82608074
2527.1 82608074 82264668 81955969 81643093 81294280 80926025 80586308 80298012 80034047 79767859 79528058
2547.5 79528058 79378277 79351079 79425222 79565525 79767579 80056155 80438459 80877262 81324089 81764954
2567.9 81764954 82223558 82715756 83209836 83649200 84005010 84288925 84515095 84663165 84690964 84589249
2588.3 84589249 84410119 84221292 84053332 83908737 83799887 83769345 83858991 84051067 84269047 84445977
2608.7 84445977 84571290 84664863 84725469 84721613 84630919 84479827 84328693 84208232 84093338 83949786 83783817
$$ packed form
2465.9H8630265j24878j15710j55837j82479j52475j01173r7346j55336k15727k15500
2486.3H7113804j67615j42389j67263j96635j77497j21200r1887j27124j91343k21920
2506.7H5508931k09612k03669k42829l03156l28201l04192k81083l04336l52526l71253
2527.1H2608074l43406l08699l12876l48813l68255l39717k88296k63965k66188k39801
2547.5G9528058j49781k7198P4143J40303K02054K88576L82304M38803M46827M40865
2567.9H1764954M58604M92198M94080M39364L55810K83915K26170J48070K7799j01715
2588.3H4589249j79130j88827j67960j44595j08850l0542Q9646J92076K17980J76930
2608.7H4445977J25313R3573O0606l856r0694j51092j51134j20461j14894j43552j65969
$$ plain form
2631.1 83783817 83631653 83506179 83377492 83211291 83010417 82813835 82653660 82519925 82379693 82221180
2651.5 82221180 82065678 81933987 81811708 81665772 81490439 81318283 81186640 81106675 81068832 81073779
2671.9 81073779 81148612 81325984 81607169 81956983 82341719 82761043 83228356 83729064 84218794 84660411
2692.3 84660411 85059643 85446560 85821420 86145127 86381233 86530048 86614704 86642033 86591184 86448514
2712.7 86448514 86243880 86040330 85884035 85777074 85705388 85676610 85718513 85842776 86023587 86220145
2733.1 86220145 86410648 86592448 86754304 86857027 86857790 86750287 86567700 86350197 86109000 85830325
2753.5 85830325 85517704 85207951 84940439 84722191 84523827 84318012 84110487 83918256 83732378 83514118
2773.9 83514118 83234799 82911861 82588792 82285070 81988055 81685841 81388611 81119448 80889988 80684829
$$ packed form
2631.1H3783817j52164j25474j28687j66201k00874j96582j60175j33735j40232j58513
2651.5H2221180j55502j31691j22279j45936j75333j72156j31643p9965l7843M947
2671.9H1073779P4833J77372K81185L49814L84736M19324M67313N00708M89730M41617
2692.3H4660411L99232L86917L74860L23707K36106J48815Q4656K7329n0849j42670
2712.7H6448514k04634k03550j56295j06961p1686k8778M1903J24263J80811J96558
2733.1H6220145J90503J81800J61856J02723P63j07503j82587k17503k41197k78675
2753.5H5830325l12621l09753k67512k18248j98364k05815k07525j92231j85878k18260
2773.9H3514118k79319l22938l23069l03722k97015l02214k97230k69163k29460k05159
$$ plain form
2794.3 80684829 80477107 80265898 80075252 79914153 79759544 79582602 79382074 79182911 79005784 78844130
2814.7 78844130 78676921 78504783 78357673 78259188 78200883 78156668 78115082 78089935 78093940 78119749 78150517
2837.1 78150517 78175044 78203970 78259385 78336394 78408045 78461277 78512579 78597009 78726906 78872734 78998530
2859.5 78998530 79089236 79147488 79175234 79160571 79094946 78995872 78895843 78812546 78738469 78657848 78571796
2882 78571796 78500766 78456891 78427410 78391725 78352273 78338325 78363752 78412044 78468108 78524971 78578740 78629577
2906.5 78629577 78663236 78645462 78548408 78374571 78157890 77930707 77698153 77456117 77215266 77011389
2926.8 77011389 76886624 76843649 76844579 76859832 76885849 76924151 76964414 76984483 76968569 76924908 76874065 76814562
2951.3 76814562 76719242 76587778 76461369 76367146 76294982 76213497 76104432 75986129 75880855 75784433 75670391
$$ packed form
2794.3H0684829k07722k11209j90646j61099j54609j76942k00528j99163j77127j61654
2814.7G8844130j67209j72138j47110r8485n8305m4215m1586k5147M005K5809L0768
2837.1G8150517K4527K8926N5415P7009P1651N3232N1302Q4430J29897J45828J25796
2859.5G8998530R0706N8252K7746j4663o5625r9074j00029q3297p4077q0621q6052
2882G8571796p1030m3875k9481l5685l9452j3948K5427M8292N6064N6863N3769N0837
2906.5G8629577L3659j7774r7054j73837k16681k27183k32554k42036k40851k03877
2926.8G7011389j24765m2975R30J5253K6017L8302M0263K0069j5914m3661n0843n9503
2951.3G6814562r5320j31464j26409r4223p2164q1485j09065j18303j05274r6422j14042
$$ plain form
2973.8 75670391 75526768 75390041 75298166 75237370 75176078 75102186 75021541 74947017 74872392 74778569 74666303
2996.2 74666303 74553400 74471062 74444073 74454290 74470925 74487579 74504447 74506700 74469721 74374980 74228549
3018.6 74228549 74062383 73894507 73713136 73507154 73292249 73105586 72981936 72935909 72948343 72983122
3039 72983122 73025584 73067206 73077834 73045987 73033202 73136938 73365974 73623389 73825645 73956209 74034739
3061.5 74034739 74080205 74077541 73986596 73786777 73504335 73222053 73052371 73050201 73155695 73259956 73297948
3083.9 73297948 73261279 73184562 73121446 73099208 73108506 73114860 73060447 72888565 72602975 72285098 72024810
3106.3 72024810 71854627 71761143 71746290 71819341 71943760 72065133 72153765 72211522 72272813 72371864 72500062
3128.8 72500062 72614360 72693974 72764879 72859299 72966498 73038560 73056906 73047870 73040497 73047608 73043174 72973502
$$ packed form
2973.8G5670391j43623j36727r1875o0796o1292p3892q0645p4524p4625r3823j12266
2996.2G4666303j12903q2338k6989J0217J6635J6654J6868K253l6979r4741j46431
3018.6G4228549j66166j67876j81371k05982k14905j86663j23650m6027J2434L4779
3039G2983122M2462M1622J0628l1847j2785J03736K29036K57415K02256J30564P8530
3061.5G4034739M5466k664r0945j99819k82442k82282j69682k170J05494J04261L7992
3083.9G3297948l6669p6717o3116k2238R298O354n4413j71882k85590l17877k60288
3106.3G2024810j70183r3484j4853P3051J24419J21373Q8632N7757O1291R9051J28198
3128.8G2500062J14298P9614P0905R4420J07199P2062J8346r036p373P111m434o9672
$$ plain form
3153.2 72973502 72831398 72666037 72499216 72302788 72051322 71747226 71406573 71032321 70604229 70102495
3173.6 70102495 69543278 68984276 68498218 68130064 67875421 67701709 67571127 67447215 67306030 67152715
3194 67152715 67020917 66952372 66966438 67037165 67104846 67122662 67083693 67004776 66905475 66793925 66663873
3216.5 66663873 66508484 66328001 66111386 65835512 65497071 65120453 64738005 64354527 63936460 63470864
3236.9 63470864 62984496 62493843 61987257 61438173 60819238 60126930 59397298 58671397 57959998 57259333
3257.3 57259333 56583202 55960226 55392885 54846036 54287702 53710502 53111237 52504259 51921773 51363742
3277.7 51363742 50794250 50167161 49439934 48594391 47650027 46655229 45653370 44661760 43685856 42737767
3298 42737767 41859424 41139740 40690947 40587798 40851906 41481826 42451289 43699214 45149070 46723390
$$ packed form
3153.2G2973502j42104j65361j66821j96428k51466l04096l40653l74252m28092n01734
3173.6G0102495n59217n59002m86058l68154k54643j73712j30582j23912j41185j53315
3194F7152715j31798o8545J4066P0727O7681J7816l8969p8917r9301j11550j30052
3216.5F6663873j55389j80483k16615k75874l38441l76618l82448l83478m18067m65596
3236.9F3470864m86368m90653n06586n49084o18935o92308p29632p25901p11399p00665
3257.3E7259333o76131o22976n67341n46849n58334n77200n99265o06978n82486n58031
3277.7E1363742n69492o27089p27227q45543r44364r94798j001859r91610r75904r48089
3298D2737767q78343p19684m48793j03149K64108O29920R69463J247925J449856J574320
$$ plain form
3318.4 46723390 48337936 49915901 51415503 52829796 54153156 55370098 56481409 57504016
3334.8 57504016 58447194 59316587 60108954 60808110 61411399 61923617 62346196 62690896 62969482 63179970
3355.2 63179970 63327897 63431519 63498056 63519329 63495344 63446778 63394314 63336301 63254154 63144666 63025022
3377.6 63025022 62905365 62782574 62647092 62495571 62342995 62200820 62065178 61928827 61786550 61647791
3398 61647791 61532569 61439949 61350942 61268592 61211187 61184901 61181790 61186469 61191374 61204559 61230350 61267662
3422.5 61267662 61325383 61411852 61526471 61659986 61818391 62005055 62191027 62367678 62567127 62806523
3442.9 62806523 63074535 63356495 63635284 63916993 64219850 64535677 64849716 65158439 65459621 65773362
3463.2 65773362 66123950 66481245 66792935 67065078 67354286 67680705 68022752 68348306 68636906 68919051
$$ packed form
3318.4D6723390J614546J577965J499602J414293J323360J216942J111311J022607
3334.8E7504016R43178Q69393P92367O99156O03289N12218M22579L44700K78586K10488
3355.2F3179970J47927J03622O6537K1273k3985m8566n2464n8013q2147j09488j19644
3377.6F3025022j19657j22791j35482j51521j52576j42175j35642j36351j42277j38759
3398F1647791j15222r2620q9007q2350n7405k6286l111M679M905J3185K5791L7312
3422.5F1267662N7721Q6469J14619J33515J58405J86664J85972J76651J99449K39396
3442.9F2806523K68012K81960K78789K81709L02857L15827L14039L08723L01182L13741
3463.2F5773362L50588L57295L11690K72143K89208L26419L42047L25554K88600K82145
$$ plain form
3483.6 68919051 69230044 69549888 69856983 70170295 70499438 70827967 71143371 71461254 71783644 72075194
3504 72075194 72342873 72632343 72948474 73277956 73607868 73921764 74229568 74545938 74867237 75165439
3524.4 75165439 75434238 75698304 75954437 76205903 76487947 76804590 77135515 77498239 77905262 78312743
3544.8 78312743 78661591 78971577 79294091 79618657 79931921 80264455 80630833 81002444 81363833 81729680
3565.2 81729680 82090533 82412225 82718217 83054107 83426374 83815944 84216535 84630525 85053366 85472733
3585.6 85472733 85853517 86194670 86554819 86955279 87368745 87785053 88195807 88578737 88948268 89330786
3606 89330786 89722800 90102547 90479749 90862799 91235822 91602272 91938329 92228776 92529094 92868841
3626.4 92868841 93208969 93473697 93693405 93927234 94162673 94397599 94648153 94922078 95230854 95565110
$$ packed form
3483.6F8919051L10993L19844L07095L13312L29143L28529L15404L17883L22390K91550
3504G2075194K67679K89470L16131L29482L29912L13896L07804L16370L21299K98202
3524.4G5165439K68799K64066K56133K51466K82044L16643L30925L62724M07023M07481
3544.8G8312743L48848L09986L22514L24566L13264L32534L66378L71611L61389L65847
3565.2H1729680L60853L21692L05992L35890L72267L89570M00591M13990M22841M19367
3585.6H5472733L80784L41153L60149M00460M13466M16308M10754L82930L69531L82518
3606H9330786L92014L79747L77202L83050L73023L66450L36057K90447L00318L39747
3626.4I2868841L40128K64728K19708K33829K35439K34926K50554K73925L08776L34256
$$ plain form
3646.8 95565110 95839465 95954508 96008718 96121120 96279615 96422654 96539646 96661752 96823412 97012478
3667.2 97012478 97171110 97273159 97375560 97454017 97441852 97418213 97449380 97563595 97770476 98016196
3687.6 98016196 98157841 98149997 98136830 98187107 98275852 98374671 98446107 98482502 98555130 98693490 98817348
3710 98817348 98817784 98754328 98751801 98815489 98900563 98972434 99015468 99039483 99086469 99184978 99308115 99372989
3734.5 99372989 99338847 99294454 99315143 99376643 99414229 99442810 99499136 99493980 99394000 99332106 99343544 99369156
3759 99369156 99380392 99409121 99457723 99499112 99519819 99500167 99464226 99468505 99523371 99572277 99573845 99566531 99563527
3785.5 99563527 99559474 99574155 99605894 99643236 99682832 99731636 99788016 99807322 99793112 99774146 99728078 99700695
3810 99700695 99747282 99835885 99890625 99903452 99896890 99839479 99784398 99774796 99789780 99829978 99895024 99966717
$$ packed form
3646.8I5565110K74355J15043N4210J12402J58495J43039J16992J22106J61660J89066
3667.2I7012478J58632J02049J02401P8457j2165k3639L1167J14215K06881K45720
3687.6I8016196J41645p844j3167N0277Q8745R8819P1436L6395P2628J38360J23858
3710I8817348M36o3456k527O3688Q5074P1871M3034K4015M6986R8509J23137O4874
3734.5I9372989l4142m4393K0689O1500L7586K8581N6326n156r9980o1894J1438K5612
3759I9369156J1236K8729M8602M1389K0707j9652l5941M279N4866M8906J568p314l004
3785.5I9563527m053J4681L1739L7342L9596M8804N6380J9306j4210j8966m6068k7383
3810I9700695M6587Q8603N4740J2827o562n7411n5081r602J4984M0198O5046P1693
$$ plain form
3834.4 99966717 100000000 99954444 99884850 99845290 99816102 99804461 99857903 99978286 100041366 99947000 99851274
3856.9 99851274 99821079 99839467 99883252 99913275 99934953 99949098 99932647 99899787 99867576 99862409 99880099 99883831
3881.4 99883831 99895948 99909735 99896097 99892646 99890661 99872261 99893564 99959761 100000000 99983621 99928993 99863404
3905.8 99863404 99822879 99821031 99843752 99885118 99931532 99946147 99926192 99905813 99896014 99894983 99912637 99940950
3930.3 99940950 99949014 99931812 99917209 99920201 99928355 99924320 99921185 99945635 99983704 100000000 99993283 99990398 100005829
3956.8 100005829 100027204 100034869 100021470 100003791 100008368 100037181 100069129 100087523 100097084 100113070 100133049 100145197
3981.3 100145197 100139332 100114727 100097501 100105917 100126362 100140560 100142407 100140631
3997.6 100140631
$$ packed form
3834.4I9966717L3283m5556o9594l9560k9188j1641N3442J20383O3080r4366r5726
3856.9I9851274l0195J8388M3785L0023K1678J4145j6451l2860l2211n167J7690L732
3881.4I9883831J2117J3787j3638l451j985j8400K1303O6197M0239j6379n4628o5589
3905.8I9863404m0525j848K2721M1366M6414J4615j9955k0379r799j031J7654K8313
3930.3I9940950Q064j7202j4603K992Q154m035l135K4450L8069J6296o717k885J5431
3956.8A00005829K1375P665j3399j7679M577K8813L1948J8394R561J5986J9979J2148
3981.3A00145197n865k4605j7226Q416K0445J4198J847j776
3997.6A00140631
##END=$$ End of the data block
