##TITLE=Ac. p-acetamidobenzoico - Lucas M. - Lucas S. e Marcos $$ Begin of the data block
##JCAMP-DX=5.00 $$ ACD/SpecManager v 10.08
##SPECTROMETER/DATA SYSTEM=Alpha
##DATE=07 Apr 2015 09:02:46
##DATA TYPE=INFRARED SPECTRUM
##DATA CLASS=XYDATA
##ORIGIN=
##OWNER=
##NPOINTS=1765
##FIRSTX=399.76428223
##LASTX=3997.64306641
##MAXX=3997.64306641
##MINX=399.76428223
##MAXY=1.00000000
##MINY=0.58922404
##XFACTOR=1.0000000000
##YFACTOR=0.000000010000000
##FIRSTY=1.00000000
##DELTAX=2.03961372
##XUNITS=1/CM
##YUNITS=ARBITRARY UNITS
##XYDATA=(X++(Y..Y))
399.8 100000000 99981886 99981886 99921328 99798423 99597007 99312997 98939341 98488009 97981524 97450358 96943861
422.2 96943861 96504247 96174031 95987809 95966810 96114618 96414506 96833581 97327024 97845483 98341721
442.6 98341721 98776162 99120784 99360931 99494880 99532104 99490583 99393326 99264443 99125260 98991829
463 98991829 98875409 98780668 98706239 98644751 98582703 98500848 98374575 98176110 97879219 97465307 96929109
485.4 96929109 96282309 95554793 94793028 94056123 93408662 92913133 92621368 92566419 92756128 93169969
505.8 93169969 93761361 94464946 95205551 95906907 96498442 96920604 97128189 97092164 96800947 96260965
526.2 96260965 95496917 94550866 93480301 92355627 91257089 90270025 89477646 88951635 88742781
544.6 88742781 88872790 89329344 90065873 91007072 92059362 93123841 94109297 94943625 95581686 96009034
565 96009034 96240479 96314025 96281469 96197259 96107841 96043289 96013284 96008003 96002531 95963943 95859599 95665389
589.4 95665389 95372146 94988954 94543058 94076675 93640769 93287367 93061376 92993426 93094969 93356287
609.8 93356287 93747979 94225889 94738555 95235062 95671892 96017754 96256202 96385813 96418113 96374083
630.2 96374083 96279681 96160859 96039408 95930129 95839912 95768684 95710546 95655245 95589387 95497817 95364541
652.7 95364541 95174247 94914305 94577456 94164008 93682826 93150854 92591667 92032743 91501671 91021621
673.1 91021621 90607017 90260565 89972365 89721382 89480102 89221650 88927442 88592941 88230330 87868303
693.5 87868303 87548691 87320572 87232482 87323904 87617993 88117111 88801771 89633489 90560615 91525912
713.9 91525912 92473716 93355912 94136816 94796318 95330656 95750636 96077120 96335393 96549416 96736681
734.3 96736681 96904755 97048998 97151595 97181731 97098452 96858162 96425146 95782310 94939041 93934804
754.7 93934804 92837638 91738349 90740347 89946985 89447188 89301354 89529151 90102911 90950465 91967905
775.1 91967905 93037391 94045532 94898903 95535487 95930636 96097404 96081275 95950145 95780969 95644951
795.4 95644951 95594454 95654893 95823836 96075654 96368963 96654898 96885037 97018468 97027379 96900445 96643686
817.9 96643686 96278763 95839059 95363909 94892383 94457549 94081998 93775713 93535852 93348306 93190432
838.3 93190432 93034440 92851591 92616570 92312479 91935432 91497558 91026777 90563619 90155429 89850146
858.7 89850146 89690864 89711332 89931703 90354568 90962577 91718352 92568135 93449181 94298398 95060104
879.1 95060104 95690835 96162421 96462578 96594673 96575928 96433938 96201295 95909423 95583308 95238447
899.5 95238447 94880605 94507766 94112641 93685037 93214172 92691171 92111176 91475368 90792012 90076518
919.9 90076518 89350438 88639641 87972033 87375337 86874658 86490113 86234701 86113131 86121696 86248934
940.3 86248934 86477059 86784399 87148249 87547678 87965566 88389677 88812631 89230710 89641839 90043414
960.7 90043414 90431184 90799069 91139483 91443956 91704524 91915530 92075187 92186284 92255628 92292434
981.1 92292434 92305762 92301679 92280722 92236984 92159289 92033744 91846877 91589355 91259682 90867090 90432626
1003.5 90432626 89987695 89570528 89220923 88974220 88855338 88874489 89025134 89284879 89618766 89984405
1023.9 89984405 90338510 90643591 90873444 91016221 91075045 91066152 91015100 90951622 90904242 90895498 90938640
1046.3 90938640 91036272 91181165 91358447 91549057 91733247 91893476 92016608 92094976 92126608 92114550
1066.7 92114550 92065299 91987211 91888773 91777259 91657740 91532624 91401529 91261744 91108704 90936852
1087.1 90936852 90740621 90515602 90259218 89971423 89654958 89315325 88960630 88600540 88244987 87903231
1107.5 87903231 87583834 87294954 87044764 86841619 86694163 86610883 86599231 86664271 86807573 87026006
1127.9 87026006 87310618 87645811 88009894 88377464 88722914 89023423 89260709 89421964 89499491 89489424
1148.3 89489424 89390159 89200628 88919348 88544619 88075751 87515932 86876297 86179835 85463041 84774512
1168.7 84774512 84170198 83706927 83434683 83388567 83582413 84004724 84618515 85365111 86171663 86961204
1189.1 86961204 87663370 88223344 88607246 88804084 88824117 88694674 88453895 88143760 87803209 87463033
1209.5 87463033 87142950 86851203 86586463 86341250 86105567 85869718 85625732 85367668 85090959 84791052
1229.9 84791052 84461761 84093904 83674735 83188719 82619548 81954300 81188554 80331665 79410279 78468686
1250.3 78468686 77565688 76768166 76142097 75742227 75601715 75723708 76076716 76595092 77185494 77739298
1270.7 77739298 78148389 78321940 78200227 77763891 77036852 76082724 74994749 73880976 72847199
1289 72847199 71981096 71340907 70950127 70798850 70850778 71054327 71355337 71708947 72088736 72491211
1309.4 72491211 72934532 73452264 74083501 74862862 75812119 76935458 78217459 79623896 81104994
1327.8 81104994 82601047 84049118 85389352 86569786 87548888 88296008 88790888 89023709 88995880
1346.2 88995880 88721329 88227433 87554431 86753464 85883695 85008264 84189272 83481920 82928324 82552218
1366.6 82552218 82355773 82319748 82406580 82566011 82741845 82879305 82931656 82866007 82666999 82338369
1386.9 82338369 81901544 81391555 80850732 80321479 79839271 79427153 79092580 78826767 78607208 78403282
1407.3 78403282 78183591 77924186 77616262 77271301 76922452 76621759 76433212 76423192 76649719 77152425
1427.7 77152425 77945131 79012156 80309451 81769675 83310682 84845734 86293948 87588555 88682467
1446.1 88682467 89550471 90188098 90608031 90834886 90899581 90834326 90669000 90429223 90135622 89804000
1466.5 89804000 89446062 89070046 88681275 88282257 87872767 87449723 87007123 86536080 86024767 85459304
1486.9 85459304 84825385 84110093 83303559 82400149 81399369 80306768 79134589 77902520 76637918
1505.2 76637918 75375801 74158078 73031461 72044843 71246642 70682305 70391256 70403171 70734632
1523.6 70734632 71386778 72344518 73577124 75040382 76679921 78435028 80242515 82040429 83771646
1542 83771646 85387939 86853063 88143510 89248002 90165144 90900439 91462564 91860026 92098373
1560.3 92098373 92178589 92096251 91842127 91404670 90774745 89950991 88944429 87780482 86498713 85149598
1580.7 85149598 83789408 82474130 81254601 80172938 79260206 78535521 78006738 77672982 77528298
1599.1 77528298 77564317 77771211 78136146 78640449 79256010 79942685 80648756 81314749 81879431 82286727
1619.5 82286727 82492083 82467949 82207429 81725347 81055290 80243433 79340219 78391510 77430809 76474154
1639.9 76474154 75518990 74546921 73529100 72433245 71231592 69908601 68467325 66933060 65352911
1658.2 65352911 63792342 62328768 61043286 60011017 59292263 58925325 58922404 59268469 59924150
1676.6 59924150 60831928 61924428 63133615 64398676 65672064 66923487 68140596 69327033 70497984
1694.9 70497984 71674520 72877538 74122488 75415826 76753950 78123927 79505861 80875832
1711.3 80875832 82208925 83482009 84676194 85778135 86780763 87682855 88487905 89202559 89835107
1729.6 89835107 90394282 90888757 91326553 91714859 92059892 92366660 92639017 92879868 93091673 93276626
1750 93276626 93436885 93574554 93691707 93790418 93872809 93941134 93997604 94044513 94083941 94117701 94147336
1772.4 94147336 94174254 94199717 94224811 94250345 94276780 94304132 94332147 94360220 94387710 94414020 94438934 94462717
1796.9 94462717 94486272 94511187 94539505 94573587 94615448 94666505 94727057 94796211 94871873 94950861 95029396 95103568
1821.4 95103568 95169836 95225471 95268828 95299554 95318544 95327657 95329356 95326293 95320952 95315409 95311135 95309091 95309621
1847.9 95309621 95312697 95317751 95324022 95330513 95336205 95340079 95341182 95338631 95331758 95320094 95303589 95282578 95257944
1874.4 95257944 95230860 95202774 95175171 95149469 95126843 95108014 95093262 95082253 95074302 95068419 95063567 95058960
1898.9 95058960 95054185 95049345 95044988 95042157 95042056 95045823 95054352 95067918 95086229 95108300 95132756 95157945 95182174
1925.4 95182174 95203990 95222247 95236158 95245343 95249510 95248497 95242059 95229942 95212030 95188463 95159912 95127642
1949.9 95127642 95093554 95060074 95029914 95005816 94989973 94983774 94987458 95000112 95019805 95043969 95069748 95094419
1974.4 95094419 95115715 95132142 95142972 95148355 95148993 95146060 95140731 95134056 95126742 95119166 95111310 95102918 95093447 95082223
2002.9 95082223 95068502 95051748 95031601 95007986 94981146 94951570 94919950 94887167 94854081 94821620 94790459 94761050
2027.4 94761050 94733435 94707459 94682676 94658583 94634658 94610465 94585609 94559884 94533110 94505250 94476199 94445854
2051.9 94445854 94414008 94380349 94344634 94306695 94266671 94225097 94182807 94141084 94101471 94065607 94035119 94011223
2076.4 94011223 93994713 93985605 93983305 93986475 93993288 94001657 94009507 94015014 94016927 94014621 94008207 93998420 93986475 93973792
2104.9 93973792 93961829 93951744 93944275 93939710 93937755 93937731 93938708 93939596 93939453 93937415 93932939 93925720 93915695 93902922 93887591
2135.5 93887591 93869853 93849856 93827659 93803352 93776995 93748778 93719029 93688279 93657219 93626702 93597686 93571097
2160 93571097 93547750 93528259 93512946 93501741 93494302 93489885 93487585 93486267 93484879 93482405 93478018 93471175 93461603 93449301
2188.5 93449301 93434489 93417627 93399209 93379760 93359786 93339646 93319511 93299437 93279397 93259180 93238550 93217194
2213 93217194 93194830 93171203 93146151 93119657 93091780 93062776 93032980 93002886 92973024 92944056 92916536 92890966
2237.5 92890966 92867684 92846769 92828101 92811304 92795813 92780960 92766047 92750365 92733437 92714912 92694700 92672873
2262 92672873 92649686 92625374 92600197 92574263 92547518 92519730 92490572 92459571 92426372 92390710 92352575 92312312
2286.4 92312312 92270452 92227912 92185748 92145002 92106718 92071587 92039955 92011672 91986144 91962343 91938913 91914403
2310.9 91914403 91887426 91856843 91821909 91782415 91738755 91691804 91643012 91593993 91546494 91502023 91461718 91426170
2335.4 91426170 91395354 91368604 91344810 91322410 91299796 91275412 91248077 91217184 91182715 91145241 91105843 91065860
2359.9 91065860 91026747 90989822 90956044 90926033 90899760 90876764 90856171 90836847 90817541 90797132 90774643 90749383
2384.3 90749383 90720934 90689164 90654188 90616333 90576005 90533686 90489852 90444964 90399438 90353757 90308309 90263486
2408.8 90263486 90219665 90177178 90136248 90097040 90059531 90023553 89988762 89954668 89920652 89886057 89850134 89812273
2433.3 89812273 89771819 89728296 89681357 89630812 89576697 89519173 89458632 89395630 89330864 89265150 89199412 89134520
2457.8 89134520 89071274 89010316 88951975 88896370 88843274 88792276 88742751 88694024 88645476 88596642 88547236 88497281
2482.2 88497281 88446975 88396692 88346785 88297546 88249034 88201010 88153005 88104188 88053596 88000143 87942785 87880725
2506.7 87880725 87813306 87740320 87661833 87578195 87489963 87397814 87302530 87204862 87105614 87005568 86905688
2529.1 86905688 86807108 86711264 86619985 86535561 86460596 86398101 86351228 86323088 86316508 86333823 86376578 86445421
2553.6 86445421 86539847 86658251 86797804 86954618 87123752 87299585 87475938 87646431 87804878 87945664
2574 87945664 88064134 88157028 88222766 88261586 88275737 88269150 88247132 88215935 88181996 88151300 88128734 88117576
2598.5 88117576 88119203 88133025 88156706 88186556 88218141 88246870 88268661 88280267 88279754 88266444 88240850 88204521
2623 88204521 88159585 88108492 88053620 87997109 87940615 87885308 87831903 87780619 87731421 87684035 87638056 87593096
2647.4 87593096 87548834 87505251 87462562 87421495 87383306 87349755 87323207 87306410 87302363 87314010 87344098 87394679
2671.9 87394679 87467009 87561256 87676400 87810278 87959677 88120383 88287580 88456011 88620222 88774925
2692.3 88774925 88915223 89036840 89136392 89211601 89261436 89286286 89288020 89269865 89236343 89192891 89145488
2714.7 89145488 89100134 89062285 89036387 89025331 89030218 89050233 89082670 89123350 89166862 89207387 89239144 89257067
2739.2 89257067 89257342 89237654 89197451 89137781 89061075 88970751 88870752 88764948 88656837 88549078 88443381
2761.6 88443381 88340491 88240319 88142288 88045603 87949592 87853944 87758929 87665296 87574410 87487799 87407112
2784.1 87407112 87333709 87268466 87211657 87162864 87121034 87084711 87052017 87021154 86990476 86958748 86925268 86890012
2808.6 86890012 86853600 86817151 86782187 86750489 86723781 86703545 86690879 86686373 86689967 86701131 86718863 86741900
2833 86741900 86768913 86798799 86830640 86864030 86898822 86935198 86973429 87013716 87055993 87099802 87144172 87187690
2857.5 87187690 87228638 87265182 87295568 87318450 87333035 87339139 87337297 87328666 87314916 87298113 87280518 87264305
2882 87264305 87251562 87244040 87243086 87249541 87263644 87284911 87312186 87343496 87376237 87407279 87433213 87450773 87457168
2908.5 87457168 87450492 87430054 87396622 87352461 87301099 87247080 87195390 87150908 87117797 87099022 87096071 87108719
2933 87108719 87135231 87172645 87217158 87264639 87311149 87353265 87388527 87415427 87433487 87443155 87445533 87442207 87434983
2959.5 87434983 87425697 87415987 87407327 87400764 87397027 87396431 87398934 87404168 87411523 87420291 87429696 87439173 87448442 87457502 87466848
2990.1 87466848 87477213 87489533 87504601 87522882 87544197 87567687 87591696 87613976 87631911 87642914 87644881 87636590
3014.5 87636590 87618011 87590426 87556380 87519300 87483186 87452018 87429547 87418938 87422645 87442380 87479049 87532896
3039 87532896 87603486 87689883 87790513 87903166 88024741 88151091 88277137 88397235 88505685 88597405 88668489
3061.5 88668489 88716781 88742012 88746071 88732779 88707590 88676810 88646853 88623214 88609940 88609034 88620627 88643152
3085.9 88643152 88673782 88709050 88745391 88779867 88810676 88837492 88861549 88885343 88912112 88945287 88987875 89042038
3110.4 89042038 89108765 89187902 89278102 89377141 89482313 89590818 89700150 89808327 89913988 90016294
3130.8 90016294 90114838 90209270 90299171 90383965 90462685 90533996 90596300 90647680 90686041 90709221 90715027 90701479
3155.3 90701479 90666765 90609640 90529543 90426844 90303057 90161026 90004873 89839715 89671445 89506304
3175.7 89506304 89350241 89208579 89085525 88983834 88904715 88847822 88811487 88793075 88789254 88796347 88810670
3198.1 88810670 88828468 88846290 88860846 88869238 88868761 88857019 88831908 88791537 88734293 88658786 88563991 88449091
3222.6 88449091 88313591 88157105 87979311 87780023 87559158 87316859 87053537 86770052 86467773 86148643
3243 86148643 85815257 85470885 85119331 84764802 84411550 84063607 83724421 83396584 83081645 82779711
3263.4 82779711 82489479 82208085 81931168 81653047 81366968 81065530 80741167 80386674 79996157 79565817
3283.8 79565817 79094988 78586876 78049189 77494359 76939464 76405406 75915873 75495631 75168586 74955666
3304.2 74955666 74872899 74929887 75128728 75463939 75922811 76486617 77132165 77833837 78565645 79303056
3324.6 79303056 80024600 80712777 81354636 81941628 82469177 82935935 83343017 83693063 83989614 84236467
3345 84236467 84437370 84595889 84715289 84798741 84849358 84870261 84864700 84836030 84787631 84722853 84645027 84557283
3369.4 84557283 84462512 84363234 84261620 84159380 84057832 83957815 83859801 83763903 83669955 83577543 83486181
3391.9 83486181 83395272 83304405 83213186 83121526 83029455 82937294 82845604 82755160 82666910 82581937 82501364 82426280
3416.3 82426280 82357681 82296354 82242918 82197708 82160848 82132250 82111609 82098687 82093257 82095224 82104713 82121980
3440.8 82121980 82147461 82181716 82225209 82278287 82341057 82413262 82494247 82583094 82678521 82779151 82883561
3463.2 82883561 82990378 83098441 83206826 83315003 83422643 83529824 83636755 83743781 83851326 83959752
3483.6 83959752 84069437 84180582 84293383 84407926 84524286 84642458 84762520 84884524 85008675 85135084
3504 85135084 85263932 85395277 85529131 85665411 85804003 85944700 86087340 86231828 86378103 86526191
3524.4 86526191 86676162 86828142 86982149 87138140 87295908 87455076 87615252 87775940 87936801 88097608
3544.8 88097608 88258356 88419229 88580567 88742828 88906395 89071661 89238876 89408225 89579880 89754051
3565.2 89754051 89931047 90111262 90295237 90483546 90676653 90874898 91078317 91286582 91499048 91714799
3585.6 91714799 91932815 92152143 92371988 92591769 92811203 93030202 93248796 93466955 93684465 93900841
3606 93900841 94115257 94326490 94533134 94733560 94926262 95109999 95283926 95447803 95602012 95747590
3626.4 95747590 95885950 96018654 96147186 96272653 96395677 96516246 96633661 96746719 96853799 96953332
3646.8 96953332 97043914 97124773 97195852 97257775 97311532 97358352 97399503 97436243 97469682 97500783 97530293 97558737
3671.3 97558737 97586584 97614241 97642279 97671241 97701758 97734094 97768211 97803652 97839838 97876078 97911721 97946227
3695.8 97946227 97979063 98009896 98038518 98064893 98089159 98111540 98132348 98151964 98170924 98189908 98209703 98231089
3720.2 98231089 98254752 98281127 98310298 98341960 98375344 98409247 98442149 98472434 98498565 98519403 98534226 98542815
3744.7 98542815 98545349 98542619 98535693 98525971 98515052 98504454 98495466 98488951 98485380 98484808 98487031 98491549 98497754 98505050
3773.3 98505050 98512971 98521340 98530197 98539925 98551095 98564237 98579782 98597765 98617965 98639822 98662543 98685259
3797.7 98685259 98707122 98727441 98745751 98761863 98775899 98788238 98799413 98809999 98820502 98831308 98842639 98854613
3822.2 98854613 98867220 98880303 98893666 98907036 98920161 98932731 98944491 98955286 98965043 98973864 98981947 98989570
3846.7 98989570 98997146 99004972 99013323 99022341 99032050 99042428 99053264 99064273 99075127 99085498 99095291 99104494 99113268
3873.2 99113268 99121857 99130577 99139768 99149680 99160498 99172229 99184692 99197507 99210119 99221969 99232560 99241585 99248964
3899.7 99248964 99254870 99259788 99264383 99269480 99275899 99284261 99294907 99307859 99322855 99339402 99356872 99374735 99392420
3926.2 99392420 99409670 99426317 99442464 99458337 99474257 99490470 99507087 99524081 99541283 99558485 99575484 99592155
3950.7 99592155 99608403 99624360 99640185 99656105 99672419 99689364 99707079 99725622 99744904 99764639 99784607 99804497
3975.2 99804497 99824095 99843234 99861819 99879873 99897492 99914765 99931836 99948835 99965852 99982917 100000000
3997.6 100000000
##END=$$ End of the data block
