##TITLE=Ac. p-acetamidobenzoico - Janine e Patricia $$ Begin of the data block
##JCAMP-DX=5.00 $$ ACD/SpecManager v 10.08
##SPECTROMETER/DATA SYSTEM=Alpha
##DATE=07 Apr 2015 09:02:46
##DATA TYPE=INFRARED SPECTRUM
##DATA CLASS=XYDATA
##ORIGIN=
##OWNER=
##NPOINTS=1765
##FIRSTX=399.76428223
##LASTX=3997.64306641
##MAXX=3997.64306641
##MINX=399.76428223
##MAXY=1.00540876
##MINY=0.06444797
##XFACTOR=1.0000000000
##YFACTOR=0.000000010000000
##FIRSTY=1.00000000
##DELTAX=2.03961372
##XUNITS=1/CM
##YUNITS=ARBITRARY UNITS
##XYDATA=(X++(Y..Y))
399.8A00000000J27923J01138k29061j78498j94830J31846o1256m01241m28509o39391
420.2I8228121r99135j296717k276242m425484n312663j300102M586285O093597L518725
438.5I6816385J391607Q99279N95820k0623j71172K29549K59155j16104j22845J62244
458.9I9923295O538l57955k39766J63639J01316k65748k35295K2411j42842m62419
479.3I8513174k81864j4007l44736p52950o61212p25162j605904k958673m673433o874007
499.7G9621226o805087o25842O937515Q520151N353474K387119J095551N12451j15490
518.1I6881068m00824j10352k0700m95100q25662p39389r67259j749587k592802l508454
538.5H5470939n016125o582629o545198l738117J098632N480016P374364O771773M830784
$$ plain form
399.8 100000000 100127923 100229061 100000000 99821502 99626672 99758518 99697262 99296021 98867512 98228121
420.2 98228121 97228986 95932269 93656027 89230543 83917880 82617778 87204063 93297660 96816385
438.5 96816385 98207992 99107271 99703091 99682468 99511296 99740845 100000000 99883896 99761051 99923295
458.9 99923295 99929833 99571878 99332112 99495751 99597067 99331319 99096024 99118435 98975593 98513174
479.3 98513174 98231310 98217303 97872567 97119617 96458405 95733243 94127339 91168666 86495233 79621226
499.7 79621226 72816139 72190297 79127812 87647963 93001437 95388556 96484107 96996558 96881068
518.1 96881068 96480244 96369892 96349192 95854092 95028430 94289041 93321782 91572195 88979393 85470939
538.5 85470939 80454814 73872185 67326987 63588870 64687502 70167518 77541882 84313655 89144439
556.8H9144439K775394J498270R56738M36825k61998p92551j286268j718164r24206
575.2H9828479J127851K221334J528991M82201J26797J54615q9431n13304o41387o39797
595.6I3586349j016473j696372k338672l061157l607858k187514J987344N580586N318284
613.9I2564517K853412J118624M08173q0735l96198l44396l98838r42487r91541J16581
634.3I3907112Q18783K69836l10677k83998p9894j16754k47520j91510j56152l93212
654.7I3216014n81896m85468m89027p86274r90731j312065j904166j804220k154404
673.1H2707763l596443m949051l235895J639480M286998K600682P6014j124204j488184
691.4G6917160k081913l578925n046082m432088j478207J661873L386682L860843L704673
$$ plain form
556.8 89144439 91919833 93418103 94374841 94811666 94549668 93757117 92470849 90752685 89828479
575.2 89828479 90956330 93177664 94706655 95188856 95315653 95470268 95380837 94867533 94226146 93586349
595.6 93586349 92569876 90873504 88534832 85473675 81865817 79678303 81665647 87246233 92564517
613.9 92564517 95417929 96536553 96944726 96863991 96467793 96123397 95724559 94782072 93790531 93907112
634.3 93907112 94725895 94995731 94685054 94401056 94321162 94204408 93956888 93765378 93609226 93216014
654.7 93216014 92634118 92148650 91659623 90873349 89882618 88570553 86666387 84862167 82707763
673.1 82707763 79111320 74162269 70926374 72565854 76852852 79453534 79529548 78405344 76917160
691.4 76917160 74835247 71256322 66210240 61778152 60299945 61961818 65348500 69209343 72914016
709.8G2914016L255660K780538K448732K122635J718658J401049J294833J197297R38308
728.1I0071726P43824P78675P64710N41425M01067M77219M60100K16037O1554J02413
748.5I4618750J1003l24256o40696j002616j761984l227562o611502j2022192j2783354
766.9E6255591k297026J0794008J3749176Q849341M087901J655513P62486L70241n5695
785.3I4171536l96258o92218j381630k415693k805066j374143J468754L475099L360814
803.6I3411195K083296P36034m02409r37545n47707J45870K31129j25337m14455p62164
824I3417907j275712j757831k230579k698069k351153m28933J959795K718567J597679
842.4H8951671j687j244670k390748l855002m830772k945679J702756M239773K127809
$$ plain form
709.8 72914016 76169676 78950214 81398946 83521581 85240239 86641288 87936121 89133418 90071726
728.1 90071726 90815550 91594225 92358935 92900360 93301427 93778646 94238746 94454783 94516337 94618750
748.5 94618750 94629753 94305497 93664801 92662185 90900201 87672639 81061137 69038945 56255591
766.9 56255591 53958565 64752573 78501749 87351090 91438991 93094504 93856990 94227231 94171536
785.3 94171536 93775278 93083060 91701430 89285737 86480671 85106528 86575282 90050381 93411195
803.6 93411195 95494491 96230525 95828116 94890571 94342864 94488734 94719863 94594526 94180071 93417907
824 93417907 92142195 90384364 88153785 85455716 83104563 82675630 84635425 87353992 88951671
842.4 88951671 88949984 87705314 85314566 81459564 76628792 73683113 75385869 79625642 81753451
860.7H1753451j858539n177992n574173l19076P414145R996962O675971K914387J173442
879.1I6998578M38720m4447j94710j26875k26873m68063m93032l43412l94941o08086
899.5I4536859o38950n46944o75351r60058j071465j069480j265639j604140j792860
917.8H4911972j884162k124119k423698k501934k371526k209252j945877j402665o91479
936.2F7357260q5461L94100Q99744J392394J669705J721692J673758J385725P54058
954.5G7162975M85039J137060J593160Q00634m8250O01548K068817K674973K170819
972.9H8646775J334459N32490m25512j628291k143771o71053J649410K221167J198417
991.3I0714091K99281k27118o90710r61143j056296j307630j765514k134186k300870
$$ plain form
860.7 81753451 79894912 74716920 69142747 68823671 76237816 86234778 92910749 95825136 96998578
879.1 96998578 97437298 97392851 97198141 97071266 96844393 96376330 95883298 95539886 95144945 94536859
899.5 94536859 93897909 93350965 92675614 91715556 90644091 89574611 88308972 86704832 84911972
917.8 84911972 83027810 80903691 78479993 75978059 73606533 71397281 69451404 68048739 67357260
936.2 67357260 67271799 67665899 68565643 69958037 71627742 73349434 75023192 76408917 77162975
954.5 77162975 77648014 78785074 80378234 81178868 81130618 81732166 83800983 86475956 88646775
972.9 88646775 89981234 90513724 90088212 88459921 86316150 85645097 87294507 89515674 90714091
991.3 90714091 91013372 90786254 90095544 89134401 88078105 86770475 85004961 82870775 80569905
1009.6H0569905k312070j955199j107759n7149J267338K949918L975778L500653K099508
1028H8930923P20179j46979n73981r85426j439804j451695p13378M13805J322055J764125
1048.4H7839824J810384J485365R41068N76413N12928M12452J26660k1637Q5771J00714
1068.8I3869942j11639k15596r2840p1228k67660l56156k15405j65290l19493l73941
1089.2I1680694k25932k01529m28730o09970o36542q49766j411700j996017k208501
1107.5H3112007j803416q32134J20044M02021O6912j56456K27970M09710r94599l053271
1127.9G7498788k089948K376765N300462M160589J851845O26248J30082k61242n01108
1146.3H9092481m98754n09357o62285p25836o19590o29407r11290j253795j535905
$$ plain form
1009.6 80569905 78257835 76302636 75194877 75137728 76405066 79354984 83330762 86831415 88930923
1028 88930923 89651102 89504123 88930142 87944716 86504912 85053217 84339839 84753644 86075699 87839824
1048.4 87839824 89650208 91135573 92076641 92653054 93165982 93578434 93705094 93683457 93769228 93869942
1068.8 93869942 93758303 93542707 93449867 93378639 93110979 92754823 92539418 92374128 92054635 91680694
1089.2 91680694 91454762 91253233 90824503 90214533 89577991 88728225 87316525 85320508 83112007
1107.5 83112007 81308591 80476457 80596501 80998522 81065434 80908978 81136948 81546658 80552059 77498788
1127.9 77498788 75408840 77785605 83086067 87246656 89098501 89724749 89854831 89593589 89092481
1146.3 89092481 88593727 88084370 87422085 86696249 86076659 85447252 84535962 83282167 81746262
1164.6H1746262k013778k907694m078072n121809n533529m765516k454651R22966M455179
1183F0249358P545126Q677542O554210K931631L23075p95043j007062r29779r19961
1201.3H2629097r08614p76124o90049p79652q71516q11660p19499p20972p24894o59919
1221.7G4966198o65927q31914r77432r75937r83578j123893j252318j273209j369738
1240.1F5512252j673949k010393k206332k394068k747583l229308l759033m330897
1256.4D3160689m806370m735344l452206n41770L589111P238999Q207864N977037K343500
1274.8E6981510p17956k694809l919155m687553n066491n069571m687575l856283k614978
1293.1B3667139j204701J19177J428304K869454L863028L156292M48782k699131m231680
$$ plain form
1164.6 81746262 79732484 76824790 72746718 67624909 62091380 57325864 54871213 55794179 60249358
1183 60249358 67794484 76472026 83026236 85957867 86280942 85485899 84478837 83549058 82629097
1201.3 82629097 81720483 80944359 80254310 79474658 78603142 77791482 77071983 76351011 75626117 74966198
1221.7 74966198 74300271 73468357 72490925 71514988 70531410 69407517 68155199 66881990 65512252
1240.1 65512252 63838303 61827910 59621578 57227510 54479927 51250619 47491586 43160689
1256.4 43160689 38354319 33618975 30166769 29624999 33214110 40453109 48660973 54638010 56981510
1274.8 56981510 56263554 53568745 49649590 44962037 39895546 34825975 30138400 26282117 23667139
1293.1 23667139 22462438 22581615 24009919 26879373 30742401 33898693 34347475 31648344 27416664
1311.5B7416664k943954P52587M115116M760385M012668M451364N824945O427127N672079
1329.8F0488981M109567K598525J856952K082801K641040K555901J863986J049978
1346.2G9247731J47766q36367j689016k339662l069645l981477m883241n134291l630918
1364.5E3830880j101941P08324J415580J611418J733702J638490J349074Q26961N1158
1382.9F2063646o90043j399010j960498k029056j972937k101869k281317k523091k446804
1401.2D4659021j833066q18103O99460K097303K561405J667258n1987k096429m050526
1419.6D2834336m160017l147519j725033N72124L371269N524188O316519P143348O959093
1437.9F3688308M803872L472024K882868K397907J956749J371348J053345J046586
$$ plain form
1311.5 27416664 24472710 25225297 29340413 34100798 38113466 42564830 48389775 54816902 60488981
1329.8 60488981 64598548 67197073 69054025 71136826 73777866 76333767 78197753 79247731
1346.2 79247731 79395497 78559130 76870114 74530452 71460807 67479330 62596089 57461798 53830880
1364.5 53830880 52728939 53437263 54852843 56464261 58197963 59836453 61185527 62012488 62063646
1382.9 62063646 61373603 59974593 58014095 55985039 54012102 51910233 49628916 47105825 44659021
1401.2 44659021 42825955 42007852 42707312 44804615 47366020 49033278 48981291 46884862 42834336
1419.6 42834336 38674319 35526800 33801767 34373891 37745160 43269348 49585867 56729215 63688308
1437.9 63688308 68492180 71964204 74847072 77244979 79201728 80573076 81626421 82673007
1454.3H2673007R85533K89887k79241k74349m42755p90000p11399m86511p67356j332200
1474.7G8864616j563275j551765j491272j244015p95019o46388j297861k317763k556628
1493F5400630k804816l733766m172182l652376l094121l712273n708516m872250k955163
1511.4C0695167k262744k417618k885856k345133j097801L20537J612866K717042L327140
1529.7B7663600M107580N381170N182573M961297O848562O980318N149513M361695
1546G0636308L795541L402191K904564K381319J910597J486021M92949j91069k18177
1564.4H6600244r6357M6385j22655n67514j182276k519732l547937m189342n461157
1582.8F8959659p007432q393603q191964m884520M42144M326030M752338K811528J27655
$$ plain form
1454.3 82673007 83658540 83948427 83669186 83394837 82952082 82162082 81450683 80964172 80196816 78864616
1474.7 78864616 77301341 75749576 74258304 73014289 72219270 71572882 70275021 67957258 65400630
1493 65400630 62595814 58862048 54689866 51037490 47943369 44231096 38522580 33650330 30695167
1511.4 30695167 28432423 26014805 23128949 20783816 19686015 20006552 21619418 24336460 27663600
1529.7 27663600 31771180 37152350 42334923 47296220 54144782 61125100 66274613 70636308
1546 70636308 74431849 77834040 80738604 83119923 85030520 86516541 87009490 86818421 86600244
1564.4 86600244 86503887 86550272 86427617 85860103 84677827 82158095 78610158 74420816 68959659
1582.8 68959659 61952227 53558624 45366660 40482140 40924284 45250314 50002652 52814180 52941835
1601.1E2941835k865046n242971m644251P04190P749635J0477543R000194N474103
1617.4G3595232J553142m50796j493776k036691k368915k742994k662873k663815l508949
1635.8E7219565l517926k651512k244527k139002k669453l161109k493587l000632
1652.1C5341817m923650m142008l528972l807638m026112l511226k381830j646690
1668.4G373691r28894O0811R99743J616293J662340J592023J880749K522539K379079
1686.8A9158374K148381K294388K067570J986090K097112K877760M813930N240309
1703.1D2683914N463901N685872M679537L917343L621447L617918L818375L243983
1719.4G6732290K373761K190464K153415J957494J722926J441401J299983R10896N55695
$$ plain form
1601.1 52941835 50076789 44833818 40189567 40893757 48643392 59120935 68121129 73595232
1617.4 73595232 75148374 74697578 73203802 71167111 68798196 66055202 63392329 60728514 57219565
1635.8 57219565 53701639 51050127 48805600 46666598 43997145 40836036 38342449 35341817
1652.1 35341817 30418167 26276159 22747187 18939549 14913437 11402211 9020381 7373691
1668.4 7373691 6444797 6505608 7505351 9121644 10783984 12376007 14256756 16779295 19158374
1686.8 19158374 21306755 23601143 25668713 27654803 29751915 32629675 37443605 42683914
1703.1 42683914 48147815 53833687 58513224 62430567 66052014 69669932 73488307 76732290
1719.4 76732290 79106051 81296515 83449930 85407424 87130350 88571751 89871734 90782630 91338325
1737.8I1338325N85532P08449P87472P73627O56253N15091L16734J63447J38361J46371
1758.2I6129662J50466J6522j02371N5444K67590K61282M8393q2254n406K0260p8983
1780.6I6680605j10507p4482q6796k0611J63030J85884K0068J038J06090J00624p2282
1803I6892661j35356K4885K05874J82694R7448K06828L64918L42196K50143K61694
1823.4I8693985K51102J24550l7366j30552o4093m405l1405L4433J86014J52314o5124
1845.9I9109453q6898K9874M1098p499K4438Q1158K7448n2226J4824J48719P7993j65576
1870.3I9242806j88362n5236m9144j27411j09684l9417o2281j07056o1696j5849k9421
1892.8I8397249m2135M709R6166J06502L3277J8150M9043j6588j30499r7066O0427
$$ plain form
1737.8 91338325 91923857 92632306 93419778 94193405 94849658 95364749 95681483 95844930 95983291 96129662
1758.2 96129662 96280128 96296650 96194279 96249723 96517313 96778595 96826988 96744734 96739328 96759588 96680605
1780.6 96680605 96570098 96495616 96408820 96388209 96551239 96737123 96757191 96758229 96864319 96964943 96892661
1803 96892661 96757305 96782190 96988064 97170758 97268206 97475034 97839952 98182148 98432291 98693985
1823.4 98693985 98945087 99069637 99032271 98901719 98837626 98833221 98801816 98836249 99022263 99174577 99109453
1845.9 99109453 99022555 99052429 99093527 99086028 99110466 99191624 99219072 99166846 99181670 99330389 99408382 99242806
1870.3 99242806 99054444 98999208 98950064 98822653 98712969 98673552 98611271 98504215 98442519 98426670 98397249
1892.8 98397249 98355114 98359823 98455989 98562491 98595768 98613918 98662961 98646373 98515874 98418808 98479235
1915.2I8479235J35935J03360J55765K46233J91974Q0753N2922N3859l4731j47683
1935.6I9317622j05500P4643J69510Q9484L6526P6103L5959j00523j93655k16830k25043
1958.1I8958296j62232L5864K51525K92504J62393P7325J02586Q6170j67k5743K8002
1980.5I9806523L9375j0049j02P8220Q6033j5157o2776J0502M4185j2392k5379L7223
2005I9976206M4417l7050p3206j3233J3310o2770j17856p5906o3837j14763p7355J9092
2029.4I9417049J0782q5914j25229o4451k4909p7897j15174o3598l4291r2548j23972
2051.9I8619848o1881k4128q8811j42437r7799o4826j33527j88809j43779j04266j48583
2074.3I7421002j72269r0748k801l165n854P5430J42086R4157K4784L4445L6854m9252
$$ plain form
1915.2 98479235 98615170 98718530 98874295 99120528 99312502 99393255 99446177 99500036 99465305 99317622
1935.6 99317622 99212122 99286765 99456275 99545759 99582285 99658388 99694347 99593824 99400169 99183339 98958296
1958.1 98958296 98796064 98831928 99083453 99375957 99538350 99615675 99718261 99804431 99804264 99778521 99806523
1980.5 99806523 99845898 99835849 99835747 99913967 100000000 99984843 99922067 99932569 99976754 99964362 99938983 99976206
2005 99976206 100020623 99983573 99910367 99897134 99910444 99847674 99729818 99653912 99590075 99475312 99397957 99417049
2029.4 99417049 99427831 99341917 99216688 99152237 99127328 99049431 98934257 98870659 98836368 98743820 98619848
2051.9 98619848 98557967 98533839 98445028 98302591 98204792 98139966 98006439 97817630 97673851 97569585 97421002
2074.3 97421002 97248733 97157985 97155184 97152019 97146165 97221595 97363681 97457838 97482622 97517067 97553921 97504669
2098.8I7504669j27798r7740l7974n0533o5833N663P9071M9979L486M3202Q4495K3079
2123.3I7413766n4913l5704P749l3063q6742m5198J2373l0392j01906q3387l6585p0763
2147.7I6855235j25497r7818n0848r7359j73431j51569p8624p3958r9730m7785M0787
2170.2I5899403L8719k5141j6957L8504J8561m2588k7966K0117j5820r4550r0981k9981
2194.6I5671320l1495q0943o9130j5980l3885r9206q9270k1815k5898r2173r7680m8035
2219.1I4965810o0422j27130j26237o1464n7120j18362j25140p3910q0264j39576j29318
2241.6I3866867m6367j4203m6277l1621L2664K5349o0409r8353o8433p6115j29825
2264I3353277j22255m9406l6520j06477j33723q0127o2340j18077j37401r0283q5443
$$ plain form
2098.8 97504669 97376871 97279131 97241157 97190624 97124791 97130454 97209525 97259504 97262990 97306192 97390687 97413766
2123.3 97413766 97358853 97323149 97330898 97297835 97211093 97165895 97178268 97147876 97045970 96962583 96925998 96855235
2147.7 96855235 96729738 96631920 96581072 96483713 96310282 96158713 96080089 96006131 95906401 95858616 95899403
2170.2 95899403 95938122 95912981 95896024 95934528 95953089 95910501 95882535 95902652 95886832 95792282 95701301 95671320
2194.6 95671320 95639825 95558882 95489752 95473772 95439887 95340681 95251411 95229596 95203698 95111525 95013845 94965810
2219.1 94965810 94905388 94778258 94652021 94590557 94533437 94415075 94289935 94216025 94135761 93996185 93866867
2241.6 93866867 93820500 93806297 93760020 93728399 93761063 93786412 93726003 93627650 93559217 93483102 93353277
2264 93353277 93231022 93181616 93145096 93038619 92904896 92824769 92762429 92644352 92506951 92416668 92331225
2286.4I2331225j53596j87897j47236j25390j61475j60086q2368l6227p5978r7615
2306.8I1103357m1383o569n6958j03819q9580r6596j70820k13999j60188j15460j51747
2329.3H9896238j70738j13147o8611r1738j11496o6525l2812n4538m6379k9039p5328
2351.7H9035887j81878k50113k03776j39148j54840j68884j13195q4836j41185j80888
2372.1H7417144j37347r3681j11628j26910r5272q1736j37043j90288j69313j31648
2392.5H6142278j52058j83445j54114j14143j41686j90550j78790j44649j66928k07234
2412.9H4508681j84947j36626j44332j76257j51980j01608j08516j52708j53279j26952
2433.3H3071476j54197k10899k13683j81263j92011k32947k31826k06548k35587l02720
$$ plain form
2286.4 92331225 92177629 91989732 91842496 91717106 91555631 91395545 91313177 91276950 91200972 91103357
2306.8 91103357 91061974 91055405 90998447 90894628 90805048 90708452 90537632 90323633 90163445 90047985 89896238
2329.3 89896238 89725500 89612353 89543742 89452004 89340508 89273983 89241171 89186633 89140254 89111215 89035887
2351.7 89035887 88854009 88603896 88400120 88260972 88106132 87937248 87824053 87739217 87598032 87417144
2372.1 87417144 87279797 87186116 87074488 86947578 86852306 86770570 86633527 86443239 86273926 86142278
2392.5 86142278 85990220 85806775 85652661 85538518 85396832 85206282 85027492 84882843 84715915 84508681
2412.9 84508681 84323734 84187108 84042776 83866519 83714539 83612931 83504415 83351707 83198428 83071476
2433.3 83071476 82917279 82706380 82492697 82311434 82119423 81886476 81654650 81448102 81212515 80909795
2453.7H0909795l19338k83027k68096k81381k59757k12247k08431k33722k15471j61594
2474.1G8466731j49214j89263k16591k15238k37119k79880k77329k28786k05082k16675
2494.5G6251554k03210j62589j60551k09886k47848k53952k79379l33559l61204l51566
2514.9G3687810l61169m04352m24647m04310l99089m25983m28950l92962l73679l90268
2535.3F9682401l93116l55738l19076l06404k70688j81705p6169J8788J29586K72060
2555.6F8199939L99547M70609N19174N82349O32304O37144O25050O28883O11258N32281
2576G3838538M30423L47042K44969Q9491o9696j70046k25997k76572k86293k08419
2596.4G3713440q4365K6530J29307K33298K90173K58774J80191J14101M8006n0927
$$ plain form
2453.7 80909795 80590457 80307430 80039334 79757953 79498196 79285949 79077518 78843796 78628325 78466731
2474.1 78466731 78317517 78128254 77911663 77696425 77459306 77179426 76902097 76673311 76468229 76251554
2494.5 76251554 76048344 75885755 75725204 75515318 75267470 75013518 74734139 74400580 74039376 73687810
2514.9 73687810 73326641 72922289 72497642 72093332 71694243 71268260 70839310 70446348 70072669 69682401
2535.3 69682401 69289285 68933547 68614471 68308067 68037379 67855674 67779505 67798293 67927879 68199939
2555.6 68199939 68599486 69070095 69589269 70171618 70803922 71441066 72066116 72694999 73306257 73838538
2576 73838538 74268961 74616003 74860972 74950463 74880767 74710721 74484724 74208152 73921859 73713440
2596.4 73713440 73629075 73655605 73784912 74018210 74308383 74567157 74747348 74861449 74909455 74858528
2616.8G4858528j47813j88512j90848k04408k18719j96660j64819j72364k00624k04402
2637.2G2969359j95181k10524k32285k12866j67686j51694j65683j66630j52386j60086
2657.6G1154338j83540j76698j41585j19067r7107k8128Q1933J85406K76500L87210
2678G1339262N07068N86474O17486O38944O60134O45798N88554N35965N04631M50587
2698.4G7074903L60561K75749K04497R9248m2588j58900k23994k65366k86835k52557
2718.8G6784718j59848o2966J1200R3859J89197K52521K65140K58940K47216J90091
2739.2G8070068P3582m9042j45144k38955l34251l94696m06766m01395m01747l78710
2759.6G5392944l12651k55787k45845k49142k43127k59912l14564l66556l86459l93474
$$ plain form
2616.8 74858528 74710715 74522203 74331355 74126947 73908228 73711568 73546749 73374385 73173761 72969359
2637.2 72969359 72774178 72563654 72331369 72118503 71950817 71799123 71633440 71466810 71314424 71154338
2657.6 71154338 70970798 70794100 70652515 70533448 70436341 70408213 70490146 70675552 70952052 71339262
2678 71339262 71846330 72432804 73050290 73689234 74349368 74995166 75583720 76119685 76624316 77074903
2698.4 77074903 77435464 77711213 77915710 78014958 77972370 77813470 77589476 77324110 77037275 76784718
2718.8 76784718 76624870 76561904 76573104 76666963 76856160 77108681 77373821 77632761 77879977 78070068
2739.2 78070068 78143650 78094608 77949464 77710509 77376258 76981562 76574796 76173401 75771654 75392944
2759.6 75392944 75080293 74824506 74578661 74329519 74086392 73826480 73511916 73145360 72758901 72365427
2780G2365427m03571l94046l48092k98160k77680k62916k29377k03818k04247k01762
2800.4F9541758j76465j58119j72663j93381j88321j76782j81341j77377j45120j05893
2820.8F7866296p8661m7546L457N2064O7795O8283Q9133J22112J40458J50430J72383
2843.2F8606204J90860J82587J70141J84107K12473K23082K10935J97899J75512J14876
2863.6G0468676L6329j5694m0746o4224q5645q4573o7997o6174o9355m5962j0246N716
2888.1F9960105J4896N0979J03659J28770J25551J41180J76155J82623J54984J21414
2908.5G1160316P9978M637r2482j62375j97524k28727k62946k76190k41709j60521
2928.9F9622457n8579L4457Q7184Q9550P0667O5905P2074N5212J4537q499l738j2612
$$ plain form
2780 72365427 71961856 71567810 71219718 70921558 70643878 70380962 70151585 69947767 69743520 69541758
2800.4 69541758 69365293 69207174 69034511 68841130 68652809 68476027 68294686 68117309 67972189 67866296
2820.8 67866296 67787635 67740089 67743546 67795610 67863405 67931688 68020821 68142933 68283391 68433821 68606204
2843.2 68606204 68797064 68979651 69149792 69333899 69546372 69769454 69980389 70178288 70353800 70468676
2863.6 70468676 70505005 70489311 70448565 70384341 70298696 70214123 70146126 70079952 70010597 69964635 69954389 69960105
2888.1 69960105 69975001 70025980 70129639 70258409 70383960 70525140 70701295 70883918 71038902 71160316
2908.5 71160316 71240294 71244931 71152449 70990074 70792550 70563823 70300877 70024687 69782978 69622457
2928.9 69622457 69563878 69598335 69685519 69775069 69845736 69911641 69983715 70038927 70053464 70044965 70041227 70028615
2953.4G0028615m0770n0044m4226n3031q0674r9707r6715r9057j13558j16909j00589
2975.8F9133335p3200m3619j3763J7006L0476J0424j3136j6326k3490l7688k4593K2226
3000.3F8967652P2342J07503J39738J67053J56934J01995L9500j1635o5338j20920
3020.7F9554824j56469j59418j44780j18798o4140K9689J46001K36625K74098K71904
3041.1F9869536K19029J14817N2678J55008M00078N91320O07729N25946M27407L19928
3061.5G3283476K16817J16045j7107j88941l34155l35902j35511J63966L64071L62444
3081.9G3495203K18606O5309K9415J47980L09718L70616L07929J79690J4496j51986
3102.2G4986976k23666j48439J5133J82533L28190M44698M91261M61632M09222L84694
$$ plain form
2953.4 70028615 69987845 69937801 69893575 69840544 69759870 69660163 69563448 69464391 69350833 69233924 69133335
2975.8 69133335 69060135 69016516 69002753 69019759 69050235 69060659 69047523 69031197 69007707 68970019 68945426 68967652
3000.3 68967652 69039994 69147497 69287235 69454288 69611222 69713217 69752717 69741082 69675744 69554824
3020.7 69554824 69398355 69238937 69094157 68975359 68911219 68940908 69086909 69323534 69597632 69869536
3041.1 69869536 70088565 70203382 70256060 70411068 70811146 71402466 72010195 72536141 72963548 73283476
3061.5 73283476 73500293 73616338 73599231 73410290 73076135 72740233 72604722 72768688 73132759 73495203
3081.9 73495203 73713809 73779118 73808533 73956513 74266231 74636847 74944776 75124466 75138962 74986976
3102.2 74986976 74763310 74614871 74630004 74812537 75140727 75585425 76076686 76538318 76947540 77332234
3122.6G7332234L93463M03779L99065L93433L91978L90082L97235M10104L99232L54064
3143H1264669L03477K75314K59971K17271J34802O6358L7533k515o8200j22488j71947
3165.5H2194245k53564l66378m81570n87147o75738o98352n77867l24553o8057Q2493
3185.9G8243512J23393R2918K4217j8608L0565J56874K82263L50124L49927K86055
3206.3G9921240J70946N4419M971J7923J9544k0551q3870j65230k64734l66706m48322
3228.7G8839630n05787n71609o66886p59209q24940q88645r70173j057703j140737
3247.1G1453941j224548j290774j310486j285708j236254j167982j073397r79477r33599
3265.4F0951716r41706r69505r91404r95040r68671r27681r24057j016527j207888
$$ plain form
3122.6 77332234 77725697 78129476 78528541 78921974 79313952 79704034 80101269 80511373 80910605 81264669
3143 81264669 81568146 81843460 82103431 82320702 82455504 82521862 82559395 82556880 82488680 82366192 82194245
3165.5 82194245 81940681 81574303 81092733 80505586 79829848 79131496 78553629 78229076 78161019 78243512
3185.9 78243512 78366905 78459823 78484040 78465432 78495997 78652871 78935134 79285258 79635185 79921240
3206.3 79921240 80092186 80146605 80151576 80169499 80189043 80168492 80084622 79919392 79654658 79287952 78839630
3228.7 78839630 78333843 77762234 77095348 76336139 75511199 74622554 73652381 72594678 71453941
3247.1 71453941 70229393 68938619 67628133 66342425 65106171 63938189 62864792 61885315 60951716
3265.4 60951716 60010010 59040505 58049101 57054061 56085390 55157709 54233652 53217125 52009237
3283.8E2009237j423133j583770j664569j682207j659963j616657j559195j441559
3300.1C9378184j189446p78273k55290L18259R05887J472544J971108K370173K670300
3318.4D6863446K865737K942261K913338K813930K670252K505356K337807K179391
3334.8F8091518K036410J904691J763045J595521J425010J254374J070851R14836Q05575
3353.1H0861831O97648N68789M52370L79986L25560K52783J84363J60796J67113J42450
3373.5H4193689Q3494M9150M7785M0740J2856j7130l2365m6486n8359n0002m3923o7663
3398H4111786r1368p8338n6142o6423r3174r5428p5298o7395p7641p1847n0074n3871
3422.5H3234787o5964m6462j9574k0665k1971L612K1905J8621J8483L4296O2079O7794
$$ plain form
3283.8 52009237 50586104 49002334 47337765 45655558 43995595 42378938 40819743 39378184
3300.1 39378184 38188738 37410465 37155175 37473434 38379321 39851865 41822973 44193146 46863446
3318.4 46863446 49729183 52671444 55584782 58398712 61068964 63574320 65912127 68091518
3334.8 68091518 70127928 72032619 73795664 75391185 76816195 78070569 79141420 80056256 80861831
3353.1 80861831 81559479 82128268 82580638 82960624 83286184 83538967 83723330 83884126 84051239 84193689
3373.5 84193689 84277183 84326333 84374118 84414858 84427714 84410584 84378219 84331733 84273374 84223372 84179449 84111786
3398 84111786 84020418 83942080 83885938 83819515 83726341 83630913 83555615 83488220 83410579 83338732 83288658 83234787
3422.5 83234787 83168823 83122361 83102787 83082122 83060151 83063763 83085668 83104289 83122772 83157068 83219147 83286941
3446.9H3286941M3243M5252P9346R6476R3198R7704J08653J17528J30612J35976J16325
3469.4H4351254Q9633Q3649R5630J23799J41447J13214R2417J20431J31988J00613
3489.8H5444075Q8447J16426J38283J33246J46216J72389J39105R0808J06269J38789
3510.2H6714053J49304J41412J31935J51217J84834J90031J48559J09655R5772P0983
3530.6H8087755P1049J33419J81067J79231K19822L00861L05122K00903J30111J57017
3551H9966357J66386J41192J58810K04003K35939K73085L07566K36439Q9759O6429
3571.3I1845965J36245J90901K19089K38073K65032L23266L69513K79093J32632J55985
3591.7I4155794K46221K49952K24251K26563K25902K46530K94024K98023K54989K34020
$$ plain form
3446.9 83286941 83330184 83375436 83454782 83551258 83644456 83742160 83850813 83968341 84098953 84234929 84351254
3469.4 84351254 84440887 84524536 84620166 84743965 84885412 84998626 85091043 85211474 85343462 85444075
3489.8 85444075 85532522 85648948 85787231 85920477 86066693 86239082 86378187 86468995 86575264 86714053
3510.2 86714053 86863357 87004769 87136704 87287921 87472755 87662786 87811345 87921000 88016772 88087755
3530.6 88087755 88158804 88292223 88473290 88652521 88872343 89173204 89478326 89679229 89809340 89966357
3551 89966357 90132743 90273935 90432745 90636748 90872687 91145772 91453338 91689777 91779536 91845965
3571.3 91845965 91982210 92173111 92392200 92630273 92895305 93218571 93588084 93867177 93999809 94155794
3591.7 94155794 94402015 94651967 94876218 95102781 95328683 95575213 95869237 96167260 96422249 96656269
3612.1I6656269K15161K10440K13402J08677K3258J28490L00646L00383N9277l2729
3632.5I8183274L6967O7246P2545R9546J62291K78246L80767K58136r1851j93524o8158
3655I9185485j3125l5328j9628J5873R1398K00039K00242O0564K4986l0130k37131
3677.4I9443245k57909j23370M5031K17629K98923J27870j40202j62721o0320J6713
3697.8I9404889O1316J9586o6901p087J53101J93542m762j70207r9802J6182N3060
3720.2I9552917K3467k1368n1862j3096J21588K40588J47766j01024j88094l1340J19054
3742.7I9798596Q5837L612N7834m143j94740j63603k9051j2410o8879k4527O6239P2372
3767.1I9587137N447q9055j03366Q04R9087P1603k6047m7255m7791n9968j8799M4763
$$ plain form
3612.1 96656269 96871430 97081870 97295272 97403949 97427207 97555697 97856343 98156726 98216003 98183274
3632.5 98183274 98220241 98287487 98360032 98459578 98621869 98900115 99280882 99539018 99447167 99253643 99185485
3655 99185485 99172360 99137032 99117404 99133277 99224675 99424714 99624956 99685520 99710506 99680376 99443245
3677.4 99443245 99185336 99061966 99106997 99324626 99623549 99751419 99611217 99448496 99388176 99404889
3697.8 99404889 99466205 99485791 99418890 99411803 99564904 99758446 99753684 99583477 99483675 99499857 99552917
3720.2 99552917 99576384 99555016 99503154 99490058 99611646 99852234 100000000 99898976 99710882 99679542 99798596
3742.7 99798596 99884433 99888045 99945879 99941736 99746996 99583393 99554342 99541932 99473053 99448526 99514765 99587137
3767.1 99587137 99592584 99503529 99400163 99400967 99500054 99571657 99545610 99498355 99450564 99390596 99371797 99416560
3791.6I9416560R6166J28073J29389J12397Q833j00064q3876j03885j03062K7281J58072
3814.1I9685884J61260R5379M0317j11968j71518p6061j014N9790J06478J17898R3555
3836.5A00000000m274j05172j29718j25438m7612J23853K62606J38575k04951k26712
3856.9I9681157o3443O9135J18476N8043K1315K3228m0364r7841r9493k3388Q5562
3879.3I9732387Q0144K3276k1154o7615k5797m41l5793K5022J40006J49965M6623r3270
3903.8I9953353j69706j34540m2456L9429R6535J00076L1490k3383n561J2958K610
3926.2I9860805K5898O1161J6904n9980n3400J5646O2144M7999K2823M2975N1391M685
3950.7A00099051k3150l601J9932L6288M3392K9409J2421J5569K7561L3188L1006K7061
$$ plain form
3791.6 99416560 99512726 99640799 99770188 99882585 99891418 99791354 99707478 99603593 99500531 99527812 99685884
3814.1 99685884 99847144 99942523 99982840 99870872 99699354 99623293 99622279 99682069 99788547 99906445 100000000
3836.5 100000000 99995726 99890554 99760836 99635398 99587786 99711639 99974245 100112820 99907869 99681157
3856.9 99681157 99617714 99686849 99805325 99863368 99884683 99907911 99867547 99769706 99670213 99646825 99732387
3879.3 99732387 99812531 99835807 99814653 99747038 99721241 99720800 99685007 99710029 99850035 100000000 100046623 99953353
3903.8 99953353 99783647 99649107 99606651 99646080 99742615 99842691 99874181 99850798 99845237 99858195 99860805
3926.2 99860805 99886703 99947864 99964768 99904788 99851388 99867034 99929178 99977177 100000000 100042975 100094366 100099051
3950.7 100099051 100075901 100072300 100092232 100128520 100171912 100201321 100213742 100229311 100256872 100290060 100321066 100348127
3975.2A00348127K8419K9183K1517J0491L743K217O628K0313L2270K7168J0800
3997.6A00540876
$$ plain form
3975.2 100348127 100376546 100405729 100427246 100437737 100441480 100443697 100450325 100470638 100502908 100530076 100540876
3997.6 100540876
##END=$$ End of the data block
