##TITLE=Ac. Salicilico $$ Begin of the data block
##JCAMP-DX=5.00 $$ ACD/SpecManager v 10.08
##SPECTROMETER/DATA SYSTEM=Alpha
##DATE=25 Jun 2015 13:07:00
##DATA TYPE=INFRARED SPECTRUM
##DATA CLASS=XYDATA
##ORIGIN=
##OWNER=
##NPOINTS=1765
##FIRSTX=399.76428223
##LASTX=3997.64306641
##MAXX=3997.64306641
##MINX=399.76428223
##MAXY=0.83669543
##MINY=0.45732367
##XFACTOR=1.0000000000
##YFACTOR=1.000000000000000e-9
##FIRSTY=0.83162355
##DELTAX=2.03961372
##XUNITS=1/CM
##YUNITS=ARBITRARY UNITS
##XYDATA=(X++(Y..Y))
399.8H31623554k371907j620352K1875r18627k852559k077341n29945j043737j831830
$$ 831623554 829251647 827631295 827653170 826734543 823881984 821804643 821274698 820230961 818399131
418.1H18399131j399755k022088m088342m610300l142655j775086J37210K580702K106846
$$ 818399131 816999376 814977288 810888946 806278646 803135991 801360905 801498115 804078817 806185663
436.5H06185663j612246l643215k494991k541661m842341n510986n377769p766545
$$ 806185663 804573417 800930202 798435211 795893550 791051209 785540223 780162454 772395909
452.8G72395909j0366023j1775076j4658570j7761171j5057564j511753J8237770L1789482
$$ 772395909 762029886 750254810 735596240 717835069 702777505 701265752 719503522 751293004
469.1G51293004L3004283K4556339J1703968K859831J316190J459420r99570k443910
$$ 751293004 784297287 808853626 820557594 823417425 824733615 826193035 825193465 822749555
485.4H22749555p00891l86655k558589k540112o46710j393199l296018k388477j160026
$$ 822749555 822048664 821662009 819103420 816563308 815916598 814523399 811227381 808838904 807678878
503.8H07678878k868056m208684k711952k135932l589034l532946k601445m951954
$$ 807678878 804810822 800602138 797890186 795754254 792165220 788632274 786030829 781078875
520.1G81078875r945452j4298856j9436896k8495968l2678783q637726L1406343M0216446
$$ 781078875 771133423 756834567 737397671 708901703 676222920 667585194 698991537 739207983
536.4G39207983K2615671J3436973J1537552O779373K239108K72095j927674m380285
$$ 739207983 761823654 775260627 786798179 793577552 795816660 796088755 794161081 789780796
552.7G89780796m607559m544139p102668j0452866j2343228j2407601p435084L076435
$$ 789780796 785173237 780629098 773526430 763073564 750730336 738322735 730887651 733964086
569.1G33964086J0739445R478867M300952K012492K498090K161383J256645J976729
$$ 733964086 744703531 754182398 758483350 760495842 762993932 765155315 766411960 768388689
585.4G68388689K424836N20229j037121l52919n40018k855658l871859k240955j054407
$$ 768388689 770813525 771333754 770296633 769943714 769403696 766548038 762676179 760435224 759380817
603.7G59380817j168668J41204K243340J890659Q7738K05696J365423Q93533M5300
$$ 759380817 758212149 758353353 760596693 762487352 762575090 762780786 764146209 765039742 765085042
622.1G65085042N48481J96994k165795l548026l233313m364491p235348q462012p886231
$$ 765085042 765633523 765830517 763664722 760116696 756883383 752518892 745283544 736821532 728935301
640.4G28935301q469402j0536016j2566685j5144110j8109798j9700468k1545589k4390280
$$ 728935301 720465899 709929883 697363198 682219088 664109290 644408822 622863233 598472953
656.8E98472953j5682459J6222179M9462318N1770866L5745144J7560840J430213o384253
$$ 598472953 582790494 599012673 648474991 700245857 735991001 753551841 754982054 748597801
673.1G48597801j0516405j1260748j1412442j4037073j7054200j8187821j9009828
$$ 748597801 738081396 726820648 715408206 701371133 684316933 666129112 647119284
687.3F47119284k0150721j9172967j4998317r222626r54032J3022303K8517187L4044683
$$ 647119284 626968563 607795596 592797279 583574653 582620621 595642924 624160111 658204794
703.7F58204794K9149532K3585379K0053745J5608370J0976970Q606970P318557N063474
$$ 658204794 687354326 710939705 730993450 746601820 757578790 766185760 773504317 778567791
720G78567791L065824K637446J849831k52426j309574q88467j718521l957569n256355
$$ 778567791 781633615 784271061 786120892 785868466 784558892 783670425 781951904 777994335 772737980
738.3G72737980o500006j0725260j8025457k6869119l5834193m2091668m4644951m5222938
$$ 772737980 766237974 755512714 737487257 710618138 674783945 632692277 588047326 542824388
754.7E42824388m0262223j9544124J7890155N2594721O3330651N0815761L2530844
$$ 542824388 502562165 483018041 500908196 553502917 616833568 667649329 700180173
768.9G00180173J9706786J1072754L794730k065122p902980j4846265j6099453j205146
$$ 700180173 719886959 730959713 734754443 732689321 724786341 709940076 693840623 692635477
785.3F92635477K3946166L7359297L1650841J9276977Q698225N08666l645897l780186
$$ 692635477 716581643 753940940 785591781 804868758 813566983 814075649 810429752 806649566
801.6H06649566k821029p63118K470136L747821K150416K00927R2626P98285k5511
$$ 806649566 803828537 803065419 805535555 809283376 811433792 811634719 811727345 812525630 812500119
819.9H12500119j388550j144409o64472j849831k972304k440691k160848l450393m478336
$$ 812500119 811111569 809967160 809302688 807452857 804480553 802039862 799879014 796428621 791950285
838.3G91950285m659116o469548j0870516j6183197k2390962k5491536j0647416J7063678
$$ 791950285 787291169 780821621 769951105 753767908 731376946 705885410 695237994 712301672
854.6G12301672K5511622J0497749l957093r728134j2009978r046495J320660P049740
$$ 712301672 737813294 748311043 744353950 734625816 722615838 713569343 714890003 721939743
870.9G21939743J536428m892468o706297o800354p355511q038879p202863n111456
$$ 721939743 723476171 718583703 711877406 705077052 697721541 689682662 682479799 677368343
887.2F77368343l453910j827300J146436M534721O652892Q072614R844125J0577500
$$ 677368343 673914433 672087133 673233569 677768290 684421182 692493796 702337921 712915421
903.5G12915421R049296O972670N855978M641712L077447L136456M905224N905628
$$ 712915421 721964717 728937387 734793365 739435077 742512524 745648980 750554204 756459832
919.9G56459832N567432N637109N943298M883528L292084L027200L132284J932740
$$ 756459832 762027264 767664373 773607671 778491199 781783283 784810483 787942767 789875507
936.2G89875507P61271J052439J117945j99497r33826l05355k62260j178980j142442
$$ 789875507 790636778 791689217 792807162 792607665 791673839 791368484 791106224 789927244 788784802
954.5G88784802m15683j762211o303787r907246n219996M560232Q138657N322099K047896
$$ 788784802 788369119 786606908 780303121 770395875 765175879 769736111 777874768 783196867 785244763
972.9G85244763m15742j533390r98795n26309j070678j311958r01103j851499m409194
$$ 785244763 784829021 783295631 782296836 781770527 780699849 779387891 778486788 776635289 772226095
991.3G72226095m467189m66764K071977Q09311l45826m02808j106799j880288j561522
$$ 772226095 767758906 767292142 769364119 770173430 769827604 769424796 768317997 766437709 764876187
1009.6G64876187j227260j914024k558649k431869k827347m496455o755709j0646880
$$ 764876187 763648927 761734903 759176254 756744385 753917038 749420583 742664874 732017994
1025.9G32017994j7396033j7504215L44872K0933271K2739351J2601137N142748J858890
$$ 732017994 714621961 697117746 697462618 718395889 741135240 753736377 758879125 760738015
1042.2G60738015k84374j693964j820683j765132k471089k873779k230346j714706
$$ 760738015 760453641 758759677 756938994 755173862 752702773 749828994 747598648 745883942
1058.6G45883942j871646j646697q39949o45399j154959j150251p17103j164198k393603
$$ 745883942 744012296 742365599 741525650 740880251 739725292 738575041 737857938 736693740 734300137
1076.9G34300137l294111m086375n213022n937100n140423Q41736J0852397J2908757
$$ 734300137 731006026 726919651 721706629 715769529 710629106 711470842 722323239 735231996
1093.2G35231996N340635q38101k736032k955734k631486k825498l552497l766835
$$ 735231996 740572631 739734530 736998498 734042764 731411278 728585780 725033283 721266448
1109.6G21266448l531575l826916m448831m617512m670263n415558o265223o270051
$$ 721266448 717734873 713907957 709459126 704841614 700171351 694755793 688490570 682220519
1125.9F82220519n607665m762053l684044k837181l327668n090356p054210r150624
$$ 682220519 676612854 671850801 668166757 665329576 662001908 656911552 649857342 640706718
1142.2F40706718j0082722q838534j1143386j8861473k5993645k5491655m230976L2896399
$$ 640706718 630623996 621785462 610642076 591780603 565786958 540295303 536064327 568960726
1158.5E68960726N0653219L5986007J3616919M81665o098389r696782j1153340j1669994
$$ 568960726 619613945 655599952 669216871 669698536 663600147 653903365 642750025 631080031
1174.8F31080031j1992216j1844873j1215150j0610879r582400o771028k494395J49727
$$ 631080031 619087815 607242942 596027792 585416913 575834513 569063485 566569090 566718817
1191.1E66718817j038492m411519p416188r485781j0958851j2136578j3209522j2818575
$$ 566718817 565680325 561268806 553852618 544366837 533407986 521271408 508061886 495243311
1207.5D95243311o651431Q081555K4079353K8713405K0426869Q768976N76317l575206
$$ 495243311 488591880 496673435 520752788 549466193 569893062 578662038 579238355 575663149
1223.8E75663149m887879m931926n337179o186545o278276n402029n063236o652414
$$ 575663149 570775270 565843344 560506165 554319620 548041344 542639315 537576079 530923665
1240.1E30923665r257555j0885239r844840l735095P625431K0408332L0959606L6837519
$$ 530923665 521666110 510780871 500936031 497200936 504826367 525234699 556194305 593031824
1256.4E93031824L6066770K9667199K1671891J5053451R477735M033208n23448l605605
$$ 593031824 629098594 658765793 680437684 695491135 704968870 709002078 708478630 704873025
1272.7G04873025o463348j0372043j4698207j8322766k1182478k3191929k3115158
$$ 704873025 698409677 688037634 673339427 655016661 633834183 610642254 587527096
1287E87527096j9658565j3885856q769274m743576Q02219P592678J1228979J0374546
$$ 587527096 567868531 553982675 545213401 540469825 541272044 548864722 560093701 570468247
1303.3E70468247R901643J4466524K2799313K9567361K9838383K1981001Q540273o075085
$$ 570468247 580369890 594836414 617635727 647203088 677041471 699022472 707562745 701487660
1319.6G01487660j5839517j5052497m480302Q081793J5271485J6067624J3726890J1149884
$$ 701487660 685648143 670595646 666115344 674197137 689468622 705536246 719263136 730413020
1336G30413020R132981P600307O497086N472421M019022K353430J265943O54817J8596
$$ 730413020 739546001 747146308 753643394 759115815 763134837 765488267 766754210 767409027 767427623
1354.3G67427623o13868j050353j800954l373266m943430n819619o641865p334411
$$ 767427623 766813755 765763402 763962448 760589182 755645752 749826133 743184268 735849857
1370.6G35849857p629335p777929p436633o845891n797089l058493J673818O650805
$$ 735849857 728220522 720442593 713005960 706160069 700362980 697304487 698978305 705629110
1386.9G05629110Q529485O699383L679156N70536k026200m137457n532980n139351
$$ 705629110 714158595 720857978 724537134 725107670 723081470 718944013 713411033 708271682
1403.3G08271682l337323j636029j572251l109038n262315p255733r435773j1749268
$$ 708271682 704934359 703298330 701726079 698617041 693354726 686098993 676663220 664913952
1419.6F64913952j1683762j1461138j2376786j2632072j3057530j3013601j2501061
$$ 664913952 653230190 641769052 629392266 616760194 603702664 590689063 578188002
1433.9E78188002j5034854j8335045j6710639j3092041o744623M562616J9209326L0479669
$$ 578188002 563153148 544818103 528107464 515015423 508270800 512833416 532042742 562522411
1450.2E62522411L1647981K3745596J1536837j341761p343411p935524o760716q34108
$$ 562522411 594170392 617915988 629452825 628111064 620767653 612832129 606071413 605237305
1466.5F05237305P688940J2940883J1729837P01904j4592409k9505551m1993916l7597418
$$ 605237305 612926245 625867128 637596965 638298869 623706460 594200909 552206993 514609575
1482.8E14609575m879534L6506951N9343397N4368735L5676300K3657263J9149065
$$ 514609575 509730041 546236992 605580389 659949124 695625424 719282687 738431752
1497.1G38431752J4640927J0014057P449210P780135R037971P075489N754530N693913
$$ 738431752 753072679 763086736 770535946 778316081 787354052 794429541 800184071 805877984
1513.4H05877984M469573K171278k60591l179968n987823n294263n55337L776491L387094
$$ 805877984 810347557 812518835 812258244 809078276 803090453 797796190 797240853 801017344 804404438
1531.8H04404438j95861k716959m034579p478177q777738m824757j966775k076447
$$ 804404438 804208577 801491618 797457039 789978862 781201124 776376367 774409592 772333145
1548.1G72333145l828704n168021n628943n315125o351412q356869o627679n710542
$$ 772333145 768504441 763336420 757707477 752392352 746040940 737684071 731056392 725345850
1564.4G25345850n775273n891621o882191p179200p969737r569228o022155J007914
$$ 725345850 719570577 713678956 706796765 699617565 691647828 682078600 676056445 677064359
1580.7F77064359O573856Q070111N873144L009558Q5115l716588q250654j2305319
$$ 677064359 683638215 691708326 697581470 700591028 700676143 696959555 688708901 676403582
1597F76403582j5589118j8750191k1834135k4137854k5175214k3620546j7320871o440163
$$ 676403582 660814464 642064273 620230138 596092284 570917070 547296524 529975653 523535490
1613.4E23535490Q300066K3176312K6244104K3790718K1929383J5290499P594883K208471
$$ 523535490 531835556 555011868 581255972 605046690 626976073 642266572 649861455 652069926
1629.7F52069926j364827l869176p128358q738219q796990j0019064j2085080j6971469
$$ 652069926 650705099 646835923 639707565 630969346 622172356 612153292 600068212 583096743
1646E83096743k1096707j8869579k2172510k8495431j8477380r827465n576223j257778
$$ 583096743 562000036 543130457 520957947 492462516 473985136 464157671 458581448 457323670
1662.3D57323670K375305M673332O852388Q423210P689386P270605P446020P491053
$$ 457323670 459698975 464372307 471224695 479647905 487337291 494607896 502053916 509544969
1678.6E09544969Q448720J1275887J5064061J3623178J1308014J2048245J2714207
$$ 509544969 517993689 529269576 544333637 557956815 569264829 581313074 594027281
1692.9E94027281J4753222J6074419J5971482J7724216J4994621J2257636J1403143
$$ 594027281 608780503 624854922 640826404 658550620 673545241 685802877 697206020
1707.2F97206020R238005P514656O706714O824494P225394O233692N535424O316900
$$ 697206020 706444025 713958681 720665395 727489889 734715283 740948975 746484399 752801299
1723.5G52801299O647229N817354N281389N279541N469918M430056L294766L082275
$$ 752801299 759448528 765265882 770547271 775826812 781296730 785726786 789021552 792103827
1739.8G92103827K085328P79629M23252M60148K17676O46949K296686L818870L884912
$$ 792103827 794189155 794968784 795392036 795852184 796069860 796716809 799013495 802832365 806717277
1758.2H06717277L235280K975106K365887J633347J577377J950383J680791Q97885
$$ 806717277 809952557 812927663 815293550 816926897 818504274 820454657 822135448 823033333
1774.5H23033333J043975J791120J788378J244962J162231J145899P24614M09782M82082
$$ 823033333 824077308 825868428 827656806 828901768 830063999 831209898 831934512 832344294 832826376
1792.8H32826376M62830K24829J75297L21448n484n52237l76820K91288L37302j06931
$$ 832826376 833289206 833514035 833689332 834010780 834005296 833453059 833076239 833367527 833704829 833597898
1813.2H33597898q583K26856k03014p26640o25491o02126j168728j443625l94046J022875
$$ 833597898 833589315 833816171 833613157 832886517 832261026 831658900 830490172 829046547 828652501 829675376
1833.6H29675376J285792J080453J427114J656294J021385L22223K26796j23918p31647
$$ 829675376 830961168 832041621 833468735 835125029 836146414 836468637 836695433 836571515 835839868
1852H35839868p44582n79893j153589j866936j581609n79417J30474M86374Q54671
$$ 835839868 835095286 834515393 833361804 831494868 829913259 829333842 829464316 829950690 830805361
1870.3H30805361Q56102L60071J90139O25432P59661M34279N35250R54390O79970l4750
$$ 830805361 831661463 832021534 832211673 832837105 833596766 834031045 834566295 835520685 836200655 836165905
1890.7H36165905m3392K40743j35541n51999k48611K3485l83199p30931n54085o14584
$$ 836165905 836122513 836363256 836227715 835675716 835427105 835450590 835067391 834336460 833782375 833167791
1911.1H33167791j145124j299083j110435j296818j277864j39833J266718J427591
$$ 833167791 832022667 830723584 829613149 828316331 827038467 826898634 828165352 829592943
1927.5H29592943O96063L39091K82586j95384o15538l80039k97725r70900j478791
$$ 829592943 830289006 830628097 830910683 830715299 830099761 829719722 829421997 828451097 826972306
1945.8H26972306j419544j498759j482606l71874J218260J649499J038134O06775M23789
$$ 826972306 825552762 824054003 822571397 822199523 823417783 825067282 826105416 826712191 827135980
1964.2H27135980j54793q44121r67085r92060j621187k485156l063202l316223k345384
$$ 827135980 826981187 826137066 825169981 824177921 822556734 820071578 817008376 813692153 811346769
1982.5H11346769P01964L757417L980220K040565M31180j29938m27783p28667n25653
$$ 811346769 812048733 815806150 819786370 821826935 822258115 822128177 821700394 820971727 820446074
2000.9H20446074M172R4354j72913j60575k443j01447j49966J07467J81616k20180
$$ 820446074 820450246 820544600 820371687 820211112 820208669 820107222 819957256 820064723 820246339 820026159
2021.3H20026159o21974m87447K7239J98782R6142J57178N0246k95222m08530l00765
$$ 820026159 819404185 818916738 818943977 819142759 819238901 819396079 819446325 819151103 818742573 818441808
2041.7H18441808m03166o78360p30753o49631q44181j154840j221001j217007j310707
$$ 818441808 818038642 817360282 816629529 815979898 815135717 813980877 812759876 811542869 810232162
2060H10232162j217782q86500p73787r83715j073838q92162p91371q07226n23984j9193
$$ 810232162 809014380 808127880 807354093 806370378 805296540 804404378 803613007 802805781 802281797 802262604
2080.4H02262604J55688n2214k51830l80397n56409n10514O9559Q54492J242936J122117
$$ 802262604 802418292 802366078 802114248 801733851 801177442 800666928 800736487 801590979 802833915 803956032
2100.8H03956032P56919K54572l05474n67913l62933l1471J62601L32773M63903L83437
$$ 803956032 804712951 804967523 804662049 804094136 803731203 803699732 803862333 804195106 804659009 805042446
2121.2H05042446J97470J79171K52307J17540j68264l17752l49820m80890o21498n72145
$$ 805042446 805239916 805419087 805671394 805788934 805620670 805302918 804953098 804472208 803850710 803278565
2141.6H03278565m32014l84450l73125k71916k02597l19659m52102m41312m42863n61356
$$ 803278565 802846551 802462101 802088976 801817060 801614463 801294804 800842702 800401390 799958527 799397171
2162G99397171o44684o10829n69582m63426j97351Q8990K55406K92361L12149L78728
$$ 799397171 798752487 798141658 797572076 797108650 796911299 797000289 797255695 797548056 797860205 798238933
2182.4G98238933L67105K38776J30654O0260q6486k49386k66135k37644l39150m36962
$$ 798238933 798606038 798844814 798975468 799035728 798949242 798699856 798433721 798196077 797856927 797419965
2202.8G97419965l99291l85106m67062m98533m25160l74317m24624m45187l60489l41296
$$ 797419965 797020674 796635568 796168506 795669973 795244813 794870496 794445872 794000685 793640196 793298900
2223.2G93298900m46975n13911n20230n83589o94036p56085p50721o75559m44114j25408
$$ 793298900 792851925 792338014 791817784 791234195 790540159 789784074 789033353 788357794 787913680 787788272
2243.6G87788272k6345k62857n34952n79357n02586m20690k38716l2425m1902k37107
$$ 787788272 787761927 787499070 786964118 786384761 785882175 785461485 785222769 785190344 785148442 784911335
2264G84911335l72530l81469l87311m17412m12225l95716m54187n45502n40912m96745
$$ 784911335 784538805 784157336 783770025 783352613 782940388 782544672 782090485 781544983 781004071 780507326
2284.4G80507326n40316o03437n72741n10812m90368m39047l30329k86758l43562m10079
$$ 780507326 779967010 779363573 778790832 778280020 777789652 777350605 777020276 776733518 776389956 775979877
2304.8G75979877m57347n01454n21064m98831m82499n74768p74205r11295q80838p20858
$$ 775979877 775522530 775021076 774500012 774001181 773518682 772943914 772169709 771258414 770377576 769656718
2325.2G69656718n72324n67675o27339o38902o30200n62489m51207m50194n45680n13733
$$ 769656718 769084394 768516719 767889380 767250478 766620278 766057789 765606582 765156388 764610708 764096975
2345.6G64096975l09586k99394o02305q79407p92980o64294p47144q01862p62462p34747
$$ 764096975 763787389 763487995 762885690 762006283 761213303 760549009 759801865 759000003 758237541 757502794
2366G57502794p08937o40750o31273p15137p10129n84782m79161l88265k46525j64926
$$ 757502794 756793857 756153107 755521834 754806697 754096568 753511786 753032625 752644360 752397835 752232909
2386.4G52232909k59757m07219m21047l58760m02928m97043m87983m92275o13272o87361
$$ 752232909 751973152 751565933 751144886 750786126 750383198 749886155 749398172 748905897 748292625 747605264
2406.8G47605264o65307p27773q87632q95560p30455o91712q02397q09074p44104q10027
$$ 747605264 746939957 746212184 745324552 744428992 743698537 743006825 742204428 741395354 740651250 739841223
2427.2G39841223q93593p88927o55592p01904p63953o98924o91235q18550q85010q35776
$$ 739841223 738947630 738158703 737503111 736801207 736037254 735338330 734647095 733828545 732943535 732107759
2447.6G32107759q50559r42290r12666p90298p96735q78811q26657p37727p97629q58784
$$ 732107759 731257200 730314910 729402244 728611946 727815211 726936400 726109743 725372016 724574387 723715603
2467.9G23715603p69674o89447p39038p62403o67334o34551p21991p48813p04468p40528
$$ 723715603 722945929 722256482 721517444 720755041 720087707 719453156 718731165 717982352 717277884 716537356
2488.3G16537356q24511q53121q72910r70125j119435j223028j328468j518011j649261
$$ 716537356 715712845 714859724 713986814 713016689 711897254 710674226 709345758 707827747 706178486
2506.7G06178486j656770j709462j814842j804054j704454j673460j668811j553833
$$ 706178486 704521716 702812254 700997412 699193358 697488904 695815444 694146633 692592800
2523F92592800j351476j155138r49681o65247l33429j6689K97606N72681O46830M47810
$$ 692592800 691241324 690086186 689136505 688471258 688137829 688121140 688418746 688991427 689638257 690086067
2543.4F90086067J59502p4089k91765m57704n23746n55753n98014o05881m99904k67804
$$ 690086067 690245569 690171480 689879715 689422011 688898265 688342512 687744498 687138617 686638713 686370909
2563.8F86370909O855K16484K31445r716l33607n30541o89030r82344j304686j448989
$$ 686370909 686377764 686594248 686825693 686815977 686482370 685951829 685262799 684280455 682975769 681526780
2584.2F81526780j357496j082301o94036k43843J99020N21541O27100N41091M02928
$$ 681526780 680169284 679086983 678392947 678149104 678348124 678869665 679496765 680037856 680440784
2602.6F80440784K95579K41041L29316N61356Q32618J124620J426697J669884J790285
$$ 680440784 680736363 680977404 681306720 681868076 682700694 683825314 685252011 686921895 688712180
2620.9F88712180J784742J741468J713276J654268J600384J580477J405299J018166
$$ 688712180 690496922 692238390 693951666 695605934 697206318 698786795 700192094 701210260
2637.2G01210260O36995L69370J41800o6400j69694j27793n2809o4791j39773k30610
$$ 701210260 701847255 702216625 702358425 702292025 702122331 701994538 701941729 701876938 701737165 701506555
2657.6G01506555l46720m27663m02630l30865k91586k49028j67311j29938j53124j56224
$$ 701506555 701159835 700732172 700329542 699998677 699707091 699458063 699290752 699160814 699007690 698851466
2678F98851466j97887l55363n50985o90639p78795q68976r18329q36432o92606n98669
$$ 698851466 698653579 698298216 697747231 697056592 696277797 695408821 694490492 693654060 692961454 692362785
2698.4F92362785n14507m19915l95953m01020l46482k92182l02017l06368k49088j79112
$$ 692362785 691848278 691428363 691032410 690631390 690284908 689992726 689690709 689384341 689135253 688956141
2718.8F88956141j33752o0320R0897K57611L92318N52595O93380O79016M81427K15590
$$ 688956141 688822389 688762069 688852966 689110577 689502895 690055490 690748870 691427886 691909313 692124903
2739.2F92124903l159k05040m22299n89013o89804p30575o58929n28455n05805n90264
$$ 692124903 692121744 691916704 691494405 690905392 690215588 689485013 688826084 688297629 687791824 687201560
2759.6F87201560o78957p74264r00090j014531j066863j093269j194834j381815j506448
$$ 687201560 686522603 685748339 684848249 683833718 682766855 681673586 680478752 679096937 677590489
2778F77590489j473963j366436j241088j051426q29339o94096o04987m73083m09960
$$ 677590489 676116526 674750090 673509002 672457576 671628237 670934141 670329154 669856071 669446111
2796.3F69446111n37575p93337j061142j284301j411021j438975j468659j513302j495004
$$ 669446111 668908536 668115199 667054057 665769756 664358735 662919760 661451101 659937799 658442795
2814.7F58442795j420021j329541j261532j221955j183629j145482j108349j076042
$$ 658442795 657022774 655693233 654431701 653209746 652026117 650880635 649772286 648696244
2831F48696244j039803r63152q92639r92894j226544j324058j278341j272917j269936
$$ 648696244 647656441 646693289 645800650 644807756 643581212 642257154 640978813 639705896 638435960
2849.3F38435960j137555r12130o76632m03642j34945L2842J86086M17471O41286P84814
$$ 638435960 637298405 636386275 635709643 635306001 635171056 635203898 635389984 635807455 636448741 637233555
2869.7F37233555R05276R67621Q96574Q22126Q36313Q53598P92086O81699O08027N40495
$$ 637233555 638138831 639106452 640003026 640825152 641661465 642515063 643307149 643988848 644596875 645137370
2890.1F45137370L99351K54988K01643J87993R3698j07884l55482o62565r82881j116931
$$ 645137370 645536721 645791709 645993352 646181345 646275043 646167159 645811677 645149112 644166231 643049300
2910.5F43049300j027167q95143p87794o41406m71175l32057k12550m5061J48594K49147
$$ 643049300 642022133 641126990 640339196 639697790 639226615 638894558 638682008 638636947 638785541 639034688
2930.9F39034688K70606K72214J60813j08480l73066n11586o37710p83682p44760n16177
$$ 639034688 639305294 639577508 639738321 639629841 639256775 638745189 638107479 637323797 636579037 636062860
2951.3F36062860m19020n50807p00771q34048r94623j091063j082838j032352j022518
$$ 636062860 635643840 635093033 634392262 633558214 632563591 631472528 630389690 629357338 628334820
2969.7F28334820j045763j052916j083195j142443j168370j190305j248777j285374
$$ 628334820 627289057 626236141 625152946 624010503 622842133 621651828 620403051 619117677
2986F19117677j235187j104593j054645j161217j195789j139164j128733j053035q97706
$$ 619117677 617882490 616777897 615723252 614562035 613366246 612227082 611098349 610045314 609147608
3004.4F09147608p06672m21167j36494m8042j90973l67165l96728k58982j3411J51157
$$ 609147608 608440936 608019769 607883275 607835233 607644260 607277095 606880367 606621385 606607974 606759131
3024.7F06759131J78814K85447M31895L79205P2240k41398k73884k71678n12242p78556
$$ 606759131 606937945 607223392 607655287 608034492 608106732 607865334 607591450 607319772 606807530 606028974
3045.1F06028974q13127n90682l58939k55108j72317j73270k12133j34111k1219J79827
$$ 606028974 605215847 604625165 604266226 604011118 603838801 603665531 603453398 603319287 603298068 603477895
3065.5F03477895N33223R06408J293063J660288J836300J630544J100481Q57115J158654
$$ 603477895 604011118 604917526 606210589 607870877 609707177 611337721 612438202 613295317 614453971
3083.9F14453971J420856J403510J299978J104653Q99434Q50677R33886R18090O94454
$$ 614453971 615874827 617278337 618578315 619682968 620582402 621433079 622366965 623285055 623979509
3102.2F23979509N75900P83861R47654P67827O68108Q96991J014113Q20875N73159
$$ 623979509 624555409 625339270 626286924 627054751 627722859 628619850 629633963 630454838 631027997
3120.6F31027997M71472M99964N58376O40393P14183O98983O82652Q11279R04441P37667
$$ 631027997 631499469 631999433 632557809 633198202 633912385 634611368 635294020 636105299 637009740 637747407
3141F37747407N79536O50883P66694Q38757Q93354Q15928O20484N27919N81682O39736
$$ 637747407 638326943 638977826 639744520 640583277 641476631 642292559 642913043 643440962 644022644 644662380
3161.4F44662380N97239N07176M92513N05626L79324J60337M9471L5584l2842j57833
$$ 644662380 645259619 645766795 646259308 646764934 647144258 647304595 647354066 647389650 647356808 647198975
3181.8F47198975k36273k94625l96491m87804m98533n16951o01113o61969p66278j025557
$$ 647198975 646962702 646668077 646271586 645783782 645285249 644768298 644167185 643505216 642738938 641713381
3202.2F41713381j341343j602590j838327k057254k227068k361059k512634k725661
$$ 641713381 640372038 638769448 636931121 634873867 632646799 630285740 627773106 625047445
3218.5F25047445k877474k855777k760768k646864k394437j970411j491070j047730
$$ 625047445 622169971 619314194 616553426 613906562 611512125 609541714 608050644 607002914
3234.8F07002914n53906J12236Q48412J534164K197444K773464L159702L445089L746211
$$ 607002914 606449008 606561244 607409656 608943820 611141264 613914728 617074430 620519519 624265730
3253.2F24265730L996432M076719M108489M231513M329085M308820M261493M223049
$$ 624265730 628262162 632338881 636447370 640678883 645007968 649316788 653578281 657801330
3269.5F57801330M023790L717840L535509L436268L345787L263056L161014L070712
$$ 657801330 661825120 665542960 669078469 672514737 675860524 679123580 682284594 685355306
3285.8F85355306K978384K837956K622545K319038J981556J666248J429260J268864
$$ 685355306 688333690 691171646 693794191 696113229 698094785 699761033 701190293 702459157
3302.1G02459157J090884Q44180O09756M87506L74735J95026R3043P4148k4140j83701
$$ 702459157 703550041 704394221 705003977 705491483 705866218 706061244 706154287 706228435 706204295 706020594
3322.5G06020594k94268l54589m01854m77672n82456o85275p92444q75949r42767j039148
$$ 706020594 705726326 705371737 704969883 704492211 703909755 703224480 702432036 701556087 700613320 699574172
3342.9F99574172j094520j075565j093150j191675j247108j206517j193107j270651
$$ 699574172 698479652 697404087 696310937 695119262 693872154 692665637 691472530 690201879
3359.2F90201879j384318j445234j423955j406252j452566j515865j511633j429677
$$ 690201879 688817561 687372327 685948372 684542120 683089554 681573689 680062056 678632379
3375.5F78632379j352847j319826j291752j245379j148343r62436p91610q10325r23514
$$ 678632379 677279532 675959706 674667954 673422575 672274232 671311796 670520186 669709861 668786347
3393.9F68786347q77082p16329o72936q30412r61781q59857p43091p61330p86662p84039
$$ 668786347 667909265 667192936 666520000 665689588 664727807 663867950 663124859 662363529 661576867 660792828
3414.3F60792828p49290o39499n26428m39644k66194N364K11001K27213K51531L59416
$$ 660792828 660043538 659404039 658877611 658437967 658171773 658177137 658388138 658615351 658866882 659226298
3434.7F59226298K48552N066K5272K45274L86297M28140M77672N99504P35104Q03351
$$ 659226298 659474850 659479916 659505188 659750462 660136759 660564899 661042571 661642075 662377179 663180530
3455.1F63180530Q57592R19699Q97169R04799J097977J213491R35435N39899N19693
$$ 663180530 664038122 664957821 665854990 666759789 667857766 669071257 670006692 670546591 671066284
3473.4F71066284P40230Q99017R35257P71403O15775O71983P14958O70791O81460P34508
$$ 671066284 671806514 672705531 673640788 674412191 675027966 675699949 676414907 677085698 677767158 678501666
3493.8F78501666P71463P53164P68781Q25762P18773O03318P30097R71198J188159
$$ 678501666 679273129 680026293 680795074 681620836 682339609 682942927 683673024 684644222 685832381
3512.2F85832381J220465J097500J144171J373947J539170J491249J386046J471580
$$ 685832381 687052846 688150346 689294517 690668464 692207634 693698883 695084929 696556509
3528.5F96556509J640319J734913J827836J788676J609504J688897J950860J902163
$$ 696556509 698196828 699931741 701759577 703548253 705157757 706846654 708797514 710699677
3544.8G10699677J491368J262546J384556J447618J404524J471877J590788J610399
$$ 710699677 712191045 713453591 714838147 716285765 717690289 719162166 720752954 722363353
3561.1G22363353J521945J458227J461566J376033J293480J408398J578093J594603
$$ 722363353 723885298 725343525 726805091 728181124 729474604 730883002 732461095 734055698
3577.5G34055698J585841J710117J875937J833379J514375J364828J485467J520514
$$ 734055698 735641539 737351656 739227593 741060972 742575347 743940175 745425642 746946156
3593.8G46946156J535118J685500J746595J655340J609564J608968J626491J629412
$$ 746946156 748481274 750166774 751913369 753568709 755178273 756787241 758413732 760043144
3610.1G60043144J603008J590251J511097J416982J392007J353144J365125J374483
$$ 760043144 761646152 763236403 764747500 766164482 767556489 768909633 770274758 771649241
3626.4G71649241J243532J042366R08077Q72731Q60691Q47578Q50678R06706J055836
$$ 771649241 772892773 773935139 774843216 775715947 776576638 777424216 778274894 779181600 780237436
3644.8G80237436J115382Q33273L49343J93238K83062L42787L55005K51889J33157
$$ 780237436 781352818 782186091 782535434 782728672 783011734 783354521 783709526 783961415 784094572
3663.1G84094572K71678M41611L16858J42574M4466k55824m22656k28584K2531L47435
$$ 784094572 784366250 784807861 785124719 785267293 785311759 785055935 784633279 784404695 784427226 784774661
3683.5G84774661O49393O77406K38419j89364j17838O8187J46211J51991M9293m2855
$$ 784774661 785424054 786101460 786339879 786150515 786032677 786100864 786247075 786399066 786448359 786405504
3703.9G86405504O3181K45928J61469k02238k78950q8751l0160q3208j20938j52886
$$ 786405504 786468685 786714613 786876082 786673844 786394894 786306143 786275983 786192775 786071837 785918951
3724.3G85918951j43528L8624L14891M10021J21891k93791l20494q3745j03593k73406
$$ 785918951 785775423 785814047 786128938 786538959 786660850 786367059 786046565 785962820 785859227 785585821
3744.7G85585821n2750J8835l73662m68075j58310r0122k31624j93775n3346q7797
$$ 785585821 785533071 785551906 785178244 784710169 784551859 784461737 784230113 784036338 783982992 783895195
3765.1G83895195k06829k63035k56896j77741j5199J16765q285k71141l06785j86563
$$ 783895195 783688366 783425331 783168435 782990694 782975495 783092260 783083975 782812834 782506049 782319486
3785.5G82319486p6115j3709j6034m5895n5909l0756j21415k50161j68144j70947k64823
$$ 782319486 782243371 782229662 782213628 782167733 782111824 782081068 781959653 781709492 781541348 781370401 781105578
3807.9G81105578j34170M0054k861q1718M1008p0691m01437l59655j74641j14978p2419
$$ 781105578 780971408 781011462 781008601 780926883 780967891 780897200 780495763 780136108 779961467 779846489 779774070
3830.4G79774070O1035J93834l3557m12524l76761k55585k63154j28150J54138K16662
$$ 779774070 779835105 780028939 779995382 779582858 779206097 778950512 778687358 778559208 778713346 778930008
3850.8G78930008l19540p47979l79860j51813j46449j18792o7830k1636j11998k28226
$$ 778930008 778610468 777862489 777482629 777330816 777184367 777065575 776997745 776976109 776864111 776635885
3871.2G76635885k35796j91390l7015L9578k1339o8068j80304k44022k36332l07381
$$ 776635885 776400089 776208699 776171684 776211262 776189923 776121855 775941551 775697529 775461197 775153816
3891.6G75153816k09034P928K7418q8215k43783m14074l93211k11895j17719j09911
$$ 775153816 774944782 774952710 774980128 774891913 774648130 774234056 773840845 773628950 773511231 773401320
3912G73401320j04189r3520j18255j63853j58489p9155L3259R4891R2864O0260n543
$$ 773401320 773297131 773203611 773085356 772921503 772763014 772683859 772717118 772812009 772904873 772965133 772959590
3934.4G72959590p3731n0604M232k4319m6373k6285m7326r5666j22010j12594q2790
$$ 772959590 772885859 772835255 772839487 772815168 772768795 772742510 772695184 772599518 772477508 772364914 772282124
3956.8G72282124o7115m5181k9206o4731j23620j07109k2233k1219q9109j02162j15633
$$ 772282124 772215009 772169828 772140622 772075891 771952271 771845162 771822929 771801710 771712601 771610439 771494806
3979.3G71494806j75774j47224p7307j18673j70708j45137j18375j55449j87933
$$ 771494806 771319032 771171808 771094501 770975828 770805120 770659983 770541608 770386159 770198226
3997.6G70198226
$$ 770198226
##END=$$ End of the data block
