##TITLE=Ac. Meldrum - Oseias e Dalila $$ Begin of the data block
##JCAMP-DX=5.00 $$ ACD/SpecManager v 10.08
##SPECTROMETER/DATA SYSTEM=Alpha
##DATE=14 May 2015 09:49:14
##DATA TYPE=INFRARED SPECTRUM
##DATA CLASS=XYDATA
##ORIGIN=
##OWNER=
##NPOINTS=1765
##FIRSTX=399.76428223
##LASTX=3997.64306641
##MAXX=3997.64306641
##MINX=399.76428223
##MAXY=1.00250685
##MINY=0.55697107
##XFACTOR=1.0000000000
##YFACTOR=0.000000010000000
##FIRSTY=1.00000000
##DELTAX=2.03961372
##XUNITS=1/CM
##YUNITS=ARBITRARY UNITS
##XYDATA=(X++(Y..Y))
399.8A00000000p98804j039958j228326j542795j809478j122856O44267K014232K346944
418.1I7463226J597441O14774K87145L7414j36554j11026n2446j59132l54016m61710
438.5I8725116o21444j090252j563454j474416p84445J75250J063460J535857J537376
456.9I7503048J063711L99130R4259L5840j25080m63539q04639r69112o40905J31154
477.3I6223867Q74132J159054R41485M70418J31577R3007J16474j0014j27232o3932
497.7I9808836Q374j16324l01796l40474l70431n54704o62983l25668L04026O28715
518.1I8077571M72707K84886K47103J33753o3008r4557J4526K7406r7453j49221n3394
540.5I8800319j3780j22523k00886j34993r1666k15441l70597m07535m54277o83409
$$ y = [100000000, 99201196, 98161238, 96932912, 95390117, 93580639, 92457783, 93102050, 95116282, 97463226, 99060667, 99675441, 99962586, 100000000, 99863446, 99752420, 99699974, 99540842, 99186826, 98725116, 98103672, 97013420, 95449966, 93975550, 93191105, 93366355, 94429815, 95965672, 97503048, 98566759, 98965889, 99060148, 99095988, 98970908, 98507369, 97702730, 96733618, 96092713, 96223867, 97097999, 98257053, 99198538, 99668956, 99800533, 99893540, 100010014, 100000000, 99872768, 99808836, 99817210, 99700886, 99399090, 99058616, 98688185, 98133481, 97470498, 97144830, 97448856, 98077571, 98550278, 98835164, 99082267, 99216020, 99153012, 99058455, 99072981, 99100387, 99002934, 98853713, 98800319, 98786539, 98664016, 98463130, 98328137, 98236471, 98021030, 97650433, 97242898, 96788621, 96105212]
560.9I6105212r38010q94434m91464P3040N86766R01782R15546O15495J86944k16323
581.3I6844554o23983q36545l76606O17843J197350R25237M00460J13034m589j41245
601.7I8115510l28946l77351k18630r5755j49453j62756L1703K53559K65258J02526
622.1I7435665r4098l42935p56443j324850j810080j830363j066911K56490J370174
640.4I1836649J788503J625359J212871Q21382N67150L97641K53701J77288J98179
658.8I8878723K07287J44726J09643J90217K21210M9758k295L7092O7771M7606J580
681.2I9953318k480K7680K1482j1563k2930J383P140j3989k1434j1945q201j7154k4313
707.7I9876994j7059p421l445p897j7488j4854P57J043j6445j5473J806n210l1399
$$ y = [96105212, 95167202, 94272768, 93781304, 93854344, 94441110, 95342892, 96258438, 96873933, 97060877, 96844554, 96220571, 95384026, 95007420, 95625263, 96822613, 97747850, 98148310, 98261344, 98256755, 98115510, 97786564, 97409213, 97190583, 97094828, 96945375, 96782619, 96814322, 97067881, 97333139, 97435665, 97341567, 96998632, 96242189, 94917339, 93107259, 91276896, 90209985, 90466475, 91836649, 93625152, 95250511, 96463382, 97284764, 97851914, 98249555, 98503256, 98680544, 98878723, 99086010, 99230736, 99340379, 99530596, 99751806, 99801564, 99799269, 99836361, 99904132, 99951738, 99953318, 99950838, 99978518, 100000000, 99988437, 99965507, 99966890, 99974030, 99960041, 99938607, 99926662, 99918461, 99901307, 99876994, 99859935, 99852514, 99849069, 99841172, 99823684, 99808830, 99809587, 99810630, 99794185, 99778712, 99780518, 99775308, 99743909]
734.3I9743909m1241k8139j9044l8600n6410l9488k5588m3660n5790l5590j7607l4839
758.7I9307913n9063n7578m9329n7715o9922o1309l8260k6620l2353l6735l0344l5912
783.2I8752773o2967p9339o6310n5957p6950j06031j13374j10584j21856j43558j59132
805.6I7656715j78230k12979k49237k85149l35097l99566m80884n83279p12335q82888
826I3337071j103860j472235k135736k835679k733004j393509L00008J115805R11850
844.4H3990711M03273L86834J356518K721286L203029K566021J619757R67294O75064
862.8I7889787N73271N23293M65060L48818J74898K4873l6210r1010j68324k35474
883.2I9468982k72822l29417m63313o52874p46357n29343J0449N14424O24966M00096
$$ y = [99743909, 99702668, 99674529, 99655485, 99616885, 99560475, 99520987, 99495399, 99451739, 99395949, 99360359, 99342752, 99307913, 99248850, 99191272, 99141943, 99084228, 99014306, 98952997, 98914737, 98888117, 98855764, 98819029, 98788685, 98752773, 98689806, 98610467, 98544157, 98488200, 98411250, 98305219, 98191845, 98081261, 97959405, 97815847, 97656715, 97478485, 97265506, 97016269, 96731120, 96396023, 95996457, 95515573, 94932294, 94219959, 93337071, 92233211, 90760976, 88625240, 85789561, 83056557, 81663048, 81963056, 83078861, 83990711, 84393984, 84780818, 86137336, 88858622, 92061651, 94627672, 96247429, 97214723, 97889787, 98463058, 98986351, 99451411, 99800229, 99975127, 100000000, 99963790, 99872780, 99704456, 99468982, 99196160, 98866743, 98403430, 97750556, 97004199, 96474856, 96485305, 96999729, 97624695, 98024791]
903.5I8024791J15341p6347j59645j86330k18213k68930l01045k83885k59525k76691
923.9I6109521l06254l16012l46983m36306n28234n39553n40262p01380j036954j405186
944.3H9952397j709365j948250k087444j822150o28054J206053K314144J930725O11312
962.7H7819368q23158k018941k890968l320867l202891k522797j391017n5736J176619
981.1G2769612K093315K624893K778536K617091K257026J804131J264745N66167q9974
999.4H8685542j37221K73203J47796p91013k024567l055096l178430j632988J193279
1017.8G9480505L606141M371172L721797K575785J606077R69368N60004K88790J12945
1036.1I7292584j7565j50538k84821l89969m68272n40441n93782o20687o61480p59411
$$ y = [98024791, 98140132, 98063785, 97904140, 97717810, 97499597, 97230667, 96929622, 96645737, 96386212, 96109521, 95803267, 95487255, 95140272, 94703966, 94175732, 93636179, 93095917, 92394537, 91357583, 89952397, 88243032, 86294782, 84207338, 82385188, 81757134, 82963187, 85277331, 87208056, 87819368, 86996210, 84977269, 82086301, 78765434, 75562543, 73039746, 71648729, 71592993, 72769612, 74862927, 77487820, 80266356, 82883447, 85140473, 86944604, 88209349, 88775516, 88685542, 88548321, 88821524, 88969320, 88178307, 86153740, 83098644, 79920214, 78287226, 79480505, 83086646, 87457818, 91179615, 93755400, 95361477, 96330845, 96890849, 97179639, 97292584, 97275019, 97124481, 96839660, 96449691, 95981419, 95440978, 94847196, 94226509, 93565029, 92805618]
1056.5I2805618r02384j059270j242209j447838j538563j342261r36496o02776m68665
1074.9H3265156m61847n75352p81101o93238J36579J395428K209037K281422J989537
1093.2H8765621J639581J281994R29523O45870M76378L86149L08627K37727J97339
1111.6I4868809J68389J26922Q9461Q0198Q3250P1239N0736M8583O4260N9712K2352
1134I5733911j3775l4916o5840j17421j70922k12806k60938l28380l84885l92574l76498
1156.5I3374956m07309n12278o41715o71017m55273m0728K49237K05511R608j19233
1176.9I0991759k00325l04902m38606o03134p90482r74417j145894j322281j517534
1195.2H3694184j700175j781839j648539j233674n98859N3465N16588P85046J024843
$$ y = [92805618, 91903234, 90843964, 89601755, 88153917, 86615354, 85273093, 84336597, 83733821, 83265156, 82803309, 82227957, 81446856, 80753618, 80890197, 82285625, 84494662, 86776084, 88765621, 90405202, 91687196, 92616719, 93262589, 93738967, 94125116, 94433743, 94671470, 94868809, 95037198, 95164120, 95253581, 95333779, 95417029, 95488268, 95539004, 95587587, 95651847, 95711559, 95733911, 95720136, 95685220, 95619380, 95501959, 95331037, 95118231, 94857293, 94528913, 94144028, 93751454, 93374956, 92967647, 92455369, 91813654, 91142637, 90687364, 90646636, 90895873, 91101384, 91110992, 90991759, 90791434, 90486532, 90047926, 89444792, 88654310, 87679893, 86533999, 85211718, 83694184, 81994009, 80212170, 78563631, 77329957, 76731098, 76784563, 77301151, 78086197, 79111040]
1213.6G9111040J334053J646924J821315J756406J466554J056117O26087K20478j43772
1231.9H8895202m52566o97762q28630p37464l70622M7618P1305l63439p25097o31356
1252.3H4207189l78579k99460j8620Q71789J669360J430386N34922j58441n36484q27610
1272.7H6494452j147622j538169j800168j478112o71834k38585n15652j003706j325047
1291.1G6775557j461750j469535j399994j282424j118761q89516o10024l62581k35647
1309.4F7945325k28846k72447k85548k27057q3811J35899L85427O46508R27919J232303
1329.8G0175672J525294J775843J987905K205079K281487J968778J485115J022214
1346.2H4427387M96548n5343m31812m74763k13891J93483N99360R00084R53674Q83818
$$ y = [79111040, 80445093, 82092017, 83913332, 85669738, 87136292, 88192409, 88818496, 89038974, 88895202, 88442636, 87744874, 86916244, 86178780, 85808158, 85855776, 85927081, 85563642, 84838545, 84207189, 83828610, 83529150, 83510530, 84382319, 86051679, 87482065, 88016987, 87858546, 87322062, 86494452, 85346830, 83808661, 82008493, 80530381, 79858547, 79619962, 79104310, 78100604, 76775557, 75313807, 73844272, 72444278, 71161854, 70043093, 69153577, 68543553, 68180972, 67945325, 67716479, 67444032, 67158484, 66931427, 66847616, 66983515, 67368942, 68015450, 68943369, 70175672, 71700966, 73476809, 75464714, 77669793, 79951280, 81920058, 83405173, 84427387, 84923935, 84868592, 84436780, 83962017, 83748126, 83941609, 84540969, 85441053, 86394727, 87278545]
1366.6H7278545Q28856N69338j99276j292885j616877j201445q49831o24770p47860
1384.9H2143795j021438n00977L21316K99806l89058n13982M68665J543921J874936
1403.3H4226984J636958J086980O92350N83130N96589O40106O35809M52512J70523
1421.6I0721941N0795M4680J18452J67036J12659J23912K93958L64000K04920Q059
1442I2210412k23851l19767j27506J50114K04086P2760j96755l50041J2285L48806
1462.4I1780543M87173M68731M65190N60802N90367L83424K28155K30908K65789K70725
1482.8I5731807K70825K96605K53057J11092Q4221J91057K23994J12271P5168J74159
1503.2I7524256L23760K30247q2678o7878N2876J23119J04201O5356Q482p9638o2519
$$ y = [87278545, 88107401, 88676739, 88477463, 87184578, 85567701, 84366256, 83516425, 82891655, 82143795, 81122357, 80621380, 80942696, 81242502, 80853444, 80339462, 80808127, 82352048, 84226984, 85863942, 86950922, 87643272, 88226402, 88822991, 89463097, 90098906, 90551418, 90721941, 90772736, 90817416, 90935868, 91102904, 91215563, 91339475, 91633433, 91997433, 92202353, 92210412, 91986561, 91666794, 91539288, 91689402, 91893488, 91966248, 91769493, 91419452, 91431737, 91780543, 92267716, 92736447, 93201637, 93762439, 94352806, 94736230, 94964385, 95195293, 95461082, 95731807, 96002632, 96299237, 96552294, 96663386, 96747607, 96938664, 97162658, 97274929, 97350097, 97524256, 97848016, 98078263, 97995585, 97927707, 97980583, 98103702, 98207903, 98273259, 98281741, 98202103, 98139584]
1525.6I8139584j7869M7046J38157J20163P7641J91140K23375p2939j70600o6769M4030
1548.1I8652959Q1724N8394P5591J36072j6243n36012m42666k08515o6084O9678R7901
1570.5I7902799J06680J80113J04750o6334o8522n9140r8061j29348j34331j46741
1590.9I7591865j82712k35343k72810k71243k52259k21020j80399j73444k44176l05230
1611.3I5253229k58553k38997l73786l43508j89435j77205k03741j97082j82134o0821
1631.7I3027967J02985P9131r9993o9713N7506J85514K69175J98638J77079L34484
1652.1I4262773K47109R912P6324J59245J18489K789O646n138k02161k81060k16454
1674.5I4178474k25872k30896k07448k18058l35360k43622n6284k8801O866J6022q7476
$$ y = [98139584, 98121715, 98168761, 98306918, 98427081, 98504722, 98695862, 98919237, 98846298, 98675698, 98608929, 98652959, 98734683, 98793077, 98868668, 99004740, 98988497, 98452485, 98009819, 97801304, 97735220, 97804898, 97902799, 98009479, 98189592, 98294342, 98228008, 98159486, 98100346, 98002285, 97872937, 97738606, 97591865, 97409153, 97173810, 96901000, 96629757, 96377498, 96156478, 95976079, 95802635, 95558459, 95253229, 94994676, 94755679, 94381893, 94038385, 93848950, 93671745, 93468004, 93270922, 93088788, 93027967, 93130952, 93210083, 93110090, 93040377, 93097883, 93283397, 93552572, 93751210, 93928289, 94262773, 94509882, 94519794, 94596118, 94755363, 94873852, 94876641, 94883287, 94878149, 94675988, 94394928, 94178474, 93952602, 93721706, 93514258, 93296200, 92960840, 92717218, 92660934, 92632133, 92638999, 92655021, 92567545]
1697I2567545k78878n50574n44423n42158o96778o84494o11311o20389p89213j278955
1717.4H5970372j514924j351171j451010j587510j487958j340247j187062j366728
1733.7G4683762j433313j194191j529652k034509k318693k565550k700550k618861
1750E8288443j899511o91825M57859J506842K303856K761513K355653J683694J318634
1768.4F8085158J011395P26104L59434N1135j71715l82275m79304m14455k21068J11932
1788.8F8676341O08730J236242J588881J706207J812255J745474J444501J124072R32169
1807.1H0874872P99465O60682N17374M51285M63432M93485N21087N21863M59909L72577
1827.5H6136031L59368L70074L90535M09425L88592L66885L58712K84630J22178L0690
$$ y = [92567545, 92288667, 91738093, 91193670, 90651512, 89954734, 89270240, 88658929, 88038540, 87249327, 85970372, 84455448, 83104277, 81653267, 80065757, 78577799, 77237552, 76050490, 74683762, 73250449, 72056258, 70526606, 68492097, 66173404, 63607854, 60907304, 58288443, 56388932, 55697107, 56154966, 57661808, 59965664, 62727177, 65082830, 66766524, 68085158, 69096553, 69822657, 70182091, 70233226, 70061511, 69679236, 69199932, 68785477, 68564409, 68676341, 69285071, 70521313, 72110194, 73816401, 75628656, 77374130, 78818631, 79942703, 80874872, 81674337, 82335019, 82852393, 83303678, 83767110, 84260595, 84781682, 85303545, 85763454, 86136031, 86495399, 86865473, 87256008, 87665433, 88054025, 88420910, 88779622, 89064252, 89186430, 89217120]
1847.9H9217120L457J2959R2995K19148K93762K73633K19887K19369K73615K82139
1868.3I1108084K12472J78701K01398J98543J71817J52641J50663J52713J51974J46425
1888.7I2825431J25724J25932J28615J07277R5111J00744R4229P7653O7240N3763L3158
1911.1I3834877L2628O7436R0635Q5420Q8614Q8238Q3310J01673J06198Q7047Q0931
1933.6I4747007Q9687R5540R8628R6524P4208N5074M3059M0811N8347O7127N3739M5717
1958.1I5565468N7745O7139O3616M9037L6150L6210L4993K9356M2230O2257N8919M3845
1982.5I6146965M4513N9265O1851M6754K7883L0113M4435M1056L2812L6132M0305L5560
2007I6647644K8390K3281K5583L0475J6690o426j4299k8229l2806K0123O5851M8601
$$ y = [89217120, 89220577, 89233536, 89326531, 89545679, 89839441, 90113074, 90332961, 90552330, 90825945, 91108084, 91320556, 91499257, 91700655, 91899198, 92071015, 92223656, 92374319, 92527032, 92679006, 92825431, 92951155, 93077087, 93205702, 93312979, 93408090, 93508834, 93603063, 93680716, 93747956, 93801719, 93834877, 93867505, 93934941, 94025576, 94110996, 94199610, 94287848, 94371158, 94472831, 94579029, 94666076, 94747007, 94836694, 94932234, 95030862, 95127386, 95201594, 95256668, 95299727, 95340538, 95398885, 95466012, 95519751, 95565468, 95623213, 95690352, 95753968, 95803005, 95839155, 95875365, 95910358, 95939714, 95981944, 96044201, 96103120, 96146965, 96191478, 96250743, 96312594, 96359348, 96387231, 96417344, 96461779, 96502835, 96535647, 96571779, 96612084, 96647644, 96676034, 96699315, 96724898, 96755373, 96772063, 96765637, 96751338, 96723109, 96690303, 96710426, 96776277, 96824878]
2031.5I6824878J9283Q684J4687K9289K6047k62j9741k2399k6131l2222j6147K2781
2056I6828747N1975N7894N8788O6727O7181N5849M9299N4080N5217M2719L2598L6424
2080.4I7457498L9554K7490J4340J6368K3860K2965J9646K6107L9208M4864L7295K8467
2104.9I7797662L0416L5298K6620Q785n001p814l487p522k2471m1455n1587l0959J8614
2131.4I7747099O0440O4885L3713R47q428j2278k5315l1942j1718K2066L7646L9452
2155.9I7916567N6041P6174O7807M5919M1568M8185M6003L2842K3794K8109K4778O133
2180.4I8413920r65J0359J3822K212K235J8507K2352P558M279K2221L2777J8507Q82
2206.9I8568666m47j746j9145l1436j5658Q839J5003J0121J6540K5362J0407j9759
$$ y = [96824878, 96844161, 96852845, 96867532, 96896821, 96922868, 96922606, 96902865, 96880466, 96854335, 96822113, 96805966, 96828747, 96880722, 96938616, 96997404, 97064131, 97131312, 97187161, 97236460, 97290540, 97345757, 97388476, 97421074, 97457498, 97497052, 97524542, 97538882, 97555250, 97579110, 97602075, 97621721, 97647828, 97687036, 97731900, 97769195, 97797662, 97828078, 97863376, 97889996, 97898781, 97893780, 97885966, 97882479, 97874957, 97852486, 97811031, 97759444, 97728485, 97747099, 97807539, 97872424, 97906137, 97907084, 97898656, 97886378, 97861063, 97829121, 97817403, 97839469, 97877115, 97916567, 97972608, 98048782, 98116589, 98162508, 98204076, 98252261, 98298264, 98331106, 98354900, 98383009, 98407787, 98413920, 98412955, 98423314, 98437136, 98439348, 98441583, 98460090, 98482442, 98490000, 98494279, 98516500, 98549277, 98567784, 98568666, 98568219, 98566473, 98547328, 98515892, 98500234, 98509073, 98524076, 98534197, 98550737, 98576099, 98586506, 98566747]
2231.4I8566747l0893j4234Q857K9439N0771O4731N6350K9498Q101m596k5260m6957
2255.8I8692554m5132j7423J1563K1714J6976M524j1045j4228M477L3521N2363N1707
2280.3I8801571M2498M0311M1938L5137K4616K2370K5511K6977K6071K3579J7995O342
2304.8I9134916p886k0116k7162k1482m7K8455M7231M6473L4839K9582L5918L8820
2329.3I9319541K1893M149J0621J5104P260J8036J9664k7520k0581O7699J29408J05673
2353.7I9670947N3256L4190J1879l2407q0884j03807r9009j05674j18142j06233p7677
2376.2I9046439m9824l2919k6000k3365l0362l9167k4753J1980L7903L9535M0466N2369
2400.6I9002302N7798M9895M4608M3709L6323K4795J8484J8656J6147P230k057m488
$$ y = [98566747, 98535854, 98521620, 98530477, 98559916, 98610687, 98675418, 98731768, 98761266, 98769367, 98764771, 98739511, 98692554, 98647422, 98629999, 98641562, 98663276, 98680252, 98684776, 98673731, 98659503, 98663980, 98697501, 98749864, 98801571, 98844069, 98884380, 98926318, 98961455, 98986071, 99008441, 99033952, 99060929, 99087000, 99110579, 99128574, 99134916, 99127030, 99106914, 99079752, 99058270, 99058223, 99086678, 99133909, 99180382, 99215221, 99244803, 99280721, 99319541, 99341434, 99345583, 99356204, 99371308, 99378568, 99396604, 99416268, 99388748, 99368167, 99435866, 99565274, 99670947, 99724203, 99758393, 99770272, 99737865, 99656981, 99553174, 99454165, 99348491, 99230349, 99124116, 99046439, 98996615, 98963696, 98937696, 98914331, 98883969, 98844802, 98820049, 98832029, 98869932, 98909467, 98949933, 99002302, 99060100, 99109995, 99154603, 99198312, 99234635, 99259430, 99277914, 99296570, 99312717, 99319947, 99317890, 99313402]
2425.1I9313402p69Q65j330p21N329R912O932K879L505L034K14k62J281J687P33q40
2457.8I9345851k039m398p254n907p87L481P69o282p373K26N287J67m274j132k009
2488.3I9314326j0931j2690p922p385o884j419P397J3167R626n07j0800j8924k0862
2514.9I9246192j5831p254j413n006j0163j1432j5992j8734q636P391J5676J2868P135
2541.4I9194801N609L081m756j0640j1861j3131q988L218J1558Q523l57q512j4710
2567.9I9153835k0636k6273k8110k4998j9270j2726n692P69J347k980k438K509P81
2594.4I9016118k265N871J5730J5753J3018J5354J7613J4913J1689J1360J0092m00
2618.9I9144846j7524k2864q178J0658J7905J6409J3208Q285N192O235N394Q58l481
$$ y = [99313402, 99312633, 99313498, 99312168, 99311447, 99316776, 99326688, 99333620, 99336499, 99340004, 99343038, 99343252, 99342990, 99344271, 99345958, 99346691, 99345851, 99343812, 99339414, 99332160, 99326253, 99325466, 99328947, 99329716, 99323434, 99316061, 99316287, 99321574, 99321741, 99317467, 99316335, 99314326, 99303395, 99290705, 99282783, 99275398, 99268514, 99267095, 99274492, 99287659, 99297285, 99296778, 99285978, 99267054, 99246192, 99230361, 99223107, 99221694, 99216688, 99206525, 99195093, 99179101, 99160367, 99151731, 99159122, 99174798, 99187666, 99194801, 99200410, 99203491, 99198735, 99188095, 99176234, 99163103, 99154115, 99157333, 99168891, 99177414, 99177057, 99168545, 99153835, 99133199, 99106926, 99078816, 99053818, 99034548, 99021822, 99016130, 99016899, 99018246, 99015266, 99012828, 99015337, 99016118, 99013853, 99019724, 99035454, 99051207, 99064225, 99079579, 99097192, 99112105, 99123794, 99135154, 99145246, 99144846, 99127322, 99104458, 99096280, 99106938, 99124843, 99141252, 99154460, 99162745, 99167937, 99174172, 99179566, 99180424, 99176943]
2645.4I9176943j865N597J1348J1653J2130J5538J6332J4997J4347J1867P432N258
2669.9I9301577P116Q643N263J741k4n341j0025q881m638k002l219l260J871L457m464
2700.5I9287814j1021q780o228p666o014J532Q702Q828O914P731P105L99j2201k1553
2729I9255562k8092m9192p2902n6994k313L8767L8839K5683J7846r36k1982k1583r501
2755.5I9113202p176j5718k1482j8054j4263j1718P33J9294K4253R554o276q243p630
2782I9056476j6313k4003k4110k3681k1702j5790j1539j5479k9433m3482m7749l9905
2806.5I8743290k4659k1761l4684m5801m8661m3911l4528k6888k5118k8556l2085l1096
2831I8345542k9016l3426m5031o6340q7035q8829p9250p0667o7735o6179o0183n3936
$$ y = [99176943, 99175078, 99180675, 99192023, 99203676, 99215806, 99231344, 99247676, 99262673, 99277020, 99288887, 99296319, 99301577, 99308693, 99317336, 99322599, 99324340, 99324316, 99318975, 99308950, 99300069, 99295431, 99293429, 99290210, 99286950, 99288821, 99292278, 99287814, 99276793, 99268013, 99261785, 99254119, 99248105, 99249637, 99258339, 99267167, 99274081, 99281812, 99288917, 99289316, 99277115, 99255562, 99227470, 99178278, 99105376, 99048382, 99046069, 99084836, 99123675, 99149358, 99167204, 99166268, 99144286, 99122703, 99113202, 99106026, 99090308, 99068826, 99050772, 99036509, 99024791, 99025524, 99044818, 99069071, 99078625, 99072349, 99064106, 99056476, 99040163, 99016160, 98992050, 98968369, 98946667, 98930877, 98919338, 98903859, 98874426, 98830944, 98783195, 98743290, 98718631, 98696870, 98662186, 98616385, 98567724, 98523813, 98489285, 98462397, 98437279, 98408723, 98376638, 98345542, 98316526, 98283100, 98238069, 98171729, 98084694, 97995865, 97916615, 97845948, 97778213, 97712034, 97651851, 97597915]
2855.5I7597915m3082l5316m5031n3674n3352o5971q3226p9518p1866p5203o8676n4908
2879.9I6868092m6224l6138l3653m9251o9386q0520q8894j03009j10399r7901q1366
2902.4I6071351p9948q5318q1694q4651j26088k12162l21913m36986n70660p60061
2922.8I3311870j032525j268089j140672m46528N18936J154029J190031Q62878M83799
2941.1I3633729J70624n4532j55908j13219L5292K00016L12399L58433L42834K86412
2961.5I5016080K20788J72925J51217J43206J41382J36775J17886R9015Q2749M5514
2981.9I6327537J61l1000o3872j14513k14016m09705p06446j064837j338929j226634
3002.3I1157746n82713K16967O63299P34931P00557O61129N65803M22579L17085K94667
$$ y = [97597915, 97554833, 97519517, 97474486, 97420812, 97367460, 97301489, 97218263, 97138745, 97066879, 96991676, 96923000, 96868092, 96821868, 96785730, 96752077, 96702826, 96633440, 96552920, 96464026, 96361017, 96250618, 96152717, 96071351, 95991403, 95906085, 95824391, 95739740, 95613652, 95401490, 95079577, 94642591, 94071931, 93311870, 92279345, 91011256, 89870584, 89424056, 89942992, 91097021, 92287052, 93149930, 93633729, 93804353, 93749821, 93593913, 93480694, 93515986, 93716002, 94028401, 94386834, 94729668, 95016080, 95236868, 95409793, 95561010, 95704216, 95845598, 95982373, 96100259, 96199274, 96282023, 96327537, 96327698, 96296698, 96232826, 96118313, 95904297, 95494592, 94788146, 93723309, 92384380, 91157746, 90575033, 90792000, 91455299, 92190230, 92890787, 93551916, 94117719, 94540298, 94857383, 95152050]
3022.7I5152050K93964K49297J97077J65957J36101R7531O9857Q5503J00666O5958
3043.1I6613961K0558Q261K3377K9803K0992J9926J4168L261J4317L7193M6146K3770
3067.6I6875733r185n776K8551O0272O6304L8463P111m428r060l136L714j3805k8211
3094.1I7006547j1861J6302J5754j9378l2890k736J5033j0515j5658K5153L6925N657
3118.6I7028333k9695n3519m4817j2362P272o86j8107j2899J1397J1956k1338m2546
3143I6822989l5304k3371N66K4754m649o1351p1961m7308l2544l2610l5226l6973l8123
3169.6I6428889m0257m4680m6277m8333n3382n3203n1743n8782o4844o2543n9479o0148
3194I5785218o7615p6389p4262o5315o4981p1001p2509p0589o5422o2275o2210o4474
$$ y = [95152050, 95446014, 95695311, 95892388, 96058345, 96194446, 96291977, 96361834, 96447337, 96548003, 96613961, 96634519, 96642780, 96666157, 96695960, 96716952, 96736878, 96751046, 96754307, 96768624, 96805817, 96851963, 96875733, 96866548, 96860772, 96889323, 96949595, 97015899, 97054362, 97061473, 97057045, 97047985, 97044849, 97048563, 97034758, 97006547, 96994686, 97010988, 97026742, 97007364, 96974474, 96971738, 96986771, 96976256, 96960598, 96985751, 97022676, 97028333, 96998638, 96945119, 96900302, 96887940, 96895212, 96894526, 96876419, 96863520, 96874917, 96886873, 96865535, 96822989, 96787685, 96764314, 96764880, 96789634, 96784985, 96723634, 96651673, 96604365, 96571821, 96539211, 96503985, 96467012, 96428889, 96388632, 96343952, 96297675, 96249342, 96195960, 96142757, 96091014, 96032232, 95967388, 95904845, 95845366, 95785218, 95717603, 95641214, 95566952, 95501637, 95436656, 95365655, 95293146, 95222557, 95157135, 95094860, 95032650, 94968176]
3218.5I4968176p4762q3059q2028p6986o7770n1868m8441q3947j18035j08236q5729
3240.9I4087315o9350n9635p2241r4163r2369o7532n3627o6560p9215p0613n5832m2170
3265.4I3264008k1381o264k8491o7657q5891q8942p7355o2829n9783o0225n6666m4769
3289.9I2603755m7284p4947j03611j27441j31416r7674o4695q0621j36185j82182j90573
3312.3I1367126j75262j64491j65701j68532j62536j59842j88541k20549k19327k09976
3332.7H9532369k03853j98174k18815k54917k73239k79755k66772k32923k40797k93148
3353.1H7069976l12298k90066k74062k84714k93010k74408k68847l06678l50112l47131
3373.5H4068650l07322k78067k63554k52461k42943k25270j89578j47742j54460k04462
$$ y = [94968176, 94893414, 94810355, 94728327, 94651341, 94583571, 94531703, 94483262, 94399315, 94281280, 94173044, 94087315, 94017965, 93958330, 93886089, 93791926, 93699557, 93632025, 93578398, 93511838, 93432623, 93362010, 93306178, 93264008, 93242627, 93236363, 93207872, 93140215, 93054324, 92965382, 92888027, 92825198, 92765415, 92705190, 92648524, 92603755, 92556471, 92481524, 92377913, 92250472, 92119056, 92021382, 91956687, 91876066, 91739881, 91557699, 91367126, 91191864, 91027373, 90861672, 90693140, 90530604, 90370762, 90182221, 89961672, 89742345, 89532369, 89328516, 89130342, 88911527, 88656610, 88383371, 88103616, 87836844, 87603921, 87363124, 87069976, 86757678, 86467612, 86193550, 85908836, 85615826, 85341418, 85072571, 84765893, 84415781, 84068650, 83761328, 83483261, 83219707, 82967246, 82724303, 82499033, 82309455, 82161713, 82007253, 81802791]
3393.9H1802791k09927j57321j24603j65045k13576j87701j36047j22965j28931j34569
3414.3H0222106j30892j05840r0873r4700p5847l5655q244q797j0199O926O468q977
3438.8G9665476L004L6055O5225O9368N8031O6978Q1337Q7672J03021J20753J13737
3461.2H0470657R8425J11819J26207J09917R0503R5558J08135J20861J31398J10298
3481.6H1573778Q0300Q5026Q7064O5846O4325Q9836J15561J40828J87397K15423J83386
3504H2888770J60641J70403J51980J24926J22624J21999J31458J62578J74439J43605
3524.4H4353423J08516Q5771R0075J41740K05952K44671K66397K99769L29900L09783
3544.8H6435997K38830K15090K39908K24525K03610K19410K31183K32404K68728K96896
$$ y = [81802791, 81592864, 81435543, 81310940, 81145895, 80932319, 80744618, 80608571, 80485606, 80356675, 80222106, 80091214, 79985374, 79894501, 79799801, 79723954, 79688299, 79680055, 79671258, 79661059, 79667985, 79674453, 79665476, 79668480, 79704535, 79769760, 79839128, 79897159, 79964137, 80045474, 80133146, 80236167, 80356920, 80470657, 80569082, 80680901, 80807108, 80917025, 81007528, 81103086, 81211221, 81332082, 81463480, 81573778, 81654078, 81739104, 81826168, 81892014, 81956339, 82046175, 82161736, 82302564, 82489961, 82705384, 82888770, 83049411, 83219814, 83371794, 83496720, 83619344, 83741343, 83872801, 84035379, 84209818, 84353423, 84461939, 84547710, 84637785, 84779525, 84985477, 85230148, 85496545, 85796314, 86126214, 86435997, 86674827, 86889917, 87129825, 87354350, 87557960, 87777370, 88008553, 88240957, 88509685, 88806581]
3565.2H8806581J99235R7829J56486K36702K64108K80392K95663L05063L44920L85839
3585.6I1372818K91443J89346K62814L18170K79021K72262K79922K45630K63042L21305
3606I4095773K96026K39396K51287K53928K70694K60497J46722J24741K31087L44175
3626.4I6514326K56390K5981P1311J47856J33061J30290J35428J65635K58458L33488
3646.8I8172224J79278j07789m2885J17254O3068J3721N8627O0916J01513J95682J33717
3669.2I8945326j2994R9379L8671j88941q6701J9110P1698J80906K23196K9015j34271
3691.7I9184394n0914M2831Q5491J04028L1299l4309N9802J61856J14179j09452j67698
3714.1I9421507p540P6175O2889L0559M23n3739k2412J07891J57743M8262j20991j17278
$$ y = [88806581, 89005816, 89103645, 89260131, 89496833, 89760941, 90041333, 90336996, 90642059, 90986979, 91372818, 91664261, 91853607, 92116421, 92434591, 92713612, 92985874, 93265796, 93511426, 93774468, 94095773, 94391799, 94631195, 94882482, 95136410, 95407104, 95667601, 95814323, 95939064, 96170151, 96514326, 96770716, 96796697, 96868008, 97015864, 97148925, 97279215, 97414643, 97580278, 97838736, 98172224, 98351502, 98243713, 98200828, 98318082, 98381150, 98394871, 98453498, 98514414, 98615927, 98811609, 98945326, 98932332, 99031711, 99070382, 98881441, 98794740, 98813850, 98885548, 99066454, 99289650, 99318665, 99184394, 99133480, 99176311, 99261802, 99365830, 99397129, 99362820, 99422622, 99584478, 99698657, 99589205, 99421507, 99413967, 99490142, 99553031, 99583590, 99584013, 99530274, 99507862, 99615753, 99773496, 99821758, 99700767, 99583489]
3738.6I9583489P0584J68657k9826o5291J41608N323j92129m1450Q8090Q661r0838
3761I9646878j1521M4381L0327J1003o1071m4369N7041J05590J9616o6489k0415r692
3785.5I9701279k9677r954J7619P1615P6872O0004R4593m5067j03611j150r6268r0688
3810I9645567P6306J46091L8188J6976N3888j29717r9462J4346M107L2091M2951P1151
3834.4I9912483Q7517m4280j21212o7115m8930j812J18179K29328N3335l07459j42389
3856.9I9667645P7360J10621M5764m8870J0920M8405o7413q7988q3715l320P5227M464
3881.4I9749100L9089J3459n7054N7882L4106o7514L0368J22542P8022N722p1692j19979
3905.8I9814051m3904L3110M1270O4814O5834o664l3713J7095J8841j8930J3613L5203
$$ y = [99583489, 99654073, 99822730, 99792904, 99727613, 99869221, 99874544, 99682415, 99640965, 99729055, 99737716, 99646878, 99635357, 99679738, 99710065, 99721068, 99659997, 99615628, 99672669, 99778259, 99797875, 99731386, 99710971, 99701279, 99671602, 99661648, 99679267, 99750882, 99827754, 99887758, 99982351, 99937284, 99833673, 99832523, 99736255, 99645567, 99721873, 99867964, 99906152, 99923128, 99977016, 99847299, 99747837, 99762183, 99766290, 99798381, 99841332, 99912483, 100000000, 99955720, 99834508, 99767393, 99718463, 99716651, 99834830, 100064158, 100117493, 99810034, 99667645, 99745005, 99855626, 99901390, 99852520, 99863440, 99911845, 99844432, 99756444, 99672729, 99669409, 99744636, 99749100, 99788189, 99801648, 99744594, 99802476, 99836582, 99769068, 99799436, 99921978, 100000000, 100005722, 99934030, 99814051, 99770147, 99803257, 99844527, 99909341, 99975175, 99968511, 99934798, 99951893, 99970734, 99951804, 99965417, 100000620]
3930.3A00000620k8408n6517j5044K0224L9255J2494j3483K0456K0403m542R012K2602
3954.8A00027072K0063K0862J0550j2720j728K8598K7883J3292J4353J9073J5891J3089
3979.3A00196278J9610K3675J1122l147j0645j3745j2446j4937j5711
3997.6A00180054
$$ y = [100000620, 99972212, 99915695, 99900651, 99920875, 99960130, 99972624, 99959141, 99979597, 100000000, 99995458, 100004470, 100027072, 100047135, 100067997, 100078547, 100065827, 100064099, 100092697, 100120580, 100133872, 100148225, 100167298, 100183189, 100196278, 100215888, 100239563, 100250685, 100247538, 100236893, 100223148, 100210702, 100195765, 100180054]
##END=$$ End of the data block
