##TITLE=Ac. Meldrum - Lucas, Lucas e Marcos $$ Begin of the data block
##JCAMP-DX=5.00 $$ ACD/SpecManager v 10.08
##SPECTROMETER/DATA SYSTEM=Alpha
##DATE=14 May 2015 09:49:14
##DATA TYPE=INFRARED SPECTRUM
##DATA CLASS=XYDATA
##ORIGIN=
##OWNER=
##NPOINTS=1765
##FIRSTX=399.76428223
##LASTX=3997.64306641
##MAXX=3997.64306641
##MINX=399.76428223
##MAXY=1.00001848
##MINY=0.38002184
##XFACTOR=1.0000000000
##YFACTOR=0.000000010000000
##FIRSTY=1.00000000
##DELTAX=2.03961372
##XUNITS=1/CM
##YUNITS=ARBITRARY UNITS
##XYDATA=(X++(Y..Y))
399.8 100000000 98603934 97081965 95018589 91486269 87133241 84641445 85867471 89615405
416.1 89615405 94386894 98244739 99508321 99790144 100000000 99764007 99273139 99148691 98898828
434.4 98898828 97972304 96872401 95494646 92849833 89288771 86280876 84569919 84702164 87234533
452.8 87234533 91025949 94238144 96395034 97744739 98221534 97959918 97578746 96871603 95045280
471.2 95045280 92565560 91131365 91597712 93709534 96449232 98478550 99257535 99584669 99993366
489.5 99993366 100000000 99775165 99870628 99958318 99559700 99173284 98991102 98323220 97166449 96044606
509.9 96044606 94909865 94114947 94653577 96297789 97597402 98253870 98852283 99221992 99141347 99164087
530.3 99164087 99374765 99244022 98970258 99035120 99051201 98714769 98501873 98461860 98100322 97594130
550.7 97594130 97292227 96764690 95735478 94534737 93020302 90800649 88452595 87042803 87011868
569.1 87011868 88266259 90451616 92751545 94261748 94859564 94627541 93138778 90972197 90300518
587.4 90300518 92135024 94807506 96608192 97574586 97938466 97719872 97265559 96625316 95744681
605.8 95744681 95099407 94891965 94619834 94247156 94421256 95156211 95720464 95858282 95611429 94550920
626.2 94550920 92359978 89199609 85247141 81223124 79064852 80160445 83455139 86968893 89874905
644.5 89874905 92031729 93234861 93759269 94180632 94591773 94962704 95590693 96402973 96942472 97233194
664.9 97233194 97739100 98513806 98921800 99187946 99500531 99596018 99536967 99649429 99774832 99677837
685.3 99677837 99626839 99754399 99747348 99607074 99637979 99708712 99573010 99456662 99507087 99456078 99286091
707.7 99286091 99268872 99309790 99178028 99050051 99070406 99011010 98845053 98821664 98858482 98724723 98577958
730.2 98577958 98585391 98529637 98332036 98222286 98177141 97993231 97789729 97728705 97636557 97429091 97311407
752.6 97311407 97271669 97098213 96875155 96750826 96558422 96214277 95930493 95760882 95582336 95497477
773 95497477 95624822 95753539 95720202 95677114 95663077 95503259 95250416 95089012 94923687 94620365 94316661
795.4 94316661 94079471 93753427 93344444 92984807 92595929 92068595 91508806 90958112 90259624 89386356
815.8 89386356 88453037 87396848 86077130 84528273 82771742 80657941 77937531 74237835 69618088
834.2 69618088 65690774 64870048 67490757 71063226 73042178 72911674 72131371 73340076 77857167
852.6 77857167 83891660 88829273 91836071 93546712 94759148 95862228 96964467 98004073 98737341
870.9 98737341 99014562 98966521 98724174 98280632 97694391 97060275 96318102 95374942 94228101 92807245
891.3 92807245 91150206 89913809 89974338 91217303 92563796 93254679 93294090 92926085 92363608 91747993
911.7 91747993 91066116 90271509 89467829 88805640 88278902 87777799 87234670 86596227 85791123 84814274
932.1 84814274 83742797 82697934 81693196 80482727 78761876 76447195 73629969 70322150 66461849
950.5 66461849 62627983 60802382 62775350 67509592 71997845 74156553 73691326 71134621 67089361
968.8 67089361 62223303 57382244 53535122 51543170 51860964 54319042 58204538 62613618 66805905
987.2 66805905 70411384 73385358 75744444 77315319 77729183 77112508 76838440 77847731 78786439
1005.5 78786439 77783608 74369305 69244033 64274991 62378657 65372306 71923113 79088259
1021.8 79088259 85023826 89351618 92293918 94157141 95229608 95761085 95883960 95642805 95093578
1040.2 95093578 94283807 93221754 91946459 90545815 89076555 87543017 85929912 84171790 82156068
1058.6 82156068 79789770 77008635 73829502 70631260 68243194 67337990 67795807 68948066 70126081
1076.9 70126081 70650899 70016104 68780184 68666327 70759189 74244219 77732921 80629194 82898003
1095.3 82898003 84625804 85916412 86868805 87605149 88251299 88840431 89326930 89699578 89980167
1113.6 89980167 90168041 90277702 90361685 90439206 90490907 90527523 90570807 90593153 90561140 90485191 90358520
1136.1 90358520 90137374 89825058 89453602 88990766 88393217 87675345 86849916 85915941 84936172 83985531
1156.5 83985531 82995373 81777841 80242187 78631008 77572381 77578270 78365183 79160720 79637891
1174.8 79637891 79940701 80051875 79745597 78933012 77670157 76001036 74000502 71838170 69645983
1193.2 69645983 67411464 65122455 62937993 61138618 59980834 59579939 59778011 60181367 60578847
1211.5 60578847 61238885 62598354 64810562 67635912 70564711 73072076 74868268 75913274 76253104
1229.9 76253104 75936472 75061059 73770303 72263223 70948189 70445728 70949328 71583390 71216875
1248.2 71216875 69894344 68557709 67538977 66525716 66128457 67872244 71616817 74972647 76352298
1266.6 76352298 76154989 75140357 73572564 71361786 68334198 64921421 62648958 62666333 63981903
1285 63981903 64837229 64695400 63873655 62707376 61411375 60088128 58786505 57591099 56657863
1303.3 56657863 56145692 56072271 56203997 56203449 55906045 55394155 54864430 54539943 54601920 55096912 55959284
1325.8 55959284 57067508 58338469 59721106 61148226 62640548 64453286 66741830 69084924
1342.1 69084924 71050280 72458613 73020345 72549099 71355140 70115876 69433463 69567513 70485735
1360.4 70485735 72005659 73659539 75154716 76539183 77356786 76390082 73173666 69932657 68424886
1378.8 68424886 68372828 69068062 69006377 67466271 66421294 66858578 67048120 65687472 63955104
1397.1 63955104 63950819 65898830 68417156 70512897 71797597 72557247 73305106 74213988 75170231
1415.5 75170231 76131105 77072608 77642977 77849358 77998143 78248662 78529763 78661072 78715026 79185349
1435.9 79185349 80219400 81088012 81432062 81109852 80375248 80024582 80364114 80749685 80651015 79945803
1456.3 79945803 79506797 80137062 81154275 82206738 83194757 84067017 84895575 85795915 86663467
1474.7 86663467 87432295 88151520 88816744 89413619 89883059 90219253 90525198 90939277 91358316 91696918
1495 91696918 92048246 92444158 92772239 92959344 93027157 93169397 93462354 93701446 93853092 93909925
1515.4 93909925 93905419 93876791 93849313 93888497 93993878 94195026 94435877 94629443 94847298 95079458 95163995
1537.9 95163995 95088232 95097053 95301211 95598388 95876712 96095973 96215451 96189749 96004564 95522958
1558.3 95522958 94924158 94588310 94309777 94158548 94287509 94710296 95159346 95470327 95741934 95984137
1578.7 95984137 96110851 96108663 96031207 95928806 95800847 95636439 95449144 95227897 94949543 94646877
1599.1 94646877 94405699 94286603 94225645 94120067 93926561 93651944 93305635 92853755 92361712 92025173
1619.5 92025173 91749275 91467124 91255355 91071689 90906566 90767765 90563548 90269387 90085471 89968193
1639.9 89968193 89791071 89555436 89263940 89057076 88975984 88856620 88794333 88842815 88775116 88532299
1660.3 88532299 88127619 87680984 87232655 86548197 85601968 84787565 84133929 83549607 82942528 82154888
1680.7 82154888 81142712 80203241 79932082 79937744 79825276 79552925 79035676 78334552 77494705 76410788
1701.1 76410788 75450212 74450195 73284215 72191024 71101165 69891512 68456030 66691250 65064114
1719.4 65064114 63734072 62315625 60814571 59414530 58095175 56857663 55457616 54085070
1735.7 54085070 52824628 51032543 48724651 46299928 43879005 41596019 39619929 38347998
1752 38347998 38002184 38555309 40012747 42222583 45064405 47739986 49811596 51464778 52636975
1770.4 52636975 53395283 53766656 53771389 53452474 52810985 51903570 50791091 49609664 48644790 48228508
1790.8 48228508 48853230 50394183 52300024 54420692 56584591 58454961 59886777 61025810 62012666
1809.2 62012666 62880653 63573664 64140028 64752221 65492249 66273266 66982120 67572820 68040454 68551743
1829.6 68551743 69224918 69954187 70682365 71391928 72023135 72547477 73008925 73375422 73577756 73655200
1850 73655200 73734045 73970091 74425226 74988389 75504035 75895411 76187485 76470739 76856047 77358842
1870.3 77358842 77846909 78278226 78673404 79042321 79383892 79699302 79996753 80273616 80551648 80858392
1890.7 80858392 81167084 81455314 81739783 82006335 82239389 82439357 82605284 82732463 82832575 82937711
1911.1 82937711 83059090 83189988 83339244 83535385 83765346 84023410 84298491 84556824 84792334 85006893
1931.5 85006893 85204691 85392147 85571843 85732144 85886472 86064470 86253321 86426139 86581010 86719221
1951.9 86719221 86849064 86992002 87149334 87306148 87455541 87594551 87715018 87827832 87942475 88054377
1972.3 88054377 88166958 88290817 88432860 88583368 88725406 88851219 88967246 89074224 89173889 89287508
1992.7 89287508 89421386 89551973 89671844 89789051 89900422 90001237 90095448 90188444 90272361 90343404
2013.1 90343404 90406674 90464771 90514392 90550667 90563726 90571350 90631706 90731651 90806597 90852308 90898418 90958917
2037.6 90958917 91023618 91076720 91110867 91113001 91068447 90990621 90923595 90906852 90952766 91053808 91190434
2060 91190434 91336495 91480458 91628200 91773832 91899264 92004943 92102909 92194730 92277312 92352384 92421389
2082.5 92421389 92476654 92516959 92556047 92603058 92653197 92706126 92768568 92838889 92915320 93000758 93087602 93158132
2106.9 93158132 93214506 93268073 93305767 93311012 93299264 93300551 93311590 93290126 93200517 93071842 93002033 93059283
2131.4 93059283 93198371 93331283 93415982 93449271 93434530 93380225 93311965 93255144 93226761 93245190 93320060
2153.9 93320060 93437219 93573451 93713242 93850648 93980688 94094324 94191080 94278932 94357342 94415069
2174.3 94415069 94454736 94486707 94511223 94527721 94539851 94552487 94574046 94607836 94639480 94660765 94683903 94721252
2198.7 94721252 94766337 94808090 94845700 94872862 94876146 94849145 94797575 94736761 94689858 94676346 94698745 94743723
2223.2 94743723 94797230 94842488 94855493 94825190 94765800 94712138 94705015 94773388 94906390 95053053 95168233
2245.6 95168233 95242637 95277983 95262629 95189565 95078760 94972849 94914949 94927281 94988906 95046729 95060563
2268.1 95060563 95034099 95009160 95032012 95119673 95249778 95382273 95491010 95577443 95647907 95696479 95721787
2290.5 95721787 95736122 95750839 95769966 95794410 95815086 95808178 95752662 95645261 95493007 95326734 95204598
2312.9 95204598 95150340 95125520 95099819 95082843 95078248 95072925 95056385 95035201 95030344 95043379 95052296 95047647 95046526
2339.5 95046526 95086974 95190781 95344096 95489234 95553762 95514929 95405352 95286846 95201957 95146537 95097065
2361.9 95097065 95047796 95008510 94994754 95011598 95043427 95073271 95120382 95220727 95360488 95476919 95529115
2384.3 95529115 95518738 95467365 95418650 95424110 95489925 95577782 95669621 95775259 95890898 95997727 96088672
2406.8 96088672 96166658 96227276 96269828 96307194 96341926 96358383 96354771 96348125 96341109 96324545 96307093 96298200
2431.2 96298200 96290612 96286869 96298879 96319842 96333188 96339977 96350527 96360689 96363544 96366733 96373624 96372741 96361250
2457.8 96361250 96349889 96335423 96309841 96287173 96277952 96269661 96257937 96253854 96249753 96231806 96212894 96203995 96190995
2484.3 96190995 96166360 96140462 96112198 96071422 96025920 95992017 95967001 95946777 95948088 95971966 95987171 95978010
2508.7 95978010 95954120 95911735 95850641 95802826 95786721 95777315 95758945 95740825 95713478 95665699 95623475 95610851
2533.2 95610851 95616674 95631522 95660657 95693356 95708638 95709771 95704722 95677215 95624644 95577461 95555049 95547146
2557.7 95547146 95551318 95571488 95584261 95569605 95540446 95503718 95443511 95365334 95295924 95241231 95198840 95178270
2582.2 95178270 95177537 95174897 95160586 95149446 95146811 95139724 95134312 95149946 95179814 95207530 95240176 95285273 95330101
2608.7 95330101 95369339 95411414 95451665 95475829 95479339 95459116 95416909 95389217 95416760 95482808 95542884 95584667
2633.2 95584667 95615953 95636755 95651317 95670658 95686996 95686299 95681703 95691574 95711410 95731705 95756441 95789534
2657.6 95789534 95822781 95852196 95882893 95910889 95930034 95947963 95968908 95985675 95998544 96016365 96035767 96044987
2682.1 96044987 96050125 96060723 96068907 96069854 96073472 96083957 96092635 96098942 96106750 96104217 96085942 96069038 96060866 96052676
2710.7 96052676 96052349 96073508 96103537 96126795 96150631 96178323 96195894 96195394 96176225 96124965 96019101 95868111
2735.1 95868111 95749295 95750725 95864636 96003658 96102810 96150315 96165025 96164203 96152627 96140188 96133870 96118724
2759.6 96118724 96076900 96017790 95966494 95938283 95938760 95969450 96016127 96050733 96062803 96063393 96052140 96018970
2784.1 96018970 95972067 95923740 95874870 95833999 95814645 95808452 95791286 95753157 95697409 95624155 95547754 95502859
2808.6 95502859 95486999 95455009 95388412 95306307 95228744 95169383 95134002 95108640 95072222 95022762 94969714 94905877
2833 94905877 94818693 94715858 94606948 94491059 94378966 94288707 94214189 94132429 94043732 93958116 93861955
2855.5 93861955 93753105 93656063 93576920 93500376 93412751 93291700 93120831 92927253 92762947 92651165
2875.9 92651165 92574334 92507803 92451882 92423373 92422962 92430407 92421913 92384225 92323273 92252022 92170560 92077291
2900.3 92077291 91981345 91881645 91760069 91608435 91413200 91109192 90604496 89840907 88785118 87361443
2920.7 87361443 85413092 82750326 79467499 76445419 75112200 76151633 78761339 81538683
2937 81538683 83633471 84874177 85368860 85324836 85036629 84794962 84797466 85124660 85721725 86425912
2957.4 86425912 87079871 87622094 88055760 88404030 88706946 88991845 89259899 89503390 89718395 89911610
2977.8 89911610 90078646 90198845 90268254 90284437 90221173 90049189 89693683 88958889 87553942 85268652
2998.2 85268652 82291406 79526329 78221518 78690261 79990655 81246966 82381248 83537012 84604114
3016.6 84604114 85424209 86037785 86587960 87135905 87638557 88052285 88377756 88644737 88876694 89076978
3037 89076978 89264578 89445949 89588422 89670265 89718819 89784718 89870322 89944428 90012342 90081918 90139377
3059.4 90139377 90190428 90254742 90332395 90397507 90445614 90506905 90596050 90708899 90825683 90910459 90960020
3081.9 90960020 90999097 91036618 91075635 91110897 91131538 91149139 91178930 91218418 91251743 91261911 91258776 91272795
3106.3 91272795 91302693 91314459 91321087 91365737 91430485 91473871 91489804 91495311 91511267 91546786 91599417 91649508
3130.8 91649508 91679692 91710871 91771573 91837025 91861397 91863501 91883934 91917974 91963947 92029035 92076129 92075127
3155.3 92075127 92059416 92062306 92076576 92088801 92103922 92122936 92131943 92132956 92135918 92135429 92130119 92128307 92127842 92116171
3183.8 92116171 92092288 92073107 92061609 92042220 92013204 91983002 91954291 91928899 91907322 91885072 91856027 91822344
3208.3 91822344 91799521 91791326 91785657 91778934 91769367 91750199 91726565 91709119 91693389 91678262 91680324 91690052 91662413
3234.8 91662413 91600209 91550481 91519666 91494304 91476965 91454870 91407919 91352767 91322291 91315359 91298264 91263813
3259.3 91263813 91241127 91234815 91229331 91235369 91260749 91268742 91239423 91198581 91162938 91135460 91119277 91113210 91107982
3285.8 91107982 91099995 91098666 91092557 91058952 91000158 90923971 90838879 90772957 90740871 90705478 90626580 90514833
3310.3 90514833 90400952 90295124 90190822 90087813 89987206 89888793 89788961 89668643 89523607 89373779
3330.7 89373779 89231110 89095819 88962954 88811344 88625962 88418519 88207120 88016188 87856859 87689120
3351.1 87689120 87485492 87280977 87097281 86910957 86707354 86502069 86304778 86100358 85869646 85605788
3371.5 85605788 85335344 85096925 84893459 84710085 84541905 84393334 84269845 84170461 84086674 83994961
3391.9 83994961 83877671 83755416 83660406 83583581 83484942 83365417 83265483 83189708 83114177 83034998 82958519
3414.3 82958519 82887298 82827371 82781821 82746863 82723886 82717460 82725340 82739294 82756847 82781100 82808656 82832408
3438.8 82832408 82857680 82898927 82954144 83019257 83102280 83193743 83280224 83365828 83452052 83533049 83606660 83678722
3463.2 83678722 83753008 83825678 83892399 83953297 84012288 84068245 84116960 84155196 84181708 84191346 84174865 84128582
3487.7 84128582 84058708 83980006 83920056 83922589 84016973 84187740 84399390 84631693 84844863 85002047 85110325
3510.2 85110325 85182685 85226601 85259610 85300589 85346806 85382962 85401994 85394186 85365295 85359198 85411817 85555685
3534.6 85555685 85827231 86197215 86582500 86934501 87270242 87615621 87941867 88223237 88485146 88730079
3555 88730079 88934422 89105320 89258915 89385068 89480376 89618367 89835817 90058047 90268260 90504181
3575.4 90504181 90772420 91057163 91347498 91614902 91850811 92124778 92450076 92732650 92975402 93232447
3595.8 93232447 93495131 93747348 94007766 94255841 94459271 94659036 94884759 95105094 95322222 95525533
3616.2 95525533 95705557 95924294 96171927 96368945 96476179 96561140 96754986 96979094 97166169 97328377
3636.6 97328377 97466975 97592926 97705495 97768867 97763330 97784823 97963685 98171145 98291844 98388451 98508763
3659 98508763 98613131 98692459 98741794 98730677 98685229 98696548 98699611 98666286 98740053 98871183 98975635 99049193
3683.5 99049193 99071413 99039078 99043489 99159414 99295485 99387753 99438232 99445426 99443680 99487549 99531621 99512261
3708 99512261 99446124 99443400 99534756 99610209 99628443 99610448 99583864 99578869 99619728 99676812 99676025 99595791 99513161
3734.5 99513161 99541605 99649858 99706835 99648523 99562925 99566168 99553287 99523050 99598020 99698633 99726027
3756.9 99726027 99707133 99716198 99728966 99705768 99677145 99676543 99732137 99813551 99857634 99851263 99833971 99842924 99852544
3783.5 99852544 99864048 99896580 99927992 99945694 99934715 99896795 99863607 99810040 99775934 99816525 99837983 99862802
3807.9 99862802 99927866 99954844 99904603 99835485 99799532 99751157 99763346 99841422 99885464 99902940 99893463 99862432
3832.4 99862432 99835199 99782163 99726278 99741715 99804109 99875677 99928623 99921286 99813122 99641687 99644560 99786037
3856.9 99786037 99869204 99855798 99786305 99751031 99729812 99653202 99596125 99586433 99569583 99523336 99442929 99417269
3881.4 99417269 99465436 99536413 99632615 99689072 99713939 99781352 99830693 99793047 99711281 99657935 99660969 99730498
3905.8 99730498 99825102 99890459 99918079 99914449 99889755 99878067 99893999 99906307 99904042 99904662 99893695 99853957
3930.3 99853957 99819088 99815875 99813658 99785674 99733537 99690324 99695420 99717170 99733698 99778026 99838299 99875778
3954.8 99875778 99886775 99884087 99874461 99867707 99870890 99879402 99891627 99911022 99935776 99961507 99976403 99974650 99980831
3981.3 99980831 100000000 100001848 99979919 99947304 99903625 99847853 99794102 99748749
3997.6 99748749
##END=$$ End of the data block
