##TITLE=Ac. Meldrum - Lucas e Nicole $$ Begin of the data block
##JCAMP-DX=5.00 $$ ACD/SpecManager v 10.08
##SPECTROMETER/DATA SYSTEM=Alpha
##DATE=14 May 2015 09:49:14
##DATA TYPE=INFRARED SPECTRUM
##DATA CLASS=XYDATA
##ORIGIN=
##OWNER=
##NPOINTS=1765
##FIRSTX=399.76428223
##LASTX=3997.64306641
##MAXX=3997.64306641
##MINX=399.76428223
##MAXY=1.00098538
##MINY=0.29402339
##XFACTOR=1.0000000000
##YFACTOR=0.000000010000000
##FIRSTY=1.00000000
##DELTAX=2.03961372
##XUNITS=1/CM
##YUNITS=ARBITRARY UNITS
##XYDATA=(X++(Y..Y))
399.8A00000000j699001j786154l059626m656511n186409l315318J287759N246156
416.1H6830896O421912M437929J794786O13015l56137m34775j7899l52305o74564o70236
436.5I7592622j407593k529806l470075m379553m340112k362925N82576L153693M608536
454.8H7447363M668594L103458J347208P75260R8974p65121j149661k053845l305447
473.2I0166783k224552P90190K965564L402972K729792J332819L57491L63564J15377
491.5A00000000k42370n3484M2755m26781m70668l39598r39089j500595j568389j674956
511.9I2826825r98735R22483K142596J693118J165795Q74454K25383q851K38591j0603
532.3I9071056k57480N7512P606l71719j88219o6233m77123n04029l10117p11864j069790
$$ plain form
399.8 100000000 98300999 96514845 93455219 88798708 83612299 80296981 81584740 86830896
416.1 86830896 93252808 97690737 99485523 100098538 99742401 99307626 99289727 98937422 98262858 97592622
436.5 97592622 96185029 93655223 90185148 85805595 81465483 79102558 79685134 82838827 87447363
454.8 87447363 92115957 95219415 96566623 97341883 97440857 96675736 95526075 93472230 90166783
473.2 90166783 87942231 88732421 91697985 95100957 97830749 99163568 99521059 99884623 100000000
491.5 100000000 99757630 99704146 99746901 99320120 98849452 98509854 97570765 96070170 94501781 92826825
511.9 92826825 91828090 92750573 94893169 96586287 97752082 98626536 98851919 98843068 99081659 99071056
532.3 99071056 98813576 98871088 98878694 98506975 98318756 98252523 97775400 97271371 96961254 96249390 95179600
554.8I5179600j069308j608264k484310k810180k734906k094990k04157J917487K740222
573.1H6831194K707446K308446J045281o89149k081061k615416j120048K154266L864044
591.5I2405003K539689J029682O45500L1740p84666j010108r86284q93211m81099k60049
611.9I2236197l71981P7278R26691Q91161J64926m57489j462043k923870m131615n009282
632.3G9939973m970955k568025J379436L912080M175782L462195K349216J141119N74708
650.6H9395529M21751L01569O82026J305569J211625Q18408O74641L97819N64706J141733
671I6915376Q22061J38760m375K53093Q5563r8860J64145J63752j15490L5798J97387
693.5I8557210o4826q2827J47856l5906k10119K9427J5372k40069q3775O6513j94686
$$ plain form
554.8 95179600 94110292 92502028 90017718 87207538 84472632 82377642 82173485 84090972 86831194
573.1 86831194 89538640 91847086 92892367 92203218 90122157 87506741 86386693 88540959 92405003
591.5 92405003 94944692 95974374 96619874 96651614 95866948 94856840 93870556 92977345 92496246 92236197
611.9 92236197 91864216 91941494 92868185 93759346 93924272 93466783 92004740 89080870 84949255 79939973
632.3 79939973 74969018 72400993 73780429 77692509 81868291 85330486 87679702 88820821 89395529
650.6 89395529 89817280 90118849 90800875 92106444 93318069 94136477 94811118 95208937 95773643 96915376
671 96915376 97737437 97876197 97871822 98124915 98210478 98111618 98275763 98439515 98324025 98359823 98557210
693.5 98557210 98492384 98409557 98557413 98521507 98311388 98340815 98356187 98116118 98032343 98098856 97904170
715.9I7904170k36589R000o0940j75392K5075o282k49451j08850J8578k27969k36792
738.3I6654558k9683j90461l31056j04636j03920l20107j83696o4337l07053l31515
758.7I4688094j61523l59333n45352l58832l03036l24547N6558L56478J70648P3695
779.1I3292850J39416j02675l11846j71512k03443m17310l18372k24042m47291m93890
799.5I0741885l52532n05239o66350n49662o13606q72362q88091r22096j237452j421880
819.9H2712615j493097j863813k290684k542240l165692m436558n413032m390633p70122
838.3E6346744L200686M334808K296602m48167j192248J329321N278784P163846O034059
856.6H4344435L680777K022273J532960J430142J328843J318825R93168L04335j14166
$$ plain form
715.9 97904170 97667581 97676581 97615641 97440249 97465324 97459042 97209591 97100741 97119319 96891350 96654558
738.3 96654558 96624875 96434414 96103358 95998722 95894802 95574695 95390999 95326662 95019609 94688094
758.7 94688094 94526571 94167238 93621886 93263054 92960018 92635471 92692029 93048507 93219155 93292850
779.1 93292850 93432266 93329591 93017745 92846233 92642790 92225480 91907108 91683066 91235775 90741885
799.5 90741885 90389353 89884114 89217764 88668102 88054496 87182134 86294043 85371947 84134495 82712615
819.9 82712615 81219518 79355705 77065021 74522781 71357089 66920531 61507499 57116866 56346744
838.3 56346744 59547430 63882238 66178840 65730673 64538425 65867746 71146530 78310376 84344435
856.6 84344435 88025212 90047485 91580445 93010587 94339430 95658255 96651423 96955758 96841592
875I6841592l02470o46985q45885q20500j018124j311332j448840j806915k204752
893.4H6435789j587004J06222J481491J644820R47505K0951n82736o94597p84266j033175
913.7H5955000j090866r79758q76772o30266l98415n54609q46112r39333j096547j347840
934.1G7194482j258880j058429j363725j989263k524042l074551l722232m332698m333192
952.5E3537470k219510K063292N361349N169987K541602l59625k739954m481583n302161
970.9E3570867n154938m092953k123564L84417K674502M186869M800284M588115L898043
989.2F2731642L256869K684897J754010L73208p37619k89458J215273J212257j055312
1007.6G1145767l947139n829835n472547j984912L492111P568419Q286089O879568
$$ plain form
875 96841592 96539122 95892137 95046252 94225752 93207628 91896296 90447456 88640541 86435789
893.4 86435789 84848785 84955007 86436498 88081318 89028823 89049774 88467038 87772441 86988175 85955000
913.7 85955000 84864134 83884376 83007604 82377338 81978923 81424314 80578202 79638869 78542322 77194482
934.1 77194482 75935602 74877173 73513448 71524185 69000143 65925592 62203360 57870662 53537470
952.5 53537470 51317960 53381252 58742601 63912588 66454190 66094565 63354611 58873028 53570867
970.9 53570867 48415929 44322976 42199412 42583829 45258331 49445200 54245484 58833599 62731642
989.2 62731642 65988511 68673408 70427418 70800626 70063007 69773549 70988822 72201079 71145767
1007.6 71145767 67198628 61368793 55896246 53911334 57403445 64971864 73257953 80137521
1023.9H0137521N180353L661948K266431J313973P47072J24914l99363o52027j003951
1042.2I1376871j429033j582653j673090j873017j905977j877052k141541k525741
1058.6G6368767k868956l406626l968382l862250k737004r65595P00897J650429J680195
1076.9F2591475Q43406n21100j335752k41083K305413M017639L957671L218400K608252
1095.3G7444321J992017J396269J102006R38213P19410O61284O78843M74536K72906
1113.6H5679805K76524J94776L9202R3109J47002J2112j1903P1514m8024j99389j82527
1136.1H6072201k77156m96173n47832o01530q54868j031280j075166j222891j314324
1154.4G8650981j198274j232648j586198j951898k017819j427609j21182R71412J044983
$$ plain form
1023.9 80137521 85317874 88979822 91246253 92560226 93307298 93432212 93032849 92380822 91376871
1042.2 91376871 89947838 88365185 86692095 84819078 82913101 81036049 78894508 76368767
1058.6 76368767 73499811 70093185 66124803 62262553 59525549 58559954 59260851 60911280 62591475
1076.9 62591475 63434881 62913781 61578029 61336946 63642359 67659998 71617669 74836069 77444321
1095.3 77444321 79436338 80832607 81934613 82872826 83592236 84253520 84932363 85406899 85679805
1113.6 85679805 85956329 86151105 86190307 86283416 86430418 86442530 86430627 86502141 86454117 86254728 86072201
1136.1 86072201 85795045 85298872 84751040 84149510 83294642 82263362 81188196 79965305 78650981
1154.4 78650981 77452707 76220059 74633861 72681963 70664144 69236535 69115353 70086765 71131748
1172.8G1131748O90734N91559L64005k66403q96609j411944j970929k362418k440310
1191.1F3429433k446306k487659k442914k266735j889289j196283l71360J67447K81149
1209.5E0777483K84296N73170J309216K347208L191894L365677K957547K287781J414657
1227.9F8508929M78143k78909r26810j528031j801127j496154n60141N96715Q23539
1246.2F3816154l50279j565945j594037j201790j245576n19795K078635M448748L970080
1264.6F7836195J685685j71167j212269j866626k558804l491813l912020k526819J67048
1282.9E3949410J715260J253874J07181p33751j133949j269925j352959j367188j240712
1301.3D9927241r76989n48166m8599J79497p215l36108n42060n80662l83279O3634
$$ plain form
1172.8 71131748 71822482 72414041 72778046 72511643 71615034 70203090 68232161 65869743 63429433
1191.1 63429433 60983127 58495468 56052554 53785819 51896530 50700247 50328887 50496334 50777483
1209.5 50777483 51061779 51634949 52944165 55291373 58483267 61848944 64806491 67094272 68508929
1227.9 68508929 68987072 68708163 67781353 66253322 64452195 62956041 62395900 62992615 63816154
1246.2 63816154 63465875 61899930 60305893 59104103 57858527 57338732 59417367 63866115 67836195
1264.6 67836195 69521880 69350713 68138444 66271818 63713014 60221201 56309181 53782362 53949410
1282.9 53949410 55664670 56918544 57025725 56291974 55158025 53888100 52535141 51167953 49927241
1301.3 49927241 48950252 48402086 48353487 48532984 48525769 48189661 47647601 47066939 46683660 46747294
1321.7D6747294N31644Q75130J128870J292980J315606J304239J442712J838255K339667
1340E8816397K486193K188021J545126N55002n88286j456773j559228q44293J59710
1358.4F1301869J030737J715339J881337J657492J527524R43637j152355l903586l852272
1376.7F1149722j617717J51980J025652J38373j735181j357430M02707K50834j513595
1395.1E6895345j997047j05715K023756K672893K225811J294452P31575Q13019J060725
1413.5F5614814J152408J222139J162046O10644K06679K04683L23092L17061J38367
1431.8G0951933R8419O11871J271046J099473M79090l01552p03871k62070M46618N64122
1452.2G4255079J26135o23929n34624O91938J219440J285016J228834J133483J135433
$$ plain form
1321.7 46747294 47278938 48154068 49282938 50575918 51891524 53195763 54638475 56476730 58816397
1340 58816397 61302590 63490611 65035737 65590739 65002453 63545680 61986452 61142159 61301869
1358.4 61301869 62332606 64047945 65929282 67586774 69114298 70057935 68905580 65001994 61149722
1376.7 61149722 59532005 59683985 60709637 60848010 59112829 57755399 58158106 58408940 56895345
1395.1 56895345 54898298 54792583 56816339 59489232 61715043 63009495 63741070 64554089 65614814
1413.5 65614814 66767222 67989361 69151407 69762051 69968730 70173413 70496505 70813566 70951933
1431.8 70951933 71050352 71662223 72933269 74032742 74511832 74210280 73506409 73244339 73690957 74255079
1452.2 74255079 74381214 73757285 73222661 73914599 75134039 76419055 77647889 78781372 79916805
1470.6G9916805J264292J109183Q00311P61849Q67611Q07488O01948N64992N69600
1488.9H7264079M19307L87948N33980N58800M02433L79520L98738M08387L92204J58608
1509.3I1304004J5915Q5538J98406J38921J5402J2546j0371j3095J47259L00491L24357
1531.8I2519373L31455L49426L21079J77037l4773n746J08886K67553L41285J84667
1552.2I4560242M5752M2641l83752j149100p65026m53430k29991K29204O11919N43773
1572.6I3052232M59534M65179K04056j3888l1763m3130j45674j69259j23769j97893
1593I3455625l15011l24899l24470l05050j20461L0237o8474k39700k96885l27462
1613.4I1163450m59718o00237m63009l41785l30311k61527k71738k86924j44500o9344
$$ plain form
1470.6 79916805 81181097 82290280 83090591 83852440 84720051 85527539 86129487 86694479 87264079
1488.9 87264079 87683386 88071334 88605314 89164114 89566547 89946067 90344805 90753192 91145396 91304004
1509.3 91304004 91319919 91405457 91603863 91742784 91758186 91770732 91760361 91747266 91894525 92195016 92519373
1531.8 92519373 92850828 93200254 93521333 93698370 93663597 93657851 93766737 94034290 94375575 94560242
1552.2 94560242 94605994 94648635 94264883 93115783 92350757 91897327 91667336 91896540 92508459 93052232
1572.6 93052232 93511766 93976945 94181001 94167113 94135350 94092220 93946546 93777287 93653518 93455625
1593 93455625 93140614 92815715 92491245 92186195 92065734 92095971 92027497 91787797 91490912 91163450
1613.4 91163450 90703732 90103495 89640486 89298701 88968390 88706863 88435125 88148201 88003701 87934357
1633.7H7934357k67845m02689l36618l22240k54536k27696l12882k05684p7152k32691
1654.1H5294324l15553k59870l17735n50246o81168n79780p97474j248181j133871
1672.5G9410446r26555r05972q53437r15498j152664j288581o06811k00445l04550
1690.9G2255933l80909n55414q12125j040191j395273j264691j249057j423842j325625
1709.2F2808806j258725j278872j445943j890522j841056j431185j417399j448065
1725.5E0797039j293668j189220j129421j362941j433015j318920j815787k274414
1741.9C8979653k291131k179862j972571j694151j123607l15992M90386J296541K006978
1760.2C3196244K671954K605295K115172J777843J313337Q25292L46098K11k78491
$$ plain form
1633.7 87934357 87666512 87263823 86927205 86604965 86350429 86122733 85809851 85604167 85527015 85294324
1654.1 85294324 84978771 84718901 84401166 83850920 83169752 82589972 81792498 80544317 79410446
1672.5 79410446 78483891 77577919 76724482 75808984 74656320 73367739 72760928 72560483 72255933
1690.9 72255933 71875024 71319610 70507485 69467294 68072021 66807330 65558273 64134431 62808806
1709.2 62808806 61550081 60271209 58825266 56934744 55093688 53662503 52245104 50797039
1725.5 50797039 49503371 48314151 47184730 45821789 44388774 43069854 41254067 38979653
1741.9 38979653 36688522 34508660 32536089 30841938 29718331 29402339 29892725 31189266 33196244
1760.2 33196244 35868198 38473493 40588665 42366508 43679845 44505137 44851235 44851446 44572955
1778.6D4572955o17975r35301j198342j320246j094815n26488M72447J390222J843485
1796.9D2585942K144087K215322J921162J506421J237440J088673R53335P38358N97960
1815.3E4988700O87295Q62044R11987Q37082P06130N56141N87166P48908Q29029Q56287
1835.7F2570769Q46946P79271O83576N97644M19151J81693L6222Q3393L14349N74440
1856.1F7087454P03257O47116M73201L64661M15892N18208N43690N20760N20563M89402
1876.5G2284204M56375M41879L94559L56227L72827L93319L69894L62754L70539L34900
1896.9G6137477K96176K96026K61599J98018J73402J48124J06460J30361K07835K35212
1917.3G8190690K43259K91705L22646L05354L10707L16030K64216K33257K45922K34282
$$ plain form
1778.6 44572955 43954980 43019679 41821337 40501091 39406276 38879788 39352235 40742457 42585942
1796.9 42585942 44730029 46945351 48866513 50372934 51610374 52699047 53652382 54390740 54988700
1815.3 54988700 55675995 56538039 57450026 58287108 58993238 59549379 60136545 60885453 61714482 62570769
1835.7 62570769 63417715 64196986 64880562 65478206 65897357 66079050 66115272 66198665 66513014 67087454
1856.1 67087454 67790711 68437827 68911028 69275689 69691581 70209789 70753479 71274239 71794802 72284204
1876.5 72284204 72740579 73182458 73577017 73933244 74306071 74699390 75069284 75432038 75802577 76137477
1896.9 76137477 76433653 76729679 76991278 77189296 77362698 77510822 77617282 77747643 77955478 78190690
1917.3 78190690 78433949 78725654 79048300 79353654 79664361 79980391 80244607 80477864 80723786 80958068
1937.7H0958068K17736K45100K39331J88619J84387K00695J73813J60980J96326K01142
1958.1H2966197J84011K00242K03436J56725J35678J49161J30975J23399J70076J93584
1978.5H4613484J74123J85740J93149J53154J39094J65551J50693J28043J59472J69188
1998.8H6231691J32584J30880J47128J17612J01644J23656J08593P2521P9847P7581
2019.2H7323737L5435J9258L9816O0767P1198P8779O1047L9357P6223J11616P2997
2041.7H7990230K9767O348o3682j20365p6563j287N1659J27304J92118J87802J81889
2064.1H8505220K07335J88238J39063J32299J26314R2518R9319J24348Q7523M2141
2084.5H9744318N1534N4049L8004O4099R0617P0476P5305J17195J11526Q2797R5927
$$ plain form
1937.7 80958068 81175804 81420904 81660235 81848854 82033241 82233936 82407749 82568729 82765055 82966197
1958.1 82966197 83150208 83350450 83553886 83710611 83846289 83995450 84126425 84249824 84419900 84613484
1978.5 84613484 84787607 84973347 85166496 85319650 85458744 85624295 85774988 85903031 86062503 86231691
1998.8 86231691 86364275 86495155 86642283 86759895 86861539 86985195 87093788 87166309 87246156 87323737
2019.2 87323737 87359172 87378430 87418246 87479013 87550211 87628990 87690037 87729394 87805617 87917233 87990230
2041.7 87990230 88019997 88026345 87962663 87842298 87765735 87764448 87816107 87943411 88135529 88323331 88505220
2064.1 88505220 88712555 88900793 89039856 89172155 89298469 89390987 89490306 89614654 89702177 89744318
2084.5 89744318 89795852 89849901 89887905 89952004 90042621 90113097 90188402 90305597 90417123 90499920 90595847
2106.9I0595847R5249N1319L0577J6082k9928k7019K0856k5493j51527j85287q0555
2129.4I0310121P0899J86903K06565J17153K1047j3948n7542j07795q1748j6147K4593
2151.8I0660101Q6951J68366J87468J71757J89459J87642J36792J15753J21754R0289
2172.2I2116332N7846O4159M8727J2153J6570K2608J264J6838N5146L7331Q905L3152
2196.7I2491031N1677M0209N4348O5267K0271k2053l4064p2790j03759n8216k259J4466
2221.2I2444128M6623P9548M7177o241l3295p8439j03802k1213J06555J71161J88642
2243.6I2840844J74767R9254J3137l5340r7364j68252j55050o5636R930N4067O6746
2266I2737103R453n8627k9236O1524J28614J78189K02393J57887R3013O1852J7112
$$ plain form
2106.9 90595847 90691096 90742415 90772992 90789074 90759146 90732127 90752983 90727490 90575963 90390676 90310121
2129.4 90310121 90381020 90567923 90774488 90891641 90912688 90898740 90841198 90733403 90651655 90635508 90660101
2151.8 90660101 90747052 90915418 91102886 91274643 91464102 91651744 91788536 91904289 92026043 92116332
2172.2 92116332 92174178 92238337 92287064 92299217 92315787 92338395 92339659 92356497 92411643 92448974 92457879 92491031
2196.7 92491031 92542708 92582917 92637265 92702532 92722803 92700750 92666686 92593896 92490137 92431921 92429662 92444128
2221.2 92444128 92490751 92570299 92617476 92611235 92577940 92499501 92395699 92374486 92481041 92652202 92840844
2243.6 92840844 93015611 93114865 93128002 93092662 92995298 92827046 92671996 92606360 92616290 92670357 92737103
2266 92737103 92746556 92687929 92658693 92720217 92848831 93027020 93229413 93387300 93480313 93542165 93559277
2288.5I3559277m9215o7986n0330n0276n0718n2792j14232k24692l13538l77196l99142
2310.9I1809160l07990j93750k21336l13878l09116k31290j82259j87641k02525j62828
2331.3H9496547q1396n7769r8211r5641K8938K70587N83512N95820J12599n00709q15421
2353.7H9438856p14434m87828k71380n0550J49190L07435M42201N35321N50049N28855
2374.1I0427715N51205N92888N88000N07587L41290J28734j5437k9862K1571P7939
2394.5I3191630J27095J44958J32102J33604J43027J19513Q9246Q3274O5464L2788
2414.9I4262701K5654J9723j1623k7239j8156k7513m1544k8337j7195j6553P642L4052
2439.4I4161612J8859m65J2052J7112N335R954J0282j5474l0619k7221l7050m3470
$$ plain form
2288.5 93559277 93510062 93442076 93391746 93341470 93290752 93237960 93123728 92899036 92585498 92208302 91809160
2310.9 91809160 91501170 91307420 91086084 90772206 90463090 90231800 90049541 89861900 89659375 89496547
2331.3 89496547 89415151 89357382 89259171 89163530 89192468 89463055 90046567 90642387 90754986 90254277 89438856
2353.7 89438856 88724422 88236594 87965214 87914664 88063854 88371289 88813490 89348811 89898860 90427715
2374.1 90427715 90978920 91571808 92159808 92667395 93008685 93137419 93121982 93092120 93113691 93191630
2394.5 93191630 93318725 93463683 93595785 93729389 93872416 93991929 94081175 94164449 94229913 94262701
2414.9 94262701 94288355 94308078 94296455 94269216 94251060 94223547 94182003 94153666 94136471 94119918 94127560 94161612
2439.4 94161612 94180471 94180006 94192058 94209170 94214505 94224459 94234741 94219267 94188648 94161427 94124377 94080907
2463.9I4080907k4444j8471l3516k8580j4270k3156k9141j8871k8073m8256m4269m0322
2488.3I3729538n7322n9897n0729o2180o4224k5856J1795J9736J7404k664m9693q5538
2512.8I3320370q4061o3038l5494r793j3864m4751o1328n8996n3257k6959J7464L8063
2537.3I2924356K7562K3108K0635l606k6267l8010n9915p2545m7087j2839L528J6553
2561.8I2755473J6838j5098m9770o4122q2171j01531r4563p4959n9866l3939o026k432
2586.2I2187834r108p367r310j3769j603K0998L5871N1158O7973O6579N6737O1244
2610.7I2507237O7491N8823M5205J9550l4607p1615l7115L3956P7886Q5032O7287L5811
2635.2I2854941K0748K9505K4819L457m369n186o055R995L0285L2431L4338M8560M8334
$$ plain form
2463.9 94080907 94056463 94037992 94004476 93975896 93961626 93938470 93909329 93890458 93862385 93814129 93769860 93729538
2488.3 93729538 93672216 93612319 93561590 93499410 93435186 93409330 93421125 93440861 93458265 93455601 93405908 93320370
2512.8 93320370 93236309 93173271 93137777 93127984 93114120 93069369 93008041 92949045 92895788 92868829 92886293 92924356
2537.3 92924356 92951918 92975026 92995661 92992055 92965788 92927778 92867863 92795318 92748231 92735392 92738920 92755473
2561.8 92755473 92772311 92757213 92707443 92643321 92561150 92459619 92365056 92290097 92230231 92196292 92190266 92187834
2586.2 92187834 92178726 92171359 92162049 92148280 92146677 92167675 92203546 92254704 92322677 92389256 92445993 92507237
2610.7 92507237 92574728 92633551 92678756 92698306 92663699 92592084 92554969 92588925 92666811 92751843 92819130 92854941
2635.2 92854941 92875689 92905194 92930013 92933470 92929101 92923915 92917860 92927855 92958140 92990571 93024909 93073469 93121803
2661.7I3121803L1555K7686K8717J8680J8508K8062K2363J2416J7065J9949J0962R453
2686.2I3367219J5432J0389N692J3399J5783Q518L886p421k7376l1447j6940m017Q076
2712.7I3361193K7353L8772L5042L1871L2848K5648J1736r632o0821j45084k08205
2735.1I3140721j58947J5384J75118J96427J22547N1821J5920k998j4436r132o646
2757.6I3525779l2669o4141p5638p2712m8548R00L9256M4215L8188K7216O91k5719
2782I3356818m1455o3205q8507q4001m9907k3019j8525k7871n1910q7339j06835r4402
2806.5I2619842o1357l2317l7724q2237j20598j10084p2580m9287m0704m5997o9404
2828.9I1897553q6671r3418j14447j38933j41263j34140j31291j19102j01250r8014
$$ plain form
2661.7 93121803 93153358 93181044 93209761 93228441 93246949 93275011 93297374 93309790 93326855 93346804 93357766 93367219
2686.2 93367219 93382651 93393040 93398732 93412131 93427914 93436432 93440318 93432897 93405521 93374074 93357134 93353117 93361193
2712.7 93361193 93388546 93427318 93462360 93494231 93527079 93552727 93564463 93554831 93494010 93348926 93140721
2735.1 93140721 92981774 92997158 93172276 93368703 93491250 93543071 93558991 93555993 93541557 93532425 93525779
2757.6 93525779 93493110 93428969 93353331 93280619 93232071 93232971 93272227 93316442 93354630 93381846 93382537 93356818
2782 93356818 93315363 93252158 93163651 93079650 93029743 93006724 92988199 92960328 92908418 92821079 92714244 92619842
2806.5 92619842 92558485 92526168 92488444 92406207 92285609 92175525 92102945 92053658 92012954 91966957 91897553
2828.9 91897553 91810882 91717464 91603017 91464084 91322821 91188681 91057390 90938288 90837038 90739024
2849.3I0739024j04177j08886j24186j43773j35368j03986q7214j04957j58680k28447
2869.7H9439350k60180k23344j59115j13422r0223p7141n4484j3179J6445K408l3116
2892.2H8433999n2625o9785j03116j22011j21367j35988j64020j97786k80976m52429
2912.6H6733896p05773j027954j404345j848423k460647l307575m006332l590310j485282
2930.9F6897255J358670L210718L395462K550262J487118N71477p8368l57938k69943
2949.3G8764713M8345M47691P83550R24188Q49927O76220N17685M01550L26878K95979
2969.7H4036726K82734K52766K18373K01130J69742J06055M2546k6226j33849k73913
2990.1H4876084m98145r60094j768875k808762l603232l303134j503855O33234J592499
$$ plain form
2849.3 90739024 90634847 90525961 90401775 90258002 90122634 90018648 89931434 89826477 89667797 89439350
2869.7 89439350 89179170 88955826 88796711 88683289 88593066 88515925 88461441 88448262 88464707 88467115 88433999
2892.2 88433999 88381374 88311589 88208473 88086462 87965095 87829107 87665087 87467301 87186325 86733896
2912.6 86733896 86028123 85000169 83595824 81747401 79286754 75979179 71972847 68382537 66897255
2930.9 66897255 68255925 71466643 74862105 77412367 78899485 79470962 79392594 79034656 78764713
2949.3 78764713 78813058 79260749 80044299 80968487 81818414 82494634 83012319 83413869 83740747 84036726
2969.7 84036726 84319460 84572226 84790599 84991729 85161471 85267526 85310072 85283846 85149997 84876084
2990.1 84876084 84377939 83417845 81648970 78840208 75236976 71933842 70429987 71063221 72655720
3008.4G2655720J509988J365459J399743J300812J009494P57146O82372O94883O40023
3026.8H2015640N11872M01086L36480K80517K39027K43169K33305J68573J07646Q1545
3047.2H4618860P6223Q6653J03343J06966Q9455P7784Q0138P6104Q0752Q7428P4196
3069.6H5557902Q1313J23333J50866J38330J04231P5060N8091N3537O0278N1832K8586
3092.1H6483359L1543N2577N8902M9972K4361J19J4293L8809K2792J6553O1255Q5360
3116.5H6939895O2883M3464M2003M5896O1595Q3834P1675M1008N2905Q8787Q4376M9275
3141H7667596L4762L5167M3869Q1139J01686O3598K4772K1988K1398K4599M2277M4817
3165.5H8207668L3408L4953L1942J1635R238K6369K3741Q440N186m113j7649p051Q058
$$ plain form
3008.4 72655720 74165708 75531167 76930910 78231722 79241216 79998362 80680734 81375617 82015640
3026.8 82015640 82527512 82928598 83265078 83545595 83784622 84027791 84261096 84429669 84537315 84618860
3047.2 84618860 84695083 84781736 84885079 84992045 85081500 85159284 85239422 85315526 85396278 85483706 85557902
3069.6 85557902 85639215 85762548 85913414 86051744 86155975 86231035 86289126 86342663 86402941 86454773 86483359
3092.1 86483359 86514902 86567479 86626381 86676353 86700714 86700833 86715126 86753935 86776727 86793280 86854535 86939895
3116.5 86939895 87002778 87046242 87088245 87134141 87195736 87279570 87351245 87392253 87445158 87533945 87618321 87667596
3141 87667596 87702358 87737525 87781394 87862533 87964219 88027817 88052589 88074577 88095975 88120574 88162851 88207668
3165.5 88207668 88241076 88276029 88307971 88319606 88328844 88355213 88378954 88387394 88392580 88388467 88370818 88363767 88371825
3192H8371825J002n895m590j6993k5511r799n4q189l284J1628Q595P028K3645K2399
3220.5H8371807O998J0788P165o521J5497L7694k736m4041k9892j7357j8418J019L440
3247.1H8335443k8986l4291m077M715r823r435k325l499Q196K7299K5743P081m405
3273.6H8311636j1485j7792n544L761m118J400K0665K6346J2076j4025m6790p5948
3298H8200182p6109m8304k7299k9820n2864q9353j08570r0342p8691q9108q6707q1706
3322.5H7341309r6167j15954j22869j24777j27440j22107j27315j65176j98079j98239
3342.9H5943186j98078j90610j59740j55842j83660j84208j63275j65510j81276j86908
3363.3H4174079j96058k16365k37250k62618k70218k36624j97774j77318j48332j09905
$$ plain form
3192 88371825 88372827 88366932 88362342 88345349 88319838 88310039 88309985 88301796 88298512 88310140 88318735 88325763 88349408 88371807
3220.5 88371807 88378805 88389593 88396758 88390237 88405734 88443428 88440692 88396651 88366759 88349402 88330984 88332003 88335443
3247.1 88335443 88306457 88272166 88268089 88272804 88262981 88253546 88251221 88247722 88255918 88283217 88308960 88316041 88311636
3273.6 88311636 88300151 88282359 88276815 88280576 88276458 88277858 88298523 88324869 88336945 88322920 88276130 88200182
3298 88200182 88124073 88075769 88048470 88018650 87965786 87876433 87767863 87677521 87598830 87509722 87423015 87341309
3322.5 87341309 87245142 87129188 87006319 86881542 86754102 86631995 86504680 86339504 86141425 85943186
3342.9 85943186 85745108 85554498 85394758 85238916 85055256 84871048 84707773 84542263 84360987 84174079
3363.3 84174079 83978021 83761656 83524406 83261788 82991570 82754946 82557172 82379854 82231522 82121617
3383.7H2121617r2441q3542o3485o3491r7954j11413p9847o3502q4848r4658p8165
3406.1H1208271o9195o8784o2054o2728n8061l2360k5141l8057k3920L171J2934K1542
3430.6H0805618L5321L5399L3212M4328N4014O2466P9333Q3471O8634P3714R8550J02454
3455.1H1576514Q9354Q8471Q5783O3210M8608O0421O5416N6547N8616N0854L2824L2318
3479.6H2308936K0671k8986p6776j08129j39576j45799j01275j4841R5588K07001K75147
3502H2291961K72745K23273J66285J00100L2145Q70K461J8937M1997M3780O378m7672
3526.5H3153260r0266q8119o610J58876L44771M54843M90010M92996M63730M13537
3546.9H5787028L69501L29614K91073K57588K29734K03508J94788K08849J86586J20282
$$ plain form
3383.7 82121617 82029176 81945634 81882149 81818658 81720704 81609291 81529444 81465942 81381094 81286436 81208271
3406.1 81208271 81139076 81070292 81008238 80945510 80887449 80855089 80829948 80791891 80767971 80771142 80784076 80805618
3430.6 80805618 80840939 80876338 80909550 80953878 81007892 81070358 81149691 81233162 81301796 81375510 81474060 81576514
3455.1 81576514 81665868 81754339 81840122 81903332 81951940 82012361 82077777 82134324 82192940 82243794 82276618 82308936
3479.6 82308936 82329607 82300621 82223845 82115716 81976140 81830341 81729066 81714225 81809813 82016814 82291961
3502 82291961 82564706 82787979 82954264 83054364 83086509 83087379 83089840 83108777 83150774 83194554 83200932 83153260
3526.5 83153260 83062994 82974875 82968265 83127141 83471912 83926755 84416765 84909761 85373491 85787028
3546.9 85787028 86156529 86486143 86777216 87034804 87264538 87468046 87662834 87871683 88058269 88178551
3567.3H8178551J02902J46222J96349K56277L11815L33017L41487L60233L64494L25895
3587.7I0917242K75677K59608K66480K76405K79951K67697K63184K90489L16256L17848
3608.1I3730837L05146K80905K39587K06512J80530J39302J42444K11072K50995K04032
3628.5I5891362J50353J50788J54960J60360J68366J70076J94138K52515K77358J61290
3648.8I7731566K0487M3040O1721M4715N9426P7546Q9728J30678J58363J06663N9664
3671.3I8583597N8639k8694r9688m4120J5223O7580J18577J26195L7694m0650j1528
3693.7I8782825K8748M5097M8661K7263K5755Q5175J42151J04028n459k2525K009q220
3718.2I9255508j3137j3196m5425m6778M6188J40494J55342O9135k4009J5134R2864
$$ plain form
3567.3 88178551 88281453 88427675 88624024 88880301 89192116 89525133 89866620 90226853 90591347 90917242
3587.7 90917242 91192919 91452527 91719007 91995412 92275363 92543060 92806244 93096733 93412989 93730837
3608.1 93730837 94035983 94316888 94556475 94762987 94943517 95082819 95225263 95436335 95687330 95891362
3628.5 95891362 96041715 96192503 96347463 96507823 96676189 96846265 97040403 97292918 97570276 97731566
3648.8 97731566 97752053 97795093 97856814 97901529 97960955 98038501 98128229 98258907 98417270 98523933 98583597
3671.3 98583597 98642236 98613542 98513854 98469734 98484957 98552537 98671114 98797309 98835003 98794353 98782825
3693.7 98782825 98811573 98856670 98905331 98932594 98958349 99043524 99185675 99289703 99284244 99261719 99263728 99255508
3718.2 99255508 99242371 99229175 99183750 99136972 99183160 99323654 99478996 99548131 99524122 99539256 99632120
3740.6I9632120Q3244K4384M8226M6349o4242r9969j3643O163n4807o5571k1946j1605
3765.1I9508703j1039o32L272J4872M5752N5611J0455j2636J2368R215m786K0235N3525
3791.6I9704915N9098O5148Q4287L9792l7283l3640m6230o9374k521O2120N9688M7410
3816.1I9933410N7906j8543r9707m2170R250J4800J9705M0126N8753K6470l2288o1631
3840.6I9906081o2794k5868M0937R3442Q0925o5291j48278j9825M9359M4006o986l4380
3865I9851328j3155m1967r6560j23816j30505r0885m3261J1367N3948O8575R9355Q8364
3889.5I9632788M4477N1844P2861N7709L3265o878p3022p3630q243L0857M8310O0797
3914I9871135M1944P909P981J1778j3816j8889l034k9081o7401n5456l5477l9798l8081
$$ plain form
3740.6 99632120 99715364 99739748 99787974 99834323 99770081 99670112 99656469 99662632 99607825 99542254 99520308 99508703
3765.1 99508703 99497664 99497032 99500304 99515176 99560928 99616539 99626994 99614358 99626726 99635941 99631155 99651390 99704915
3791.6 99704915 99764013 99829161 99913448 99953240 99915957 99882317 99836087 99766713 99764192 99826312 99886000 99933410
3816.1 99933410 99991316 99972773 99873066 99830896 99840146 99854946 99874651 99914777 99973530 100000000 99967712 99906081
3840.6 99906081 99843287 99817419 99858356 99951798 100032723 99967432 99819154 99799329 99848688 99892694 99885708 99851328
3865 99851328 99838173 99796206 99699646 99575830 99445325 99354440 99311179 99322546 99376494 99445069 99544424 99632788
3889.5 99632788 99677265 99729109 99801970 99859679 99892944 99886066 99813044 99739414 99731171 99762028 99810338 99871135
3914 99871135 99913079 99920988 99928969 99940747 99926931 99908042 99905008 99875927 99808526 99753070 99717593 99677795 99639714
3940.5I9639714k0337P206L5363M8393M3536L3861L0392K0904j759j1491j139O861
3965I9831504J3530K8515L2896K3669K7442L0529J1915K146O735q917k7376k4653l3062
3991.5I9914873o3646q4573q5527
3997.6I9681127
$$ plain form
3940.5 99639714 99619377 99626583 99661946 99710339 99753875 99787736 99818128 99839032 99837273 99825782 99824643 99831504
3965 99831504 99845034 99873549 99906445 99930114 99957556 99988085 100000000 100002146 100008881 99999964 99972588 99947935 99914873
3991.5 99914873 99851227 99766654 99681127
3997.6 99681127
##END=$$ End of the data block
