##TITLE=Ac. Meldrum - Janine e Patricia $$ Begin of the data block
##JCAMP-DX=5.00 $$ ACD/SpecManager v 10.08
##SPECTROMETER/DATA SYSTEM=Alpha
##DATE=14 May 2015 09:49:14
##DATA TYPE=INFRARED SPECTRUM
##DATA CLASS=XYDATA
##ORIGIN=
##OWNER=
##NPOINTS=1765
##FIRSTX=399.76428223
##LASTX=3997.64306641
##MAXX=3997.64306641
##MINX=399.76428223
##MAXY=1.00169480
##MINY=0.10656339
##XFACTOR=1.0000000000
##YFACTOR=0.000000010000000
##FIRSTY=1.00000000
##DELTAX=2.03961372
##XUNITS=1/CM
##YUNITS=ARBITRARY UNITS
##XYDATA=(X++(Y..Y))
399.8 100000000 98070824 95195520 90578693 83347106 74321985 68337756 70332837 78345507
416.1 78345507 88040632 95651299 98929697 99919528 100169480 100000000 99564612 98928982 98110276
434.4 98110276 96810001 94781494 91659510 86671108 79971653 73531079 69763809 70204371 75028682
452.8 75028682 82114691 88832265 93563080 95841700 96746689 96883833 96027744 93978173 90404725
471.2 90404725 85414708 81652570 82298154 87160981 92706001 96443182 98559541 99698657 100086117
489.5 100086117 100111735 100128365 100000000 99729514 99333167 98863405 98120821 96910399 95107883 92603648
509.9 92603648 89893711 88593817 89906061 92971563 95865268 97720993 98709035 99168897 99411213
528.3 99411213 99582088 99642771 99560452 99444616 99363011 99214900 98939693 98607373 98241395 97767019
548.7 97767019 97121561 96274322 95134425 93498337 91078329 87607974 83084667 78234053 74758697
567 74758697 74456078 77504218 82191092 86670095 89918995 91411179 90673840 87524271 83531994
585.4 83531994 82224613 85630792 91245306 95157140 96680194 97015154 96712172 95712584 94013929
603.7 94013929 92284155 91225201 90545994 89682221 88980073 89208573 90397513 91713214 92316622
622.1 92316622 91720921 89540023 85436904 79116052 70841730 62634635 58288419 60250872 66901177
640.4 66901177 74552387 80847055 85260534 87914312 89150965 89584965 89893651 90513051 91570568
658.8 91570568 92802209 93846428 94603419 95357132 96491385 97404790 97829336 98041582 98192424
677.2 98192424 98256940 98265696 98302394 98325932 98292172 98269993 98277581 98240447 98158258 98099941 98057520 97966230
701.6 97966230 97840542 97730732 97620153 97476703 97329021 97204989 97081542 96938515 96799529 96690416
722 96690416 96588331 96473056 96353459 96233231 96110338 95978397 95823699 95648581 95457995 95237553
742.4 95237553 94987422 94737446 94498181 94244832 93981469 93743700 93515682 93240863 92914236 92546523
762.8 92546523 92092121 91553706 91063386 90744543 90599924 90575618 90608639 90597272 90457720 90219271
783.2 90219271 89936477 89578426 89129740 88659155 88180768 87618142 86967295 86305678 85605782 84766865
803.6 84766865 83813405 82808948 81682777 80342150 78796750 77021182 74904835 72413582 69563031
822 69563031 66259569 62422782 58123904 53195727 47057232 39951262 34373385 33684134 38348407
840.3 38348407 44697943 48342645 47780856 45494604 46727300 54371220 65358472 74758255 80737555
858.7 80737555 84245646 86774850 89204115 91688472 93933278 95527381 96298152 96390146 95994604
877 95994604 95218742 94171649 92926461 91441250 89626449 87343484 84351963 80801332 78057349
895.4 78057349 77982259 80566317 83603150 85256755 85444903 84814298 83802330 82598448 81251103
913.7 81251103 79744124 78161156 76731330 75562769 74486446 73309171 71969146 70389813 68470430
932.1 68470430 66306448 64272809 62487668 60401314 57420564 53485781 48772871 43256861 36919910
950.5 36919910 30764186 27584282 29940218 36763480 43767437 47274423 46594551 42940605 37560090
968.8 37560090 31421226 25549227 21041311 18745345 19042958 21842115 26588583 32325634 38029820
987.2 38029820 43081358 47368279 50928527 53428191 54032540 52845472 52490520 54753369 56911916
1005.5 56911916 55399168 49674267 41460207 33973667 31420201 36339271 47024700 59252453
1021.8 59252453 69926417 78009963 83608973 87226260 89390677 90509731 90839434 90496856 89508790
1040.2 89508790 87887698 85680848 82954848 79805225 76363361 72702450 68781662 64513361
1056.5 64513361 59857923 54831809 49465963 43890795 38709387 35125273 34133995 35596150 38454118
1074.9 38454118 41485897 43364507 42991325 41111106 40767443 44198540 50250500 56433159 61551303
1093.2 61551303 65542525 68594855 70881063 72606689 74023795 75305969 76470637 77465761 78254765
1111.6 78254765 78823215 79201901 79461944 79655463 79795200 79897201 79974699 80008256 79968703 79844254
1132 79844254 79616171 79244584 78710312 78031528 77212262 76213682 75001246 73564613 71915239 70117426
1152.4 70117426 68297160 66537583 64715624 62500226 59662920 56614572 54570013 54550314 56066817
1170.7 56066817 57680821 58760142 59519589 59859270 59356612 57876408 55532455 52484256 48998299
1189.1 48998299 45430678 42026594 38806379 35738307 32979152 30850688 29625970 29338485 29666236
1207.5 29666236 30056748 30269995 30735624 32166454 34957826 38925624 43386000 47527984 50769359
1225.8 50769359 52798933 53509480 52969807 51355928 48892885 46002769 43524414 42562598 43449843
1244.2 43449843 44699189 44299883 42225093 40099740 38536048 36937556 36247969 39177516 45766672
1262.5 45766672 51862401 54399526 54026103 52195919 49423397 45650429 40730238 35432327 32152295
1280.9 32152295 32687214 35512230 37753722 38359004 37756273 36492151 34930912 33281994 31632861
1299.2 31632861 30069304 28819850 28180042 28207895 28531972 28625005 28225744 27417353 26473433 25756791
1319.6 25756791 25558877 25932619 26778013 27933180 29243860 30605257 31970736 33423862 35337749
1338 35337749 38029850 41075599 43826145 45828369 46489790 45459363 43264830 41092843 39972720
1356.4 39972720 40253291 41779998 44264355 47043869 49639407 52089864 53592259 51945305 46406314
1374.7 46406314 41055292 39048553 39831069 41941640 42422727 39800945 37674272 38227117 38725442
1393.1 38725442 36846903 34114602 33706647 36217695 39687434 42585966 44389254 45515525 46692842
1411.4 46692842 48193869 49820060 51450527 53067440 54107517 54516047 54795921 55255550 55819935
1429.8 55819935 56114888 56171411 56943119 58842462 60506076 61135840 60425925 58881205 58105832
1448.1 58105832 58766776 59578866 59386462 57961929 57205230 58597070 60595322 62468779 64235187
1466.5 64235187 65855575 67313957 68869370 70514125 72056097 73486644 74803084 75965661
1482.8 75965661 76808560 77325976 77839965 78703624 79593796 80236053 80875295 81686169 82402271 82717711
1503.2 82717711 82573503 82667524 83506250 84250236 84601396 84606671 84494615 84341127 84189630 84341270
1523.6 84341270 84711081 85231984 85768878 86149478 86610895 87087339 87065405 86645651 86757886 87475026
1544 87475026 88360161 89078701 89542615 89764977 89657211 89076251 87866741 86955380 86630446 86157721
1564.4 86157721 85832518 86130202 87162143 88232875 88907379 89598233 90362084 90811062 90940744
1582.8 90940744 90911770 90823394 90713429 90588540 90425700 90201312 89913386 89580524 89329600 89329845 89492571
1605.2 89492571 89567655 89460456 89197004 88715899 87940508 87198478 86820251 86421877 85969812 85725278
1625.6 85725278 85555679 85375965 85100484 84500462 83719683 83384019 83180428 82685530 81869614 80784142
1646 80784142 80010414 79646075 79005337 78529090 78646839 78433537 77632046 76404059 75171578 73957533
1666.4 73957533 72185576 69962513 68162012 66694266 65380245 64033705 62261409 60045385
1682.7 60045385 58235753 57924479 58095753 57958025 57407999 56282324 54783326 53158641 51269019
1701.1 51269019 49671054 48083961 46325278 44728667 43141124 41399440 39424410 37231845
1717.4 37231845 35410610 34000185 32534075 31025332 29631394 28290367 27000937 25569436
1733.7 25569436 24208161 22931272 21124709 18901782 16719458 14711298 12989153 11650015
1750 11650015 10859184 10656339 10988750 11900659 13404192 15553750 17818756 19767293 21400954
1768.4 21400954 22537738 23220298 23520690 23464894 23074190 22335491 21270905 19903144 18379784
1786.7 18379784 17034975 16200942 16363542 17530835 19204968 21195492 23323391 25245342 26769850
1805.1 26769850 28005412 29098251 30086327 30892244 31556419 32309094 33277547 34328213 35275874
1823.4 35275874 36048961 36649734 37334105 38323182 39459971 40618688 41756243 42777306 43630418
1841.8 43630418 44396976 45040736 45417362 45559117 45677689 46074304 46879712 47896266 48827803 49526903
1862.2 49526903 50033385 50505954 51177663 52119941 53069156 53900492 54652923 55356508 56010914 56607383
1882.6 56607383 57163936 57685232 58215147 58817619 59440845 60030270 60605848 61138213 61606610 62014997
1903 62014997 62343651 62585187 62787461 63019419 63279176 63537914 63837224 64244390 64713472 65242976
1923.4 65242976 65830737 66377902 66855282 67291683 67702299 68081474 68433923 68750352 69055110 69414920
1943.8 69414920 69814950 70191455 70519608 70803732 71076781 71376383 71699482 72029847 72353154 72637486
1964.2 72637486 72876328 73126888 73397791 73644698 73874974 74134386 74439484 74755418 75054896 75331014
1984.6 75331014 75578332 75790030 75989372 76238495 76537585 76817673 77067441 77313626 77549016 77764499
2005 77764499 77969724 78173178 78359449 78512174 78639865 78776449 78936160 79088736 79205412 79289770
2025.4 79289770 79373789 79464710 79548591 79629672 79724193 79845756 79986119 80117363 80204558 80210978 80119747
2047.8 80119747 79961449 79815972 79773188 79871660 80083954 80362636 80668873 80976784 81283653 81583863
2068.2 81583863 81852961 82078022 82270473 82453686 82637870 82807767 82945538 83049065 83126557 83194035
2088.6 83194035 83274144 83373028 83479518 83595347 83735657 83903682 84079987 84240544 84377605 84497929
2109 84497929 84599108 84657991 84655178 84617400 84604907 84625167 84591186 84406167 84124786 83968031 84081006
2131.4 84081006 84364408 84634054 84803343 84864461 84823978 84699494 84536803 84393603 84318906 84348768
2151.8 84348768 84497845 84739923 85024101 85316622 85602587 85869020 86106229 86312848 86491597 86642146
2172.2 86642146 86757225 86841089 86904657 86950117 86979288 87000525 87029523 87076294 87136245 87193447 87241423
2194.6 87241423 87294281 87372535 87473553 87573493 87654406 87707728 87718076 87664473 87555325 87430847 87335354
2217.1 87335354 87299633 87338370 87441134 87567329 87669158 87708682 87658453 87528253 87400043 87389082 87550473
2239.5 87550473 87831384 88131845 88380164 88541633 88601995 88555771 88400733 88157541 87912160 87783068
2259.9 87783068 87815201 87942249 88059992 88094562 88038409 87976134 88025051 88219798 88496238 88777471 89021760
2282.3 89021760 89213216 89348805 89434773 89480388 89498562 89513338 89548403 89598113 89625514 89591408 89467144
2304.8 89467144 89231616 88887799 88511974 88234335 88110226 88067681 88024104 87972540 87936318 87909538 87861717
2327.2 87861717 87793493 87746084 87736672 87732291 87716365 87728602 87842274 88104188 88491094 88842964 88962251
2349.7 88962251 88795841 88461691 88147366 87934971 87817371 87754935 87717491 87708801 87744153 87824327 87937307
2372.1 87937307 88077897 88268262 88536161 88855612 89133906 89280695 89271408 89163715 89073390 89094353
2392.5 89094353 89227664 89418721 89633030 89859867 90089399 90305215 90493268 90651941 90782648 90887308
2412.9 90887308 90973783 91043264 91088557 91107869 91103160 91083395 91060328 91037130 91015315 91005707 91020960 91062093
2437.4 91062093 91117930 91169441 91204089 91227978 91254163 91283637 91309369 91326106 91330409 91317928 91287786 91249824
2461.8 91249824 91213459 91181254 91157413 91147614 91147840 91147023 91140348 91128492 91110343 91088212 91066504 91040635 91001713
2488.3 91001713 90944463 90872568 90793884 90715069 90648365 90617764 90636379 90680039 90711248 90706289 90650791 90543139
2512.8 90543139 90419501 90338486 90317702 90322447 90318149 90288275 90226644 90149999 90090114 90070111 90097171 90160811
2537.3 90160811 90233874 90292788 90326029 90328872 90302289 90243310 90152997 90059751 90002722 89988691 90000117 90023762
2561.8 90023762 90043736 90034610 89980227 89885628 89761245 89615077 89467001 89347041 89269912 89227319 89202952
2584.2 89202952 89184701 89163452 89132136 89095408 89064640 89047199 89051479 89086396 89147496 89218402 89290971 89368004
2608.7 89368004 89446568 89520681 89591467 89649451 89661729 89605242 89514512 89472085 89529556 89662659 89810610
2631.1 89810610 89926779 89999938 90051013 90105033 90159470 90192729 90201449 90201908 90211278 90241867 90292388 90352201
2655.6 90352201 90416092 90489638 90571934 90644199 90697289 90742427 90787232 90827340 90862256 90898389 90937519 90976655
2680.1 90976655 91013455 91045207 91066968 91081536 91099602 91124457 91150129 91171044 91184956 91191465 91183901 91156924
2704.5 91156924 91122282 91094863 91082734 91092992 91128945 91183931 91242629 91295099 91340464 91372782 91384608 91365206
2729 91365206 91279483 91074979 90761131 90515375 90550739 90825653 91116667 91308755 91411048 91448236 91447115
2751.4 91447115 91436124 91431320 91429800 91408032 91341913 91236812 91127682 91060352 91065282 91133279 91228676 91316205
2775.9 91316205 91372824 91393316 91382414 91339433 91260588 91156930 91063672 91012621 90998924 90995067 90980732 90936869
2800.4 90936869 90846974 90721065 90600199 90529013 90507537 90478873 90384930 90234143 90092474 90002990 89952803
2822.8 89952803 89912474 89863759 89797145 89705086 89583778 89437306 89269716 89094788 88940197 88816243
2843.2 88816243 88711715 88619494 88533986 88437641 88314342 88160563 87984651 87814105 87680817 87579513
2863.6 87579513 87452978 87237471 86920393 86556023 86237025 86020911 85883152 85764134 85651630 85597765
2884 85597765 85637552 85729027 85804850 85836065 85829329 85797918 85744452 85664028 85551697 85404426 85222274 84983617
2908.5 84983617 84604096 83944571 82862532 81240982 78969735 75879705 71659696 65951300 59068561
2926.8 59068561 52942276 50414157 52677512 58047616 63747728 68066007 70617813 71625054
2943.2 71625054 71549881 71023506 70627087 70727259 71485865 72786981 74261969 75577289 76619047
2961.5 76619047 77414626 78029078 78533351 78974533 79372871 79733545 80059040 80361152 80640638 80876631
2981.9 80876631 81048769 81130165 81057608 80736548 79995459 78440160 75411433 70414108 63929784
3000.3 63929784 58034027 55384326 56480646 59227854 61789685 64045930 66347384 68475556
3016.6 68475556 70080596 71252716 72318387 73410004 74420124 75243425 75885880 76414829 76885849
3034.9 76885849 77319920 77727383 78088582 78366727 78561556 78708774 78856921 79028463 79207176 79378068
3055.3 79378068 79533285 79671299 79801536 79927522 80054045 80188948 80332136 80488592 80671316 80879331
3075.7 80879331 81081015 81241012 81365263 81476986 81578863 81679451 81784791 81871992 81940258 82022691
3096.1 82022691 82123739 82206964 82255465 82295346 82352215 82413995 82449853 82484835 82567519 82679278 82785517
3118.6 82785517 82882476 82976991 83086032 83218342 83359241 83482647 83586776 83700359 83836865 83971047
3139 83971047 84071016 84150374 84244043 84359372 84494585 84640998 84763324 84843987 84913749 84996206 85083324
3161.4 85083324 85168403 85255623 85342735 85425168 85503531 85574675 85635275 85691178 85751098 85809404 85858119 85904896
3185.9 85904896 85956448 86006033 86045694 86072862 86091948 86119229 86158866 86194581 86225617 86257714 86285025 86318129
3210.3 86318129 86372364 86446798 86529815 86609513 86690623 86773354 86841804 86896122 86955214 87033254 87114096 87157917
3234.8 87157917 87167716 87182069 87206703 87232971 87271488 87314105 87331432 87334496 87356365 87399757 87442583 87473893
3259.3 87473893 87504947 87542945 87589252 87649596 87714756 87752569 87762016 87777340 87807912 87845361 87890673 87945122
3283.8 87945122 87997365 88042361 88094652 88149077 88176990 88168108 88132828 88090372 88065040 88067365 88070762 88044214
3308.2 88044214 87998092 87957996 87931007 87902415 87861806 87812805 87756532 87697262 87636817 87569988 87496299 87413675
3332.7 87413675 87320447 87219977 87097204 86940509 86771637 86611342 86468524 86350006 86241078 86121881
3353.1 86121881 86000770 85888022 85772312 85638171 85481542 85312933 85134631 84931850 84703720 84474593
3373.5 84474593 84266710 84089279 83953857 83859718 83791107 83743411 83712608 83679152 83627695 83567894 83514434
3395.9 83514434 83468419 83423978 83374602 83322293 83271211 83220333 83170229 83122045 83077729 83037233 82997519 82970518
3420.4 82970518 82976270 83007061 83040351 83065706 83086836 83117199 83160651 83213645 83265728 83309948 83357394 83404404
3444.9 83404404 83468384 83585566 83715826 83810592 83885628 83952224 84004951 84052014 84093821 84112275 84114856
3467.3 84114856 84133971 84164858 84178698 84169626 84136504 84071821 83985317 83867395 83677590 83413368 83110356
3489.8 83110356 82791954 82502121 82343715 82390541 82593614 82872260 83212262 83528709 83702898 83754921
3510.2 83754921 83739960 83666354 83558685 83452106 83341289 83205450 83047390 82844061 82590878 82377625
3530.6 82377625 82293558 82413352 82818598 83446103 84087288 84619480 85100740 85637867 86180949 86622053
3551 86622053 87006396 87370294 87637419 87784594 87861502 87864155 87770295 87792259 88111442 88488305 88762426
3573.4 88762426 89016736 89333636 89699185 90055025 90312546 90455675 90702891 91164815 91572982 91838861
3593.8 91838861 92095393 92375565 92661959 92991787 93287826 93438929 93544728 93730301 93933809 94144100
3614.2 94144100 94335085 94475192 94759703 95172387 95407039 95323920 95182866 95464039 95919973 96247536
3634.6 96247536 96487463 96663159 96777302 96824521 96705532 96343780 96072799 96438980 97032279 97339016
3655 97339016 97498560 97736728 97950637 98062783 98050654 97835439 97511971 97403985 97357512 97251415
3675.4 97251415 97493780 97924906 98232818 98367983 98273492 97967738 97814435 98108369 98512459 98754138
3695.8 98754138 98822457 98759973 98710817 98806071 98852491 98661941 98371547 98376322 98718083 98984796 99006045
3718.2 99006045 98882455 98776436 98764443 98845649 98933238 98825663 98461604 98141795 98241889 98605895
3738.6 98605895 98800457 98630273 98357576 98346549 98305881 98239380 98527831 98878580 98972327 98955381 99048305
3761 99048305 99110258 99020803 98918998 98927271 99119729 99380481 99477661 99378294 99280173 99338859 99422759 99484670
3785.5 99484670 99592566 99687922 99709302 99612266 99411798 99222767 99016666 98901016 99047488 99196649
3805.9 99196649 99351281 99587631 99666351 99465305 99177641 99007910 98867750 98952889 99251068 99430478
3826.3 99430478 99489784 99452752 99324238 99154854 98918092 98766673 98898768 99169838 99432981 99598724
3846.7 99598724 99531293 99135602 98619360 98695225 99171621 99438977 99398053 99198639 99090391 99035764
3867.1 99035764 98862547 98749387 98796409 98856819 98802733 98573345 98428380 98499113 98661631 98917127
3887.5 98917127 99085289 99151844 99326837 99457288 99325585 99052054 98888052 98948628 99234957 99565703
3907.9 99565703 99758381 99814647 99776566 99672127 99615425 99661702 99702501 99697727 99714124 99705803 99610472 99540204
3932.3 99540204 99579918 99623954 99572736 99436271 99321699 99328017 99383163 99433607 99535573 99663347 99745828
3954.8 99745828 99774379 99770457 99748236 99741250 99763650 99787903 99809504 99838752 99874121 99920565 99971890 100000000
3979.3 100000000 100006700 100016963 100023532 99999243 99939483 99859124 99759650 99639666 99520844
3997.6 99520844
##END=$$ End of the data block
