##TITLE=Ac. Meldrum - Fe, Nai e Rha $$ Begin of the data block
##JCAMP-DX=5.00 $$ ACD/SpecManager v 10.08
##SPECTROMETER/DATA SYSTEM=Alpha
##DATE=14 May 2015 09:49:14
##DATA TYPE=INFRARED SPECTRUM
##DATA CLASS=XYDATA
##ORIGIN=
##OWNER=
##NPOINTS=1765
##FIRSTX=399.76428223
##LASTX=3997.64306641
##MAXX=3997.64306641
##MINX=399.76428223
##MAXY=1.00036371
##MINY=0.59046358
##XFACTOR=1.0000000000
##YFACTOR=0.000000010000000
##FIRSTY=1.00000000
##DELTAX=2.03961372
##XUNITS=1/CM
##YUNITS=ARBITRARY UNITS
##XYDATA=(X++(Y..Y))
399.8A00000000l49015r30786j043773q15052q50898q21983j4377J041061J607769
418.1I7822946J151860K60997J64276L97259K02662k65139l45224J6319Q6421l51512
438.5I9140865p18493p53975p46226q63010p45141q9616P61205J074368P99358N06431
458.9I8365766M48447L44920q833l20047l54904l99262o29031n70161N5260P56144
479.3I7688299Q85511N02986J95837J84357J76590K0618q8281k3740L5286n8085j95521
501.7I9323857j98114j39082k39622m44883m60202j70529J82051L11470K52098K20596
522.1I8637640J86438K9921j01584l9834O9791R627j50252j57839p134M4655j10328
544.6I8411101k33155j23614K5361o9779l07751l48347k09659k57558n71114p38704
$$ plain form
399.8 100000000 99650985 98720199 97676426 96861374 96010476 95188493 95174116 96215177 97822946
418.1 97822946 98974806 99235803 99400079 99797338 100000000 99734861 99389637 99405956 99492377 99140865
438.5 99140865 98422372 97668397 96922171 96059161 95314020 95224404 95985609 97059977 97859335 98365766
458.9 98365766 98814213 99159133 99150300 98830253 98475349 98076087 97447056 96876895 96932155 97688299
479.3 97688299 98573810 99076796 99272633 99456990 99633580 99654198 99565917 99542177 99577463 99519378 99323857
501.7 99323857 99125743 98986661 98747039 98302156 97841954 97671425 97853476 98164946 98417044 98637640
522.1 98637640 98824078 98853999 98752415 98712581 98782372 98791999 98641747 98483908 98476774 98521429 98411101
544.6 98411101 98177946 98054332 98079693 98009914 97702163 97353816 97144157 96886599 96315485 95576781
565I5576781m19271J46288M48709M26043M29374N10632L37923j58256o02716n88233
585.4I6107274j02168M03148N43141M90958N01066L59643l6627k87932j61851L0446
605.8I7847098m6784k63291k37620M8304K00569N9480n1898P8016J60504j33193o40589
628.2I7020596r84937j133859j196158r44996j56718Q34703J414675J307005Q36330
646.6I6996641N42796N28908M46772J75291O879J44809L28380K41655K1750l1829J71966
669I9574018K18904K3645j16700j8931J68771J26797p5072j09345N8693J42586O634
691.4A00000000j17135l7968J09309Q2165o6972r7656K7424R9140O330r3382m3655
713.9I9867600O3294N1272n7459q3887P754O1387j561p0322l9881K5034J4054n0807
$$ plain form
565 95576781 95157510 95303798 95752507 96178550 96607924 97118556 97456479 97298223 96695507 96107274
585.4 96107274 96005106 96408254 96951395 97442353 97943419 98303062 98266435 97978503 97816652 97847098
605.8 97847098 97800314 97537023 97299403 97347707 97548276 97607756 97555858 97633874 97794378 97661185 97020596
628.2 97020596 96035659 94901800 93705642 92760646 92603928 93438631 94853306 96160311 96996641
646.6 96996641 97539437 98068345 98515117 98690408 98697287 98842096 99170476 99412131 99433881 99402052 99574018
669 99574018 99792922 99816567 99699867 99680936 99849707 99976504 99901432 99792087 99850780 99993366 100000000
691.4 100000000 99882865 99844897 99954206 100036371 99969399 99871743 99899167 99998307 100004637 99911255 99867600
713.9 99867600 99930894 99982166 99924707 99840820 99848574 99909961 99908400 99838078 99798197 99823231 99837285 99786478
738.3I9786478o5762k0593l725m1700n6874j7423R352k0212n6547m2212o348j8465
762.8I9445969o3551o1756j9002j2547m7993n3573p206K0021k2012p2247m9525P289
787.3I9063867q034q6570j08272l9518r12p1883j48076j18047m7105p5633j90514k39658
811.8I7929645j92190j85358k98739m36437m78816m84806o10846q73512j207096j654726
832.2I1507119k141070k176124j432109l20918N35697Q94231Q72034Q65912J332283
850.5H9937055K085960K327007J826227J167017P75749N65367L70616K37304K49159
868.9I9541461K87801J70738k8378j10060l2770q11j24639k67268k78139k45386l56537
891.3I8556012n39965m61685j5873M05401M21995J78492L3301L1662j8024j58525k41089
$$ plain form
738.3 99786478 99720716 99700123 99696398 99654698 99597824 99580401 99589753 99569541 99512994 99470782 99464434 99445969
762.8 99445969 99382418 99320662 99301660 99289113 99241120 99187547 99180341 99200362 99178350 99106103 99056578 99063867
787.3 99063867 99055833 98969263 98860991 98821473 98820561 98748678 98600602 98482555 98435450 98359817 98169303 97929645
811.8 97929645 97737455 97552097 97253358 96816921 96338105 95853299 95242453 94368941 93161845 91507119
832.2 91507119 89366049 87189925 85757816 85436898 85972595 86866826 87738860 88604772 89937055
850.5 89937055 92023015 94350022 96176249 97343266 98119015 98684382 99054998 99292302 99541461
868.9 99541461 99829262 100000000 99971622 99861562 99828792 99827981 99703342 99436074 99157935 98912549 98556012
891.3 98556012 98016047 97554362 97538489 97943890 98365885 98544377 98577678 98609340 98591316 98432791 98191702
913.7I8191702j97976j42384j75691k43014k37298j71548j68157k75546l88479m03631
934.1I5787978l65197m19349o36178r28104j193094j422233j593953j565612j100564
952.5H6563694q0239J078123J588821J146489J43880r15104j820028k494550k787506
970.9H2423580k572865j899665r80300l1441Q37463J580697K117306K352488K290976
989.2H6118239K035749J672369J208645O28394Q6898n2273J34980K2108o34235j589603
1009.6H9631271k514243k776646j654715O40863K780599L625047L185642K214569J343041
1028I6475428P59256M25166K46805J13964k3174j33413j91760k36172l19665m18336
1048.4I6698099m62788m59510m84341n67627o51902o78528o75136p14045p89786q34626
$$ plain form
913.7 98191702 97993726 97851342 97675651 97432637 97195339 97023791 96855634 96580088 96191609 95787978
934.1 95787978 95422781 95003432 94367254 93439150 92246056 90823823 89229870 87664258 86563694
952.5 86563694 86483455 87561578 89150399 90296888 90440768 89525664 87705636 85211086 82423580
970.9 82423580 79850715 77951050 76970750 76939309 77776772 79357469 81474775 83827263 86118239
989.2 86118239 88153988 89826357 91035002 91663396 91750294 91698021 91833001 91855109 91220874 89631271
1009.6 89631271 87117028 84340382 82685667 83326530 86107129 89732176 92917818 95132387 96475428
1028 96475428 97234684 97659850 97906655 98020619 97997445 97864032 97672272 97436100 97116435 96698099
1048.4 96698099 96235311 95775801 95291460 94723833 94071931 93393403 92718267 92004222 91214436 90379810
1068.8I0379810q60345r54658j109093j204050j192367j062643o56999J70249J183510
1087.1H4693414J896876K094215J909125J558244J209057R27478O83164M60434L09944
1105.5I5741951K64532K62916K11024J11062N6499Q2332J08707P1334J5092J6761O8838
1127.9I7011048Q3369K8067j9633m673J2988l7307j19174j50442j33812j49793k27046
1150.3I6293592k92336k78515k30903k46304l43025m33301m06772k42085n9664q625
1170.7I3752062p8082j48648j89620k39462k79444k92325l48413n08166p27087r29236
1191.1I0011579j124448j373261j648605j805484j699501j296622o84768k7734N15509
1209.5H0866665Q84825J124304J291758J407558J448148J363623J145941Q56561N62638
$$ plain form
1068.8 90379810 89519465 88564807 87455714 86251664 85059297 83996654 83339655 83509904 84693414
1087.1 84693414 86590290 88684505 90593630 92151874 93360931 94288409 94971573 95432007 95741951
1105.5 95741951 96006483 96269399 96480423 96591485 96647984 96730316 96839023 96910357 96925449 96942210 97011048
1127.9 97011048 97094417 97122484 97102851 97098178 97111166 97073859 96954685 96804243 96670431 96520638 96293592
1150.3 96293592 96001256 95722741 95491838 95245534 94902509 94469208 94062436 93820351 93760687 93752062
1170.7 93752062 93673980 93525332 93335712 93096250 92816806 92524481 92176068 91667902 90940815 90011579
1191.1 90011579 88887131 87513870 85865265 84059781 82360280 81063658 80378890 80351156 80866665
1209.5 80866665 81751490 82875794 84167552 85575110 87023258 88386881 89532822 90389383 90952021
1227.9I0952021K83843P892k59227m66311n46568m65376k48575l9369o5624l47156
1248.2H8805550n65791m67264k14684o5387J24365O07348J050883R28271M08894m9639
1268.6I0562546l55124o03229q76647j212639j452285j334339r70358q02642r70501
1287H1984782j234776j409673j475013j457327j369232j215083j020860q13276o20097
1305.4G1369445m61751l50070k81262k35004j75702p5477Q0746K76864M86373P21890
1325.8G1356052R96787J310610J610714J835186J985603K134538K184778J883412J386911
1344.1H6684591R32216N19014J41668j41275k43413j29956J20985L90476O19990P19195
1364.5H9613491P05582O63376M55499r8127q34495j170230j178080j188678j054352
$$ plain form
1227.9 90952021 91235864 91243756 90984529 90518218 89971650 89506274 89257699 89218330 89152706 88805550
1248.2 88805550 88239759 87772495 87557811 87492424 87616789 88224137 89275020 90203291 90612185 90562546
1268.6 90562546 90207422 89604193 88727546 87514907 86062622 84728283 83757925 82955283 81984782
1287 81984782 80750006 79340333 77865320 76407993 75038761 73823678 72802818 71989542 71369445
1305.4 71369445 70907694 70557624 70276362 70041358 69865656 69790179 69870925 70147789 70634162 71356052
1325.8 71356052 72352839 73663449 75274163 77109349 79094952 81229490 83414268 85297680 86684591
1344.1 86684591 87616807 88135821 88277489 88136214 87892801 87762845 87883830 88274306 88894296 89613491
1364.5 89613491 90319073 90982449 91437948 91339821 90505326 89335096 88157016 86968338 85913986
1382.9H5913986q74144o88296k23202J68651N3835l17132j83952O68848J468360J682210
1403.3H7669164J512802J060003O55269N02587M77743M45348L82346L12102K07316
1421.6I3224680J22887Q9783R0903R7740Q7845P7915J41096K32107J88249N4580j13136
1444.1I4294649k02638p8541J35011J50716l2419l10534k79921J39594L21722L46166
1464.5I4483805L58051L62545L54731L42131K85303K46567K47002K33829J91104J37538
1484.9I7242606J10739J18250J32638J13362R0265J02693J22929R9867N8735K2238
1505.2I8214322M0669R4395O8546L4398L0350L8886N126m7171j0198N2732O7949N1988
1529.7I8641992K4891L5005P1574L3897o2740n2339N6875J01965P1407J7327l022n436
$$ plain form
1382.9 85913986 85039842 84351546 84128344 84296995 84350830 84033698 83849746 84518594 85986954 87669164
1403.3 87669164 89181966 90241969 90897238 91399825 91877568 92322916 92705262 93017364 93224680
1421.6 93224680 93347567 93437350 93528253 93625993 93713838 93791753 93932849 94164956 94353205 94407785 94294649
1444.1 94294649 94092011 94013470 94148481 94299197 94266778 93956244 93676323 93815917 94137639 94483805
1464.5 94483805 94841856 95204401 95559132 95901263 96186566 96433133 96680135 96913964 97105068 97242606
1484.9 97242606 97353345 97471595 97604233 97717595 97807860 97910553 98033482 98133349 98192084 98214322
1505.2 98214322 98254991 98349386 98417932 98452330 98482680 98521566 98526692 98479521 98469323 98522055 98590004 98641992
1529.7 98641992 98666883 98701888 98773462 98807359 98744619 98692280 98749155 98851120 98922527 98939854 98936832 98931396
1554.2I8931396m7642k00760k54089q8328o2090o3390k9874L4178Q9490P1108J7333
1576.6I8397332m041j0609l7110p9775j33509j65927j72251j83982k23392k65378k77430
1599.1I6843928k60621k27320k14297k36267k63828k62940k60037l25477l77065k46227
1619.5I4169849j72317k07507j92619j54912j17529o4313m6796m4614K8938R4348J12427
1641.9I3404955J11794J29223J96934K06417K17634K97582K53499J90228J60128J19132
1662.3I5287526O9034J7178o9839j44803j45883j69366j91200j72335k02835k89231
1682.7I3988246l07799r3835J3572k4367p4470j73360k33191k66588l76451l62265
1703.1I2089492l89975m58163m44448m84348n97035p89100j141870j267702j216113
$$ plain form
1554.2 98931396 98883754 98682994 98428905 98340577 98278487 98215097 98185223 98219401 98308891 98379999 98397332
1576.6 98397332 98393291 98382682 98345572 98265797 98132288 97966361 97794110 97610128 97386736 97121358 96843928
1599.1 96843928 96583307 96355987 96141690 95905423 95641595 95378655 95118618 94793141 94416076 94169849
1619.5 94169849 93997532 93790025 93597406 93442494 93324965 93260652 93213856 93169242 93198180 93292528 93404955
1641.9 93404955 93516749 93645972 93842906 94049323 94266957 94564539 94818038 95008266 95168394 95287526
1662.3 95287526 95356560 95373738 95303899 95159096 95013213 94843847 94652647 94480312 94277477 93988246
1682.7 93988246 93680447 93586612 93600184 93575817 93501347 93327987 93094796 92828208 92451757 92089492
1703.1 92089492 91699517 91241354 90796906 90312558 89715523 88926423 87784553 86516851 85300738
1721.5H5300738j423014j598900j542312j422864j256901j314324j209522r76175j293170
1739.8G3263556j781321k166074k542597k755571k628398j796317n46920O14941J629448
1758.2F1290747K274823K579600K152490J500994J153320R16219P88337N55784K04318
1776.5G3416632j05673l10504k92367o3467K56902N87994J031303J579875J728928
1794.9G7829623J614475J576365J499897J276725R89032P74837O44707N75507M98652
1813.2H7279820M15260L84235M02868M18073L94493L51900K95836K82770L07060L07858
1833.6I0840173K90358K75618K54583K10863J56767J12885Q0442L9673J6409M1110
1854I2318881J13749J80847K05689J91426J66929J55008J64259J93405J97315J75953
$$ plain form
1721.5 85300738 83877724 82278824 80736512 79313648 78056747 76742423 75532901 74556726 73263556
1739.8 73263556 71482235 69316161 66773564 64017993 61389595 59593278 59046358 59661299 61290747
1758.2 61290747 63565570 66145170 68297660 69798654 70951974 71868193 72656530 73212314 73416632
1776.5 73416632 73310959 73000455 72708088 72644621 72901523 73489517 74520820 76100695 77829623
1794.9 77829623 79444098 81020463 82520360 83797085 84786117 85560954 86205661 86781168 87279820
1813.2 87279820 87695080 88079315 88482183 88900256 89294749 89646649 89942485 90225255 90532315 90840173
1833.6 90840173 91130531 91406149 91660732 91871595 92028362 92141247 92221689 92261362 92277771 92318881
1854 92318881 92432630 92613477 92819166 93010592 93177521 93332529 93496788 93690193 93887508 94063461
1874.4I4063461J47867J27208J13005J04671J02151R3877Q2755R1231J06836R9307
1894.8I5132369Q7368Q0484P9656P6020N9235L6746K8241L8636M5538L5762K3413M2933
1919.3I5766401P0554P5001P1424P6151Q5753Q1915O1446M7952N7709O7234N5057L9691
1943.8I6556288M7290O3163O3396M0394K0426L0584N2589N2607L0166J9920L3700M7726
1968.3I7058249L5876J2749J4442L9637M9866L1185J7684L0947M6873L4058O068R388
1992.7I7387022M5782N5468K5773N299J8329M0686L6275Q935p51K0677L1817N769k2942
2019.2I7658139k1439j5080j1695J7888M3881M1419L3182J5980n853m471J7059K2411
2043.7I7791421l606l0976k4235K706J0746L827J3333M1503N6428M2248K6053L5059
$$ plain form
1874.4 94063461 94211328 94338536 94451541 94556212 94658363 94752240 94834995 94926226 95033062 95132369
1894.8 95132369 95219737 95300221 95379877 95455897 95515132 95551878 95580119 95618755 95664293 95700055 95723468 95766401
1919.3 95766401 95836955 95911956 95983380 96059531 96145284 96227199 96288645 96336597 96394306 96461540 96516597 96556288
1943.8 96556288 96603578 96666741 96730137 96770531 96790957 96821541 96874130 96926737 96956903 96976823 97010523 97058249
1968.3 97058249 97094125 97106874 97121316 97160953 97210819 97242004 97259688 97290635 97337508 97371566 97377634 97387022
1992.7 97387022 97432804 97488272 97514045 97519344 97537673 97578359 97614634 97623569 97622818 97643495 97675312 97681081 97658139
2019.2 97658139 97636700 97621620 97609925 97627813 97671694 97713113 97746295 97762275 97756422 97751951 97769010 97791421
2043.7 97791421 97787815 97756839 97732604 97735310 97746056 97749883 97763216 97804719 97861147 97903395 97929448 97964507
2068.2I7964507N2518M8107K6524J8823L2163L9148K4754P951J1909K6500K7121J4251
2092.7I8294276J1778K7424L6424K6214J7787K4873L2001K5344J2165Q953J4842J3280
2117.1I8545361m83j3149j5992k1213l4005l1733K432M0358M4471J9741J323L159O831
2143.7I8547101l993j8913r859K0504L7927L0452K2572L4583N1361M5538K0099R721
2168.1I8787093L0810M9090L1352N669J0299K8050J9878o246j0896J0979K4474Q798
2192.6I8989350j0002n54K5689K9385N478q380R310K6333M721k9183k4670Q750K0039
2219.1I9046266L22j2285N478K8777J8907j6433k9034j907K5070J8704O532K4379M7856
2245.6I9162632L6621j132k0909o849M554j1957l0786j5318K1660K8140p815l4767
$$ plain form
2068.2 97964507 98017025 98065132 98091656 98110479 98142642 98181790 98206544 98214495 98226404 98252904 98280025 98294276
2092.7 98294276 98306054 98333478 98369902 98396116 98413903 98438776 98470777 98496121 98508286 98517239 98532081 98545361
2117.1 98545361 98544878 98531729 98515737 98494524 98460519 98428786 98431218 98471576 98516047 98535788 98537111 98540270 98547101
2143.7 98547101 98543108 98524195 98514336 98534840 98572767 98603219 98625791 98660374 98711735 98757273 98777372 98787093
2168.1 98787093 98817903 98866993 98898345 98904014 98914313 98942363 98962241 98955995 98945099 98956078 98980552 98989350
2192.6 98989350 98979348 98978794 99004483 99033868 99039346 99030966 99040276 99066609 99071330 99042147 99017477 99026227 99046266
2219.1 99046266 99046588 99034303 99039781 99068558 99087465 99071032 99041998 99040091 99065161 99083865 99090397 99114776 99162632
2245.6 99162632 99199253 99198121 99177212 99170363 99174917 99162960 99132174 99116856 99138516 99166656 99158841 99124074
2270.1I9124074j4001K4783L1353J1152J2588M0484M8452K0808l910L731K3341K0349
2294.6I9343204j674r388P766K0117l225m3493n1969k7031j4210k6488l4267k0510
2319.1I9138832m655q911j9544j8347o729j913j0902k0689j7053Q732K9260K1816L4833
2345.6I9124730P6794P2253J1510m6677m7147k6345k6363l4213l1275j1230O325J2898
2370.1I9081260J0955P862K1404L5489L5721L3110K6560R781q166j2290L826K4355
2394.5I9269867K9719K8354L2758L9769M1425L2729K1797K2227K5618J7077O967O432
2419I9574739Q660M101n585p766j8M565j055o580P27J1349N257r501p582Q119J3387
2449.6I9592817Q58j3178o670Q845L797j3071j5468l755M465q05j2154r751O366J0312
$$ plain form
2270.1 99124074 99110073 99134856 99166209 99177361 99189949 99230433 99278885 99299693 99295783 99299514 99322855 99343204
2294.6 99343204 99341530 99332142 99339908 99360025 99356800 99313307 99261338 99234307 99220097 99193609 99159342 99138832
2319.1 99138832 99134177 99125266 99105722 99087375 99080646 99078733 99067831 99047142 99030089 99038821 99068081 99089897 99124730
2345.6 99124730 99201524 99273777 99285287 99238610 99191463 99165118 99138755 99104542 99073267 99062037 99068362 99081260
2370.1 99081260 99092215 99100077 99121481 99156970 99192691 99225801 99252361 99262142 99253976 99241686 99245512 99269867
2394.5 99269867 99299586 99327940 99360698 99400467 99441892 99474621 99496418 99518645 99544263 99561340 99568307 99574739
2419 99574739 99583399 99587500 99581915 99574149 99574131 99578696 99577641 99571061 99571788 99583137 99588394 99578893 99571311 99579430 99592817
2449.6 99592817 99593675 99580497 99573827 99582672 99586469 99573398 99557930 99554175 99558640 99557835 99545681 99535930 99542296 99552608
2478.1I9552608o593j7684n228J1158N943j4425k0086m524P730m41j1164j120J6975
2504.7I9513149J4228r030k0403p462L248p403k0546j3327M113N447j4704k9826j6666
2531.2I9400818N997P534m650l308J2786J8131J020j6028j0699K450j759j5306j3864
2557.7I9383122N513J7083L207j6815j8072n257l964k1028l1060j8084L27J467j0240
2584.2I9286199j0610M166J2178K473p456J168J6934J6820N192L802J5223K3073J6612
2610.7I9385774O759R644J7548J0389r382j6826l708R668R549L809K038M399N168R71
2639.3I9435800j084J746J144j388J25N221J1486J2344P188O241J0973J1039L600k86
2667.8I9504149N370R144M118j764p45J538o056j4347r620j431k86l850o312j753K897
$$ plain form
2478.1 99552608 99546015 99528331 99523103 99534261 99540204 99525779 99505693 99501169 99508899 99508458 99497294 99496174 99513149
2504.7 99513149 99527377 99518347 99497944 99490482 99493730 99486327 99465781 99452454 99456567 99462014 99447310 99417484 99400818
2531.2 99400818 99406815 99414349 99409699 99406391 99419177 99437308 99438328 99422300 99411601 99414051 99412292 99396986 99383122
2557.7 99383122 99388635 99405718 99408925 99392110 99374038 99368781 99364817 99343789 99312729 99294645 99294972 99296439 99286199
2584.2 99286199 99275589 99279755 99291933 99294406 99286950 99288118 99305052 99321872 99327064 99330866 99346089 99369162 99385774
2610.7 99385774 99392533 99402177 99419725 99430114 99420732 99403906 99400198 99409866 99419415 99423224 99425262 99429661 99434829 99435800
2639.3 99435800 99434716 99436462 99437606 99436218 99436343 99441564 99453050 99465394 99472582 99478823 99489796 99500835 99504435 99504149
2667.8 99504149 99509519 99518663 99522781 99521017 99520272 99521810 99515754 99501407 99491787 99490356 99490070 99486220 99479908 99478155 99481052
2698.4I9481052k539j0818r895j126L743l350j2851p021Q369J1664l6o920J937O062
2727I9458271j2845l7044m2838l4552k5487j6755l511J6898L0261J3936k1172l6067
2751.4I9289095j6570M554m226k4164k0134P09K384j5950j8823P779K7662O026k6709
2778I9211633k6125m112M17j9062l3062k4385p790q046k6191l4332k5052k2048l7682
2804.5I8944163n0395l4631j3911k4617n2524o1023l8195j3214j9234m1342m2439k2351
2828.9I8530287j3268l0625m7982l7098k9033n8008q9436q3584n5677m8488o8879p9280
2853.4I7888929n9551k7418j9891m8065o7276n4329m6867o1363p2402p3910o7621m9860
2877.9I7240376m5394n4861m6521l3659n1129r1993j15157j03598r2775j07431j15008
$$ plain form
2698.4 99481052 99478513 99467695 99457800 99456674 99460417 99457067 99444216 99437195 99445564 99457228 99457192 99450272 99452209 99458271
2727 99458271 99445426 99408382 99365544 99330992 99305505 99288750 99285239 99302137 99332398 99346334 99325162 99289095
2751.4 99289095 99272525 99277079 99272853 99248689 99228555 99229264 99231648 99215698 99196875 99204654 99232316 99238342 99211633
2778 99211633 99185508 99181396 99181813 99162751 99129689 99105304 99097514 99089468 99063277 99028945 99003893 98981845 98944163
2804.5 98944163 98893768 98859137 98845226 98820609 98768085 98707062 98668867 98655653 98636419 98595077 98552638 98530287
2828.9 98530287 98517019 98486394 98438412 98401314 98372281 98314273 98224837 98141253 98085576 98037088 97968209 97888929
2853.4 97888929 97829378 97801960 97782069 97734004 97666728 97612399 97565532 97504169 97431767 97357857 97290236 97240376
2877.9 97240376 97194982 97140121 97093600 97059941 97008812 96916819 96801662 96698064 96605289 96497858 96382850
2900.3I6382850r3305o9725o7246p3254p0834p2885j08904j81460k61229l35282m30698
2922.8I4618028n90163p56061p16084l18182K79528O97285P37041N38534L05551J04762
2943.2I4900239n5755j31690q9526L4129J51903K17145K44147K43700K21508J82247
2963.6I5918047J38987J17749J17552J21516J12700Q7273P4667O6245K1779k9742m9407
2986I6697366o0934q7398j49977k79605m70263o97202q63051p82842m00137Q3756M03207
3008.4I3392920N05573N12803M93121M29529L30114K47437K16079K04628J74374J44124
3028.8I6650702J25688J06728P6687N0426O0487P5972N4848J6695j853J2493L0130
3051.3I7259003K4062J1164J580j544J3232L1442L4833J8096m584p051J3196M4179
$$ plain form
2900.3 96382850 96289545 96219820 96152574 96079320 96008486 95935601 95826697 95645237 95384008 95048726 94618028
2922.8 94618028 94027865 93271804 92555720 92237538 92517066 93214351 93951392 94489926 94795477 94900239
2943.2 94900239 94844484 94712794 94623268 94657397 94809300 95026445 95270592 95514292 95735800 95918047
2963.6 95918047 96057034 96174783 96292335 96413851 96526551 96613824 96688491 96754736 96776515 96746773 96697366
2986 96697366 96636432 96549034 96399057 96119452 95649189 94951987 94088936 93306094 92905957 92989713 93392920
3008.4 93392920 93898493 94411296 94904417 95333946 95664060 95911497 96127576 96332204 96506578 96650702
3028.8 96650702 96776390 96883118 96959805 97010231 97070718 97146690 97201538 97218233 97216380 97228873 97259003
3051.3 97259003 97283065 97294229 97295809 97294265 97307497 97338939 97373772 97391868 97387284 97380233 97393429 97437608
3075.7I7437608N8019L3617L392o837j1116m661K283j7292l1709r042J9061R650k3025
3102.2I7459948k4998N585J6177p737j2213K0575L5710J0120l4624o3771m6831n597
3126.7I7352344J0192j1533k8777p219K5052J6082l2568n4247k9730p642J532P659
3151.2I7241145r441m1163n3757n0301m3469l2235k6756l6675m5013l7259k9928l8272
3175.7I6796876n2565n4330m6956m6844n3048n8001n8526n5444o0809p4982p5555o3223
3200.1I6096593n8257o1495o8330p2718o7067o1536o7496p3809p2223o9916p2640q0466
3224.6I5270640q3816o9875m2880m1937r0462j25194j03634p7504p0054o1249o2424
3247.1I4441611q1301r0397p3993n4979n7238o4284o1935o0004n0825k4885q214l4838
$$ plain form
3075.7 97437608 97495627 97529244 97532636 97525799 97514683 97510022 97512305 97495013 97463304 97454262 97473323 97482973 97459948
3102.2 97459948 97434950 97440535 97456712 97448975 97436762 97457337 97493047 97503167 97468543 97404772 97357941 97352344
3126.7 97352344 97362536 97351003 97322226 97315007 97340059 97356141 97323573 97269326 97239596 97231954 97233486 97241145
3151.2 97241145 97231704 97190541 97136784 97086483 97043014 97010779 96984023 96947348 96902335 96865076 96835148 96796876
3175.7 96796876 96744311 96689981 96643025 96596181 96543133 96485132 96426606 96371162 96310353 96235371 96159816 96096593
3200.1 96096593 96038336 95976841 95908511 95835793 95768726 95707190 95639694 95565885 95493662 95423746 95351106 95270640
3224.6 95270640 95186824 95116949 95074069 95032132 94941670 94816476 94712842 94635338 94565284 94504035 94441611
3247.1 94441611 94360310 94269913 94195920 94140941 94083703 94019419 93957484 93897480 93846655 93821770 93813556 93778718
3271.5I3778718p2039p6896p0071o8784o9165o5970n8919n5415n4300n9998p4494r2202
3296I2960465j17326j28066r8867o4116q2559j47348j91218j85889j63710j59121j68031
3318.4I1454214j67447j52338j51348j90997k30223k28423k11203j97518j93226k18988
3338.8H9512503k53492k66368k73269k65086k35897k45589k95478l13276k89464k71452
3359.2H6803132k83664k94691k77472k67929l00705l46184l46172l02577k67971k58350
3379.6H3857417k58493k53362k32970j96404j59836j65820k08491k09582j54447j27590
3400H1890422j74212k16508j84483j30874j15698j26165j38641j35272j07932q7113
3420.4H0473524q4632o8808l4326j0872j2142q368R715P260j2713q399K6292O0630
$$ plain form
3271.5 93778718 93706679 93629783 93559712 93490928 93421763 93355793 93296874 93241459 93187159 93127161 93052667 92960465
3296 92960465 92843139 92715073 92616206 92552090 92469531 92322183 92130965 91945076 91781366 91622245 91454214
3318.4 91454214 91286767 91134429 90983081 90792084 90561861 90333438 90122235 89924717 89731491 89512503
3338.8 89512503 89259011 88992643 88719374 88454288 88218391 87972802 87677324 87364048 87074584 86803132
3359.2 86803132 86519468 86224777 85947305 85679376 85378671 85032487 84686315 84383738 84115767 83857417
3379.6 83857417 83598924 83345562 83112592 82916188 82756352 82590532 82382041 82172459 82018012 81890422
3400 81890422 81716210 81499702 81315219 81184345 81068647 80942482 80803841 80668569 80560637 80473524
3420.4 80473524 80388892 80320084 80285758 80274886 80262744 80254376 80264091 80271351 80258638 80250239 80276531 80337161
3444.9H0337161P3546P2694P7349Q8250R9433J10763J15371J05822J05047J24514J33181
3467.3H1443131J13034Q9497R6583J18834J31863J27828J11401J07396J13124J08188
3487.7H2560879J01775J04690J13201J27411J43843J60158J71638J76209J70892J59198
3508.1H3989894J53292J53273J50895J43147J41364J51431J58996J50084J34123J26725
3528.5H5453224J39100J63906J93024K24620K46853K58362K56753K43115K29961K29097
3548.9H7638015K30097K23112K13176K10458K16133K14422J98751J81192K00356K46304
3569.3H9772016K52908K36488K40290K58028K72239K82842K78335K59668K60931K82669
3589.7I2396414K73937K59257K70855K85262K76714K60836K53266K39939K32667K38222
$$ plain form
3444.9 80337161 80410707 80483401 80560750 80649000 80748433 80859196 80974567 81080389 81185436 81309950 81443131
3467.3 81443131 81556165 81645662 81742245 81861079 81992942 82120770 82232171 82339567 82452691 82560879
3487.7 82560879 82662654 82767344 82880545 83007956 83151799 83311957 83483595 83659804 83830696 83989894
3508.1 83989894 84143186 84296459 84447354 84590501 84731865 84883296 85042292 85192376 85326499 85453224
3528.5 85453224 85592324 85756230 85949254 86173874 86420727 86679089 86935842 87178957 87408918 87638015
3548.9 87638015 87868112 88091224 88304400 88514858 88730991 88945413 89144164 89325356 89525712 89772016
3569.3 89772016 90024924 90261412 90501702 90759730 91031969 91314811 91593146 91852814 92113745 92396414
3589.7 92396414 92670351 92929608 93200463 93485725 93762439 94023275 94276541 94516480 94749147 94987369
3610.1I4987369K39700K42257K29955K07132K20155K32756K08664J61195J27685J73223
3630.5I7030091K07591J89859J63668J41913J31953J32817J20890P5138M5240J06632
3650.9I8345792J48893J11586Q9943J05303Q9497O1303N0831J9288k3723J9950M3416
3673.3I9062079k5260J0955Q6516Q6689P9334P1353L6311j848L0416P8327P3951M2564
3697.8I9631387J0300L045L4553M6140J3787l3534l1322L8135O3294L6556J335k1637
3722.3I9792039j6880J1009L9643K5535k8330n3132P791P6294N1361n2869r2543J7131
3746.7I9777049J5205n9754J3626Q6087M8965m17Q261K1005K867p320j2451Q160M7856
3773.3I9949139M5526N335k8032j8650m35K890R108J2481J2994K050j6349q154k4450
$$ plain form
3610.1 94987369 95227069 95469326 95699281 95906413 96126568 96359324 96567988 96729183 96856868 97030091
3630.5 97030091 97237682 97427541 97591209 97733122 97865075 97997892 98118782 98193920 98239160 98345792
3650.9 98345792 98494685 98606271 98696214 98801517 98891014 98952317 99003148 99022436 98998713 99018663 99062079
3673.3 99062079 99036819 99047774 99134290 99220979 99300313 99371666 99407977 99406129 99436545 99514872 99588823 99631387
3697.8 99631387 99641687 99644732 99679285 99725425 99739212 99705678 99674356 99712491 99775785 99812341 99813676 99792039
3722.3 99792039 99775159 99786168 99825811 99851346 99823016 99769884 99777675 99853969 99905330 99852461 99759918 99777049
3746.7 99777049 99792254 99732500 99746126 99832213 99881178 99880761 99889022 99910027 99912894 99905574 99893123 99901283 99949139
3773.3 99949139 99994665 100000000 99971968 99953318 99952883 99955773 99964881 99977362 99990356 99992406 99976057 99967903 99943453
3799.8I9943453m6521L773M148m399M6850N0050j1826m7743j5384l7176l5399L7801
3824.3I9887627M0704J6541k86p040M781k5893o3079j9694K6137M6354N8002L5846
3848.7A00000000m6253j60694o8438J02114R0236J3679m0543k3317L397l5912l8480
3871.2I9795789M553K0844J9145k2054k3389K0725J6123J8698J1242j0115K5880M3803
3895.6I9921244l987m5735m0924j4741K4397M5472L3849K4534J2636j7411k7924q23
3920.1I9910587J0979m053M8Q672l767p325K229j097r536j4389j6606l558N722Q660
3948.7I9886566J8472J5944P415M977N275N501L285L868P188P409N853N770J0789J1688
3977.2A00000000J216j413N907K301n639p486j0216j2583j0770n347
$$ plain form
3799.8 99943453 99896932 99900705 99904853 99900454 99947304 99997354 99985528 99937785 99922401 99885225 99849826 99887627
3824.3 99887627 99928331 99944872 99944586 99937546 99942327 99916434 99853355 99833661 99859798 99906152 99964154 100000000
3848.7 100000000 99953747 99793053 99724615 99826729 99916965 99930644 99890101 99866784 99870181 99834269 99795789
3871.2 99795789 99800342 99821186 99840331 99818277 99794888 99815613 99831736 99850434 99861676 99851561 99877441 99921244
3895.6 99921244 99917257 99871522 99830598 99815857 99840254 99885726 99919575 99944109 99956745 99939334 99911410 99910587
3920.1 99910587 99921566 99917513 99917561 99926233 99922466 99915141 99917370 99916273 99906737 99892348 99875742 99872184 99877906 99886566
3948.7 99886566 99905038 99920982 99928397 99933374 99938649 99944150 99947435 99951303 99958491 99965900 99971753 99977523 99988312 100000000
3977.2 100000000 100001216 99999803 100005710 100008011 100002372 99994886 99984670 99972087 99961317 99955970
3997.6I9955970
$$ plain form
3997.6 99955970
##END=$$ End of the data block
