##TITLE=Ac abietico silanizado $$ Begin of the data block
##JCAMP-DX=5.00 $$ ACD/SpecManager v 10.08
##SPECTROMETER/DATA SYSTEM=Alpha
##DATE=26 May 2015 13:33:38
##DATA TYPE=INFRARED SPECTRUM
##DATA CLASS=XYDATA
##ORIGIN=
##OWNER=
##NPOINTS=1667
##FIRSTX=599.64648438
##LASTX=3997.64306641
##MAXX=3997.64306641
##MINX=599.64648438
##MAXY=1.01106584
##MINY=0.40053329
##XFACTOR=1.0000000000
##YFACTOR=0.000000010000000
##FIRSTY=1.00000000
##DELTAX=2.03961372
##XUNITS=1/CM
##YUNITS=ARBITRARY UNITS
##XYDATA=(X++(Y..Y))
599.6A00000000J106584j106584o30021j281726j555425j600904j540321j424473j190621
$$ 100000000 101106584 100000000 99369979 98088253 96532828 94931924 93391603 91967130 90776509
618I0776509r19694p44342o70493o64574p27296q34781r83786j098913j075590r57227
$$ 90776509 89856815 89112473 88441980 87777406 87050110 86215329 85231543 84132630 83057040 82099813
638.4H2099813q69053q66187r42129j050717j078534j050543r80098q30054o84756
$$ 82099813 81230760 80364573 79422444 78371727 77293193 76242650 75262552 74432498 73747742
656.8G3747742p17741j067901j898467l008026l753585l176534k130359j809162j060695
$$ 73747742 73030001 71962100 70063633 67055607 63302022 60125488 57995129 56185967 55125272
675.1E5125272P1037J029027J613181J736206J502788J167631R46600Q70537Q57103
$$ 55125272 55196309 56225336 57838517 59574723 61077511 62245142 63191742 64062279 64919382
693.5F4919382Q72606R11820R80145J071584J136619J169241J164567J135099J069862
$$ 64919382 65791988 66703808 67683953 68755537 69892156 71061397 72225964 73361063 74430925
711.8G4430925R65953P95370N76210M23205L30353J59198l0500j06746j02788m8578
$$ 74430925 75396878 76192248 76768458 77191663 77522016 77681214 77650714 77543968 77441180 77392602
732.2G7392602P1466K39837M17560O02818P63726Q93396R99284J069755J110845J112247
$$ 77392602 77464068 77703905 78121465 78724283 79488009 80381405 81380689 82450444 83561289 84673536
752.6H4673536J087814J052487R95052R11200Q05688O65003N03129L20661J36399k2816
$$ 84673536 85761350 86813837 87808889 88720089 89525777 90190780 90693909 91014570 91150969 91128153
773I1128153j70982l35133n53567q88806j457197k385515l649163m605990m139269
$$ 91128153 90957171 90622038 90068471 89179665 87722468 85336953 81687790 77081800 72942531
791.4G2942531k165401k94858J00863n79858j195216j204533o77621J83648J153421
$$ 72942531 70777130 70482272 70583135 70003277 68808061 67603528 66925907 67109555 68262976
809.7F8262976K014405K631271K954697K982945K766174K437168K113879J829171J584482
$$ 68262976 70277381 72908652 75863349 78846294 81612468 84049636 86163515 87992686 89577168
828.1H9577168J395399J226210J043892Q71718P17777N93489N30619N03939M87536
$$ 89577168 90972567 92198777 93242669 94114387 94832164 95425653 95956272 96460211 96947747
846.4I6947747M88174M80551M57990M28969L78489K91956K02828J46026J05572O0159
$$ 96947747 97435921 97916472 98374462 98803431 99181920 99473876 99676704 99822730 99928302 99988461
866.8I9988461J1539J26255J01256P0512L0709J5604J0777p320k8670m1818l4464k1183
$$ 99988461 100000000 100126255 100227511 100298023 100328732 100344336 100355113 100347793 100319123 100277305 100242841 100221658
891.3A00221658k1470k8205k3520j3649k3449m7159o4206m613k8319n3823p2437q4019
$$ 100221658 100200188 100171983 100148463 100134814 100111365 100064206 100000000 99995387 99967068 99913245 99840808 99756789
915.8I9756789q5825p2163l6692O747K4557Q690j4329l5459o8295j09940j35798j35964
$$ 99756789 99670964 99598801 99562109 99568856 99593413 99602103 99587774 99552315 99484020 99374080 99238282 99102318
940.3I9102318j31595j28007j17451j02555q9127p5615o3634n3894m4233m7391n8151
$$ 99102318 98970723 98842716 98725265 98622710 98533583 98457968 98394334 98340440 98296207 98248816 98190665
962.7I8190665o5863p2497p4703p4595p7593q4782r9426j10537j11866j16658j30791
$$ 98190665 98124802 98052305 97977602 97903007 97825414 97740632 97641206 97530669 97418803 97302145 97171354
985.1I7171354j56289j84625k02388k05606k00606j91509j87809j98072k16436k44785
$$ 97171354 97015065 96830440 96628052 96422446 96221840 96030331 95842522 95644450 95428014 95183229
1005.5I5183229k76804k97081l04270l07113l08764l27956l89988m79561n22476m23521
$$ 95183229 94906425 94609344 94305074 93997961 93689197 93361241 92971253 92491692 91969216 91545695
1025.9I1545695k14994p6842r3377j75720k55508l24451l75963m15986m47810m73017
$$ 91545695 91330701 91253859 91160482 90984762 90729254 90404803 90028840 89612854 89165044 88692027
1046.3H8692027n12498n68503o11377o30015o22946n85568n30106m73476m25440m04542
$$ 88692027 88179529 87611026 86999649 86369634 85746688 85161120 84631014 84157538 83732098 83327556
1066.7H3327556m04585l91596l64071l38555l29053l47114l91948m55493n25504n91970
$$ 83327556 82922971 82531375 82167304 81828749 81499696 81152582 80760634 80305141 79779637 79187667
1087.1G9187667o57820p33292q28475r44549j065254j170171j250970j315582j375776
$$ 79187667 78529847 77796555 76968080 76023531 74958277 73788106 72537136 71221554 69845778
1105.5F9845778j453305j572984j738179j946211k186989k427316k632451k753985
$$ 69845778 68392473 66819489 65081310 63135099 60948110 58520794 55888343 53134358
1121.8E3134358k689803k351534j783165j114080m45908J00326L43973K24984p5248
$$ 53134358 50444555 48093021 46309856 45195776 44749868 44850194 45194167 45419151 45343903
1140.1D5343903l31453m71520n30219n45454n32806n00602m51898l93293l46958l08147
$$ 45343903 45012450 44540930 44010711 43465257 42932451 42431849 41979951 41586658 41239700 40931553
1160.5D0931553k52864j83264j18672p8980n5572l5608l1954m2256m1670k6143j1241
$$ 40931553 40678689 40495425 40376753 40297773 40242201 40206593 40174639 40132383 40090713 40064570 40053329
1183D0053329K169J4437J9085J8594K0158K6751L4815L9172M2328M2471M0320M4537
$$ 40053329 40055498 40069935 40089020 40107614 40127772 40154523 40189338 40228510 40270838 40313309 40353629 40398166
1207.5D0398166M9835M9317M3839L6529K9716K9236M0656P0650J37653K69658M87700
$$ 40398166 40448001 40497318 40541157 40577686 40607402 40636638 40677294 40747944 40885597 41155255 41642955
1229.9D1642955P63527J028651J227247J351345J433852J522464J646128J789802J905871
$$ 41642955 42406482 43435133 44662380 46013725 47447577 48970041 50616169 52405971 54311842
1248.2E4311842J952600J935876J877951J782787J648671J492404J337570J210887
$$ 54311842 56264442 58200318 60078269 61861056 63509727 65002131 66339701 67550588
1264.6F7550588J117599J010149Q55363O62261M62139K88832J54900N3394k7132q5354
$$ 67550588 68668187 69678336 70533699 71195960 71658099 71946931 72101831 72155225 72128093 72042739
1285G2042739j19656j61624k28995l03256l80636m38362m61769m64827m25726l11023
$$ 72042739 71923083 71761459 71532464 71229208 70848572 70410210 69948441 69483614 69057888 68746865
1305.4F8746865j15556J03283K73496L69090L77482L31432K65401J77884J04416O3652
$$ 68746865 68631309 68734592 69008088 69377178 69754660 70086092 70351493 70529377 70633793 70697445
1325.8G0697445L0291m226l8290q1057j13070q8417n5254j00588j51974j42193j19424
$$ 70697445 70727736 70723510 70685220 70604163 70491093 70402676 70347422 70246834 70094860 69952667 69833243
1348.2F9833243j02055r1839q8483r9957j33318j16741m2165o5750j54620j66088k00373
$$ 69833243 69731188 69639349 69550866 69450909 69317591 69200850 69158685 69092935 68938315 68772227 68571854
1370.6F8571854k29240j92529k11084k18784j55378r8389J6975K78241L80224K14237
$$ 68571854 68342614 68150085 67939001 67720217 67564839 67466450 67483425 67761666 68141890 68356127
1391F8356127K39765M24785M29165M04745L45034K64013L22264K89464J95646J77098
$$ 68356127 68595892 69020677 69449842 69854587 70199621 70463634 70785898 71075362 71271008 71448106
1411.4G1448106J17939J7250J28555L63302J85562l1507n2220r1249o6465j34236k97886
$$ 71448106 71566045 71583295 71711850 72075152 72260714 72229207 72176987 72085738 72019273 71885037 71587151
1433.9G1587151j98036j99640o27607r23026j039391j054562r07903p36106o42943
$$ 71587151 71389115 71189475 70561868 69638842 68599451 67544889 66636986 65900880 65257937
1452.2F5257937m20225L89093J014292M72051K76846P82639R78368O23608O29699J133305
$$ 65257937 64837712 65226805 66241097 66713148 66989994 67772633 68751001 69374609 70004308 71137613
1472.6G1137613J214260Q69447O77794O15031N38438L95417L45499M52167M37527J63758
$$ 71137613 72351873 73221320 73899114 74514145 75052583 75448000 75793499 76245666 76683193 76846951
1493G6846951J22780L77083L55404N9265j40190J27590O18666K97308n9444j6951R6214
$$ 76846951 76969731 77346814 77702218 77761483 77621293 77748883 78367549 78664857 78605413 78588462 78684676
1515.4G8684676J52051J82289L68756L41874J90628K12002J24323J31154K71672P1585
$$ 78684676 78836727 79019016 79387772 79729646 79920274 80132276 80256599 80387753 80659425 80731010
1535.8H0731010o6709L12680L95900P7057m5830p5174n0526n9933j34510j89858J56772
$$ 80731010 80664301 80976981 81372881 81449938 81404108 81328934 81278408 81218475 81083965 80894107 81050879
1558.3H1050879M11910q1778k73448j96564j18447r3168k93052k76828j484j49012
$$ 81050879 81462789 81381011 81107563 80910999 80792552 80699384 80406332 80129504 80128020 79979008
1578.7G9979008m07850m44371m71055n36704n76383n79506n53197n24038n30660n54329
$$ 79979008 79571158 79126787 78655732 78119028 77542645 76963139 76409942 75885904 75355244 74800915
1599.1G4800915n57387n59092o01780o37430o58846p79563r68230q89915p74187j169771
$$ 74800915 74243528 73684436 73082656 72445226 71786380 71006817 70038587 69148672 68374485 67204714
1619.5F7204714j446033j467001j737493k128411k454412k628922k066219o71160k2924
$$ 67204714 65758681 64291680 62554187 60425776 57971364 55342442 53276223 52605063 52582139
1637.8E2582139j39064J48899R13083K471197L047210J702881J825350K644068R56076
$$ 52582139 52443075 52591974 53505057 55976254 59023464 60726345 62551695 65195763 66151839
1656.2F6151839r1415P629K37054J22541k54863j55193p743l60775m09400l37851p03150
$$ 66151839 66060424 66068053 66305107 66427648 66172785 66017592 66009849 65649074 65239674 64901823 64198673
1678.6F4198673r76891o69544o8039m06558q22329p35855p47824m72706l11166l01135
$$ 64198673 63221782 62552238 62484199 62077641 61255312 60519457 59771633 59298927 58987761 58686626
1699E8686626k1291m95493p03937m12285m54301n56701n54359l08735K09541N447o50912
$$ 58686626 58665335 58169842 57465905 57053620 56599319 56042618 55488259 55179524 55389065 55394512 54743600
1721.5E4743600o84512n29390n50336o39707n64551J81144K19882n88107n39065m53680
$$ 54743600 54059088 53529698 52979362 52339655 51775104 51956248 52176130 51588023 51048958 50595278
1741.9E0595278q69969j190403j167905l16289J054322J966325K682644K828568K244353
$$ 50595278 49725309 48534906 47367001 47050712 48105034 50071359 52754003 55582571 57826924
1760.2E7826924J870239J270163P52026P14105P76613J048750R38988N11163N06049
$$ 57826924 59697163 60967326 61719352 62433457 63210070 64258820 65197808 65708971 66215020
1778.6F6215020O66619O49869O24436N80961M68612O88898J098806J020443Q43734
$$ 66215020 66881639 67531508 68155944 68736905 69205517 69894415 70993221 72013664 72857398
1796.9G2857398J032042J271576J290375J203132J191598J249188J291907J206094
$$ 72857398 73889440 75161016 76451391 77654523 78846121 80095309 81387216 82593310
1813.2H2593310J072246J020711R78554R10091Q97056R20582Q43924Q10140P75469
$$ 82593310 83665556 84686267 85664821 86574912 87471968 88392550 89236474 90046614 90822083
1831.6I0822083O26164N42587N19658M56470M01282M62252M89098L94690L45802L48789
$$ 90822083 91448247 91990834 92510492 92966962 93368244 93830496 94319594 94714284 95060086 95408875
1852I5408875L51858L59380L73155L90100L99882L78698L42345L39753L38167K75951
$$ 95408875 95760733 96120113 96493268 96883368 97283250 97661948 98004293 98344046 98682213 98958164
1872.4I8958164K18899J88750J56080J26523J03653Q9091O7454M2641L0917J7828J3363
$$ 98958164 99177063 99365813 99521893 99648416 99752069 99841160 99908614 99951255 99982172 100000000 100013363
1894.8A00013363k634k1857n1725q2767j17648j58328j91229k05350k16979k23857
$$ 100013363 100010729 99988872 99937147 99854380 99736732 99578404 99387175 99181825 98964846 98740989
1915.2I8740989k13641j90318j68502j33699p6586l708P4602J18512J07288N4610q166
$$ 98740989 98527348 98337030 98168528 98034829 97958243 97954535 98029137 98147649 98254937 98309547 98301381
1937.7I8301381o4445r2244p9608m7511o324M3023Q0728Q5432O2132K9248K628j9216
$$ 98301381 98236936 98144692 98065084 98017573 98011249 98054272 98135000 98220432 98282564 98311812 98314440 98295224
1962.1I8295224m0329o0296q0293j08153j43987j78861k07168k28376k47621k53791
$$ 98295224 98254895 98194599 98114306 98006153 97862166 97683305 97476137 97247761 97000140 96746349
1982.5I6746349k38037k10500j78962j35631q2701k8169L2454R3371J39028J64467
$$ 96746349 96508312 96297812 96118850 95983219 95900518 95872349 95904803 95998174 96137202 96301669
2002.9I6301669J71989J58995J38033J17874R1422O7544O5499P9590R3228J10257J28132
$$ 96301669 96473658 96632653 96770686 96888560 96979982 97047526 97113025 97192615 97285843 97396100 97524232
2025.4I7524232J38920J37204J24085J07080R2250P2586M0126J3018j913j4431k9486
$$ 97524232 97663152 97800356 97924441 98031521 98123771 98196357 98236483 98249501 98247588 98233157 98203671
2047.8I8203671m2784n0307n0836m4006m9609p6533j07860j28281j22089p4666Q440
$$ 98203671 98160887 98110580 98059744 98015738 97966129 97889596 97781736 97653455 97531366 97456700 97465140
2070.2I7465140R8401J62756J90914J87534J58203J13845P3337M5467J8936r465l6031
$$ 97465140 97563541 97726297 97917211 98104745 98262948 98376793 98450130 98495597 98514533 98505068 98469037
2092.7I8469037o4147r6637j33246j70016k02787k23363k16078j69087r5451k4217
$$ 98469037 98404890 98308253 98175007 98004991 97802204 97578841 97362763 97193676 97098225 97074008
2113.1I7074008K3735M7028M9448L2538J2356J210L224J8329L0696K6363Q834j1689
$$ 97074008 97097743 97144771 97194219 97226757 97239113 97240323 97243547 97261876 97292572 97318935 97327769 97316080
2137.5I7316080l8504p3511j00314j15723j20461j01673n9474j2374K4480N0986O9034
$$ 97316080 97277576 97204065 97103751 96988028 96867567 96765894 96706420 96694046 96718526 96769512 96838546
2160I6838546Q1956Q6969P7737O4099N8740N5611M0174J9466Q929N758m482k0862l7002
$$ 96838546 96920502 97007471 97085208 97149307 97208047 97263658 97303832 97323298 97332227 97337985 97333503 97312641 97275639
2186.5I7275639n0515n1743m9979n9574o9607p4196q6319j03659j13111j18119j25587
$$ 97275639 97225124 97173381 97123402 97063828 96994221 96920025 96833706 96730047 96616936 96498817 96373230
2208.9I6373230j42324j70362k00182k24948k47592k79629l15898l30312l16494k75392
$$ 96373230 96230906 96060544 95860362 95635414 95387822 95108193 94792295 94461983 94145489 93870097
2229.3I3870097k09003j40620r6249q9771j26034j96492k77394l59744m44436n13745
$$ 93870097 93661094 93520474 93424225 93334454 93208420 93011928 92734534 92374790 91930354 91416609
2249.7I1416609n47433n27411m31276k58809m8161J54680L09062L75861L52222K81805
$$ 91416609 90869176 90341765 89910489 89651680 89603519 89758199 90067261 90443122 90795344 91077149
2270.1I1077149K05892J38766Q1813L2079k2512r2203j76346k66612l40503l82423
$$ 91077149 91283041 91421807 91503620 91535699 91513187 91420984 91244638 90978026 90637523 90255100
2290.5I0255100l98869l85898l33798k50512j54156p2896l1317k1302j2923J002K080
$$ 90255100 89856231 89470333 89136535 88886023 88731867 88658971 88627654 88606352 88593429 88594431 88596511
2312.9H8596511n8639k17056l81190m13358l15708k47628k81965k82884j62375n8174
$$ 88596511 88537872 88320816 87939626 87526268 87210560 86962932 86680967 86398083 86235708 86177534
2333.3H6177534q8537j44231j12212R799L01606P25179N83929k12437q71688r61035
$$ 86177534 86088997 85944766 85832554 85842353 86143959 86869138 87453067 87240630 86368942 85407907
2353.7H5407907p02793m20534j31309J37496L40897M90725N90646O25414O01607N52118
$$ 85407907 84705114 84284580 84153271 84290767 84631664 85122389 85713035 86338449 86940056 87492174
2374.1H7492174N17124N02163M74155M01431L07697K35695J95777J71316J46061J19776
$$ 87492174 88009298 88511461 88985616 89387047 89694744 89930439 90126216 90297532 90443593 90563369
2394.5I0563369J01006Q7124O4260L3742P516j1313k6506m6671p3856r1838r2215q2952
$$ 90563369 90664375 90751499 90815759 90849501 90857017 90845704 90819198 90772527 90698671 90606833 90514618 90431666
2419I0431666p0130m7416P09P0006J36518J87421K22475K38371K45869K57843K60741
$$ 90431666 90361536 90314120 90314829 90384835 90521353 90708774 90931249 91169620 91415489 91673332 91934073
2441.4I1934073K47908K33632K16335J86419J55259J31601J11925Q8984O4641N0706
$$ 91934073 92181981 92415613 92631948 92818367 92973626 93105227 93217152 93306136 93370777 93421483
2461.8I3421483M6116M4775M3744L8093K6083J3846M811o301k0921l4743m8155o7151
$$ 93421483 93467599 93512374 93556118 93594211 93620294 93634140 93638951 93632650 93611729 93576986 93528831 93461680
2486.3I3461680q4048r1267j05482j36119j62876j72740j68240j44613j12992q7160
$$ 93461680 93377632 93286365 93180883 93044764 92881888 92709148 92540908 92396295 92283303 92196143
2506.7I2196143o3569m4059k4289p522o384j2946j9741k5189k5434k1702j5491j2320
$$ 92196143 92132574 92088515 92064226 92056704 92050320 92037374 92017633 91992444 91967010 91945308 91929817 91917497
2531.2I1917497j6141j5330r829r966j1480j2588j5223j0068k706j6612m0656m8733
$$ 91917497 91901356 91886026 91876197 91866231 91854751 91842163 91826940 91816872 91814166 91797554 91756898 91708165
2555.6I1708165n0109o1029p9167r7132j13726j36065j68061j96493k15072k32541
$$ 91708165 91658056 91597027 91517860 91420728 91307002 91170937 91002876 90806383 90591311 90358770
2576I0358770k40994k20757j70517j00720k4361M3214R9718J38408J48577J35660J12456
$$ 90358770 90117776 89897019 89726502 89625782 89601421 89644635 89744353 89882761 90031338 90166998 90279454
2598.5I0279454Q9830O9285N1224L3188J3452j329r304j5289k3526l2520m0293m6479
$$ 90279454 90369284 90438569 90489793 90522981 90536433 90535104 90525800 90510511 90486985 90454465 90414172 90367693
2623I0367693n3066n7489n8073o1869o2919o0195o0069o4636p3081o8670n5790n1576
$$ 90367693 90314627 90257138 90199065 90137196 90074277 90014082 89954013 89889377 89816296 89747626 89691836 89640260
2647.4H9640260m8411m2099l4660k6721j9663j4770j7494k3032k4074k4289k6732l1871
$$ 89640260 89591849 89549750 89515090 89488369 89468706 89453936 89436442 89413410 89389336 89365047 89338315 89306444
2671.9H9306444l4815l3730l7641n5343q1455r7931j01799j12462j28978j43242j72639
$$ 89306444 89271629 89237899 89200258 89144915 89063460 88965529 88863730 88751268 88622290 88479048 88306409
2694.3H8306409k16305k57939k96432l36111l78561m21285m64589n10496n54108n93740
$$ 88306409 88090104 87832165 87535733 87199622 86821061 86399776 85935187 85424691 84870583 84276843
2714.7H4276843o34599o62213o65683o64341o69939o84195o99371o95223o77335o71143
$$ 84276843 83642244 82980031 82314348 81650007 80980068 80295873 79596502 78901279 78223944 77552801
2735.1G7552801o79981o92362p04038p04986o81376o43486n93305m94522l32433j42020
$$ 77552801 76872820 76180458 75476420 74771434 74090058 73446572 72853267 72358745 72026312 71884292
2755.5G1884292L3617J76174K88755L80915M68951N62573O59048P57367Q36587Q70293
$$ 71884292 71917909 72094083 72382838 72763753 73232704 73795277 74454325 75211692 76048279 76918572
2775.9G6918572Q78269Q73434Q31813P57223O79773N90086M61859L35312K57069J96850
$$ 76918572 77796841 78670275 79502088 80259311 80939084 81529170 81991029 82326341 82583410 82780260
2796.3H2780260J04147j3018j06924j76436k45339l12269l93736m92179n80454o91092
$$ 82780260 82884407 82871389 82764465 82588029 82342690 82030421 81636685 81144506 80564052 79872960
2816.7G9872960q61180j067609j298624j554048j782340j899165j811200j430947p93725
$$ 79872960 79011780 77944171 76645547 75091499 73309159 71409994 69598794 68167847 67374122
2835.1F7374122j04093L90976O29980P35235P55626O83301N85074N38248N31834N12218
$$ 67374122 67270029 67661005 68290985 69026220 69781846 70465147 71050221 71588469 72120303 72632521
2855.5G2632521M77153M31478L63338L01868K79850K82961L13628L66121L61514L07179
$$ 72632521 73109674 73541152 73904490 74206358 74486208 74769169 75082797 75448918 75810432 76117611
2875.9G6117611L20452L90315M40497M67425M57579M18913L84999L58003L18563K37101
$$ 76117611 76438063 76828378 77268875 77736300 78193879 78612792 78997791 79355794 79674357 79911458
2896.3G9911458J35845P4769L8719j0127n3239p0995o8778r8216j88566k62218k61116
$$ 79911458 80047303 80122072 80160791 80150664 80097425 80026430 79957652 79859436 79670870 79408652 79147536
2918.7G9147536k13266j50692r5272n1958k8825m8458p1228n4300l0040k4730n979
$$ 79147536 78934270 78783578 78688306 78636348 78607523 78559065 78487837 78433537 78403497 78378767 78372788
2941.1G8372788K4575R340m9376q8239q0001q1527j20867j31327r5945p5519q8722
$$ 78372788 78397363 78406703 78357327 78269088 78189087 78107560 77986693 77855366 77759421 77683902 77595180
2963.6G7595180r8896r6142r0468p6497q3309j34695j72793j84375k32226k80368k60002
$$ 77595180 77496284 77400142 77309674 77233177 77149868 77015173 76842380 76658005 76425779 76145411 75885409
2986G5885409k05088j53833j45930k04414k48254k71398l09389l13259l10486l17037
$$ 75885409 75680321 75526488 75380558 75176144 74927890 74656492 74347103 74033844 73723358 73406321
3006.4G3406321k74176k26527k70927l88891m78506m93526m62294m25249m28331m64821
$$ 73406321 73132145 72905618 72634691 72245800 71767294 71273768 70811474 70386225 69957894 69493073
3026.8F9493073m55445m09782m02444m52567m98789m57311l96543m32009n28079n66620
$$ 69493073 69037628 68627846 68225402 67772835 67274046 66816735 66420192 65988183 65460104 64893484
3047.2F4893484n15920m90844n29736n42432n47016n75137n67258n27781n10543n60225
$$ 64893484 64377564 63886720 63356984 62814552 62267536 61692399 61125141 60597360 60086817 59526592
3067.6E9526592o50179o76221o06024m74667l70771l88670m22967l66640l08215k58970
$$ 59526592 58876413 58200192 57594168 57119501 56748730 56360060 55937093 55570453 55262238 55003268
3088E5003268k16073k29204k07579j28931r1076j04761j47754j63549r9111p6210j71840
$$ 55003268 54787195 54557991 54350412 54221481 54130405 54025644 53877890 53714341 53615230 53539020 53367180
3110.4E3367180j95831r8169r5946k13337l25930l94022l81506l10230k71017k87801
$$ 53367180 53171349 53073180 52977234 52763897 52437967 52043945 51662439 51352209 51081192 50793391
3130.8E0793391l07989k87586k33454k34934l27519l77953l35491k79987k17133j68592
$$ 50793391 50485402 50197816 49964362 49729428 49401909 49023956 48688465 48408478 48191345 48022753
3151.2D8022753k31019l40616l43693k67696k06029j84539j89335j90574j78888j62959
$$ 48022753 47791734 47451118 47107425 46839729 46633700 46449161 46259826 46069252 45890364 45727405
3171.6D5727405j61263j59339j29878j22517j41421j29345j15759j24511j33657j39833
$$ 45727405 45566142 45406803 45276925 45154408 45012987 44883642 44767883 44643372 44509715 44369882
3192D4369882j34202j09014r2242j05667j15189j01515q8665p9009o1673k7710R465
$$ 44369882 44235680 44126666 44034424 43928757 43813568 43712053 43623388 43544379 43482706 43454996 43464461
3214.4D3464461J3229R555J6954J2494Q872J5816L6597P5784P2757j5632p7739o5285
$$ 43464461 43477690 43487245 43504199 43516693 43525565 43541381 43577978 43653762 43726519 43710887 43633148 43567863
3238.9D3567863o0490l3098L9834L8376m7079p2357j5309J2115j6523j7708J570p176
$$ 43567863 43507373 43474275 43514109 43552485 43505406 43433049 43417740 43429855 43413332 43395624 43397194 43390018
3263.4D3390018l529L3575N5659K2176j2284j6117k1956j7041K632K2223L8958N6803
$$ 43390018 43386489 43420064 43475723 43497899 43485615 43469498 43447542 43430501 43433133 43455356 43494314 43551117
3287.8D3551117Q3688R1565N1203k301l1426j9476N0160J09563O0546n2765j23674
$$ 43551117 43634805 43726370 43777573 43775272 43743846 43724370 43774530 43884093 43944639 43891874 43768200
3310.3D3768200j17793p2286m5749l5498j2773K3016L3116j4728n9032n0554j8561
$$ 43768200 43650407 43578121 43532372 43496874 43484101 43507117 43540233 43525505 43466473 43415919 43397358
3332.7D3397358L4547P6222L6812j2833j2549k0281Q20O7079M7511m6272m9045K2769
$$ 43397358 43431905 43508127 43544939 43532106 43519557 43499276 43500096 43567175 43614686 43568414 43519369 43542138
3357.2D3542138O0129O3324Q0299J41716J79935J10316J437Q40R5376J66813J80966
$$ 43542138 43602267 43665591 43745890 43887606 44067541 44177857 44179294 44180134 44275510 44442323 44623289
3379.6D4623289J82440K35829L00554L41531M08989M42607M02426M38029N71778O42187
$$ 44623289 44805729 45041558 45342112 45683643 46092632 46535239 46937665 47375694 47947472 48589659
3400D8589659O19778O06444O88678Q01641Q31723Q16918Q04859P73889P96896Q95751
$$ 48589659 49209437 49815881 50504559 51306200 52137923 52954841 53759700 54533589 55330485 56226236
3420.4E6226236R28264Q97933R16206R43619R08649Q68327Q48561P86424P10523P17652
$$ 56226236 57154500 58052433 58968639 59912258 60820907 61689234 62537795 63324219 64034742 64752394
3440.8F4752394P76571Q63725J019311J098859J112759J214779J319766J357221J357794
$$ 64752394 65528965 66392690 67412001 68510860 69623619 70838398 72158164 73515385 74873179
3459.2G4873179J343489J321870J301444J270455J170045J039588R94253J012040R80293
$$ 74873179 76216668 77538538 78839982 80110437 81280482 82320070 83314323 84326363 85306656
3477.5H5306656R01211Q47232Q00586P42548P02006O58012O04307N73987N59550N06557
$$ 85306656 86207867 87055099 87855685 88598233 89300239 89958251 90562558 91136545 91696095 92202652
3497.9I2202652M51451M63998M38369L43531L14176L49140L62504L14224K34723K01857
$$ 92202652 92654103 93118101 93556470 93900001 94214177 94563317 94925821 95240045 95474768 95676625
3518.3I5676625K31397K65014K19548J46538J51610J52606J18166J34927J43403P8821
$$ 95676625 95908022 96173036 96392584 96539122 96690732 96843338 96961504 97096431 97239834 97318655
3538.7I7318655M8876R9886J48206R4426j9675L004P6741K5648j2303L9262L0488q2165
$$ 97318655 97367531 97467417 97615623 97710049 97690374 97693378 97770119 97795767 97783464 97822726 97853214 97771049
3563.2I7771049k0475K45887K12217m6504p1281K4015M5866M5430J3566n3358J1218
$$ 97771049 97750574 97996461 98208678 98162174 98090893 98114908 98160774 98206204 98219770 98166412 98177630
3585.6I8177630J69575P1460j21993o0135P7188Q8108O1249R054j01143r6118P8600
$$ 98177630 98347205 98418665 98296672 98236537 98313725 98401833 98463082 98472136 98370993 98274875 98353475
3608.1I8353475J44601Q6630J061j09405O7973K32453o5858l94588k75219L79121N30494
$$ 98353475 98498076 98584706 98585767 98476362 98544335 98776788 98710930 98316342 98041123 98420244 98950738
3630.5I8950738L3068n6624L3784M5395M5424p4785k33049n3221N10878N12671j38080
$$ 98950738 98983806 98927182 98960966 99006361 99051785 98977000 98743951 98690730 99201608 99714279 99576199
3652.9I9576199j69825K43330J67727r6554j86812k68269k31177J30660J57785j07133
$$ 99576199 99406374 99649704 99817431 99720877 99534065 99265796 99034619 99165279 99323064 99215931
3673.3I9215931K75922L66830p4398j73336k21783k08736K04617M66526J00046j48028
$$ 99215931 99491853 99858683 99784285 99610949 99389166 99180430 99385047 99851573 99951619 99803591
3693.7I9803591j19996j22214n3900J27101N5074j85287j71250J59777M70596J79917
$$ 99803591 99683595 99561381 99507481 99634582 99689656 99504369 99333119 99492896 99963492 100143409
3714.1A00143409k40404k69782j23322l3391j6951k6906j60014j79571O5547L33190
$$ 100143409 99903005 99633223 99509901 99476510 99459559 99432653 99272639 99093068 99158615 99491805
3734.5I9491805M46981O1214n45251l49081L74168O6900k16782L65609L82674j53953
$$ 99491805 99938786 100000000 99454749 99105668 99479836 99546736 99329954 99695563 100078237 99924284
3754.9I9924284k37137J5295N8925p2473n0563J168J09071J29074q6540j64158l749
$$ 99924284 99687147 99702442 99761367 99688894 99638331 99639499 99748570 99877644 99791104 99626946 99623197
3777.3I9623197J36501R060p9715M2843M8793k2406q5240j15592k6983j06740l4266
$$ 99623197 99759698 99768758 99689043 99731886 99780679 99758273 99673033 99557441 99530458 99423718 99389452
3799.8I9389452K99400L7706k0737K82049l8933m28051k04074K18051L2121Q2058L79866
$$ 99389452 99688852 99726558 99705821 99987870 99948937 99520886 99316812 99534863 99566984 99649042 100028908
3822.2A00028908K1160j68455j22440j18923p6449q9824J07670L25715R2638o7151
$$ 100028908 100050068 99881613 99759173 99640250 99563801 99473977 99581647 99907362 100000000 99932849
3842.6I9932849j8763k07108n76097n29832N28789J066953N543n29999l07142N0372
$$ 99932849 99914086 99706978 99130881 98601049 99129838 100196791 100202334 99672335 99365193 99415565
3863I9415565J11997j20288P0041L01778P9537r3752j91927k4540R0087j6523J63103
$$ 99415565 99527562 99407274 99477315 99779093 99858630 99764878 99572951 99548411 99638498 99621975 99785078
3885.4I9785078K6422j64294J50675J10864k71302k52700K5988J97404K80869J80209
$$ 99785078 99811500 99647206 99797881 99908745 99637443 99384743 99410731 99608135 99889004 100069213
3905.8A00069213n9271j17308r6005j02431K6435J42247L3032o6739K2495M5413p3368
$$ 100069213 100009942 99892634 99796629 99694198 99720633 99862880 99895912 99829173 99851668 99897081 99823713
3928.3I9823713l8546J17099J02490l1966j12378p5102M7261N7363J2684N3960M3422
$$ 99823713 99785167 99902266 100004756 99972790 99860412 99785310 99832571 99889934 99902618 99956578 100000000
3950.7A00000000k6298l2585M232K1857L3211K1327k1219k4140J5330L2473L2007L6860
$$ 100000000 99973702 99941117 99945349 99967206 100000417 100021744 100000525 99976385 99991715 100024188 100056195 100093055
3975.2A00093055J3363o437K9981N5909q82n2357o675M2045J3530j1647Q869
$$ 100093055 100106418 100099981 100129962 100185871 100184989 100132632 100125957 100168002 100181532 100169885 100178754
3997.6A00178754
$$ 100178754
##END=$$ End of the data block
