##TITLE=AXSIZE PM 18S Lote 3803L $$ Begin of the data block
##JCAMP-DX=5.00 $$ ACD/SpecManager v 10.08
##SPECTROMETER/DATA SYSTEM=Alpha
##DATE=10 Jul 2014 09:55:42
##DATA TYPE=INFRARED SPECTRUM
##DATA CLASS=XYDATA
##ORIGIN=
##OWNER=
##NPOINTS=1667
##FIRSTX=599.63549805
##LASTX=3997.56909180
##MAXX=3997.56909180
##MINX=599.63549805
##MAXY=1.12180853
##MINY=0.12397157
##XFACTOR=1.0000000000
##YFACTOR=0.000000010000000
##FIRSTY=1.03607202
##DELTAX=2.03957605
##XUNITS=1/CM
##YUNITS=ARBITRARY UNITS
##XYDATA=(X++(Y..Y))
599.6 103607202 103470635 103262389 103018808 102786636 102622843 102548814 102547371 102558780 102529371 102410984 102151430
622.1 102151430 101794159 101464188 101244211 101142812 101122653 101108634 101021826 100880682 100759447 100668526
642.5 100668526 100615513 100623357 100679684 100751996 100800574 100813222 100792253 100736201 100642776 100497222 100224090
664.9 100224090 99769938 99656618 100073040 100395954 100546098 100637472 100727701 100837564 100958276 101101017
685.3 101101017 101266456 101453722 101668906 101868439 102011132 102081251 102058280 101935470 101711571 101348269
705.7 101348269 100798845 100030959 99006635 97671908 95962811 93908983 91874725 90505260 90056014
724 90056014 90208340 90616930 91194910 92019624 93115389 94362992 95614100 96791762 97876424
742.4 97876424 98856807 99727327 100483072 101127207 101678991 102132022 102472854 102725017 102907169 103033495
762.8 103033495 103130484 103202808 103252375 103301215 103339434 103329289 103283751 103233635 103164709 103078806 103022742 103003490
787.3 103003490 102992570 103012395 103081751 103152430 103189242 103220534 103286052 103394723 103531039 103659904 103747630
809.7 103747630 103772938 103734493 103672743 103624511 103607678 103644860 103721631 103805733 103905809 104018319 104120779
832.1 104120779 104238212 104375374 104478896 104524672 104534435 104517758 104466188 104387045 104287815 104163754 104005623
854.6 104005623 103825653 103648758 103471220 103282762 103067565 102824652 102583957 102344418 102076936 101765728
875 101765728 101389217 100908256 100264859 99354440 98058891 96313715 94112438 91471064 88394189
893.3 88394189 84872025 80920154 76608551 72046381 67385662 62865150 58789933 55394638 52756178
911.7 52756178 50849187 49662551 49285942 49865115 51499343 54191595 57838947 62235665 67077345
930 67077345 72000945 76648390 80745846 84169948 86922318 89061582 90646523 91717207 92338598
948.4 92338598 92618597 92673576 92576629 92324507 91832173 90938044 89475709 87418795 85014892 82729822
968.8 82729822 80934978 79707706 79060090 79199457 80332804 82327855 84737593 87089974 89076889
987.2 89076889 90562624 91537112 92076343 92322350 92441821 92556393 92724746 92967284 93272942 93604058
1007.5 93604058 93911242 94153333 94304895 94338107 94220740 93929559 93453878 92809892 92058426 91293037
1027.9 91293037 90590024 89939398 89226091 88331217 87224799 85922486 84420717 82642615 80465293
1046.3 80465293 77881205 75040191 72148824 69403261 66947877 64836925 63061035 61634558
1062.6 61634558 60668331 60401970 61113608 62966335 65904611 69634271 73719734 77737623 81416541
1081 81416541 84669816 87514162 89983290 92103821 93896246 95385373 96604383 97582757 98357081
1099.3 98357081 98982960 99514765 99989891 100426006 100803697 101085019 101263368 101351976 101346374 101243651
1119.7 101243651 101072025 100904870 100843501 100953925 101217282 101546144 101850033 102082300 102248025 102376294
1140.1 102376294 102482390 102558625 102595937 102592385 102543461 102450347 102316332 102134812 101898849 101619470 101323462
1162.6 101323462 101027739 100735581 100457668 100205719 99972075 99747247 99537832 99333060 99086744 98735297
1182.9 98735297 98218030 97492051 96525675 95329702 93966585 92494798 90947074 89323550 87596381
1201.3 87596381 85744834 83792925 81818438 79910278 78133237 76533955 75153887 74032295
1217.6 74032295 73214442 72748768 72661591 72953469 73608285 74603444 75908935 77467060 79177082
1236 79177082 80927521 82627696 84212017 85633409 86851335 87865859 88719618 89460778 90134889
1254.3 90134889 90782452 91410995 91992259 92508250 92972851 93420762 93882412 94350225 94776249 95124263
1274.7 95124263 95405167 95657665 95904994 96140659 96348745 96516043 96646452 96786964 97010404 97353762
1295.1 97353762 97794265 98277110 98752481 99177104 99524981 99806267 100059819 100319779 100590181 100859022
1315.5 100859022 101112485 101340294 101527798 101664686 101742971 101768148 101772010 101784539 101807582 101820099 101819110
1338 101819110 101856840 102005672 102233815 102424252 102512300 102552855 102634680 102771628 102903497 102964973 102920508
1360.4 102920508 102741396 102455878 102142751 101840973 101500690 100824070 99492389 98064142 97693014
1378.7 97693014 98785895 100619388 102289021 103523338 104321027 104756236 104973269 105012572 104836667
1397.1 104836667 104378462 103594720 102394772 100639594 98590755 96664643 95204723 94640303 95114160
1415.5 95114160 96516937 98521298 100186479 101202631 101677620 101584482 100942469 99936962 98865926
1433.8 98865926 97717452 96605825 95828706 95195293 94501722 93631554 92350084 90550739 88325709
1452.2 88325709 85938603 83568227 81815469 81033868 80405706 79594749 79726166 82328814 87687737
1470.5 87687737 94782835 100095403 102549160 103754723 104505157 105035365 105422938 105729818 105994046
1488.9 105994046 106198704 106345904 106478977 106611323 106704855 106779540 106872702 106991732 107077563 107093382
1509.3 107093382 107117283 107168639 107234490 107291675 107326317 107350492 107380676 107403719 107416129 107437730 107477367
1531.7 107477367 107514381 107550979 107613063 107673621 107682240 107673812 107675278 107686365 107709384 107739186 107776606 107820284
1556.2 107820284 107834458 107790256 107764542 107773638 107799482 107821572 107822335 107830596 107858396 107871914 107855237 107842433
1580.7 107842433 107844532 107849205 107850981 107845962 107835162 107821608 107802916 107781565 107765758 107749116 107726038 107699978
1605.1 107699978 107671690 107634723 107591164 107563436 107541990 107498693 107456362 107434392 107409656 107376420 107336497
1627.6 107336497 107287419 107250023 107209706 107107842 106967425 106868660 106812799 106795442 106781065 106737173 106696928
1650 106696928 106628919 106479764 106357658 106264114 106131005 105943942 105792868 105797601 105977070 106272101 106526351
1672.4 106526351 106696022 106793022 106822407 106820619 106772053 106633198 106469691 106327426 106182122 106049371
1692.8 106049371 105878365 105645621 105370367 104987395 104636467 104305494 103953576 103675544 103481734 103334188
1713.2 103334188 103192818 102982640 102711892 102451229 102143717 101765728 101338053 100880969 100396776 99762022
1733.6 99762022 99075365 98517990 97874373 97098774 96265990 95287585 94091463 92518485 90652168
1752 90652168 88764930 86584014 83920723 80793780 76708472 71917999 66345465 59296370 50844562
1770.3 50844562 40851822 31499770 24654813 19490372 15695128 13389641 12397157 12559697 13855329
1788.7 13855329 16836327 22281162 29450226 37449610 46210682 54946852 62406969 68262827
1805 68262827 72970229 76882982 80148947 82793599 84904391 86646873 88039690 89086294 89840573
1823.4 89840573 90346521 90613675 90651613 90472037 90130758 89642084 88986760 88218445 87338090 86153579
1843.8 86153579 84673375 83088464 81253457 79012471 76286763 73092264 69694674 66699600
1860.1 66699600 64969057 65224391 67759955 72587270 78680021 84410083 89369124 93519527 96764594
1878.4 96764594 99218756 101058531 102460349 103542221 104423845 105156076 105735457 106209326 106619835
1896.8 106619835 106973338 107279313 107548451 107782137 107993650 108191490 108374834 108535373 108679867 108808601
1917.2 108808601 108920455 109021521 109113467 109191561 109259820 109327114 109385085 109436464 109485090 109531975 109579337
1939.6 109579337 109629416 109661520 109671342 109691536 109732580 109783971 109835374 109885466 109936845 109993839 110052145 110110390
1964.1 110110390 110162461 110201800 110235941 110269272 110298991 110323930 110346830 110363340 110377121 110395157 110413444
1986.5 110413444 110422564 110423911 110422087 110417008 110410058 110400414 110383987 110360777 110341465 110319543 110284197 110244954 110212636
2013 110212636 110183406 110154021 110137033 110139918 110151732 110161257 110171247 110187340 110212064 110238016 110254622 110269058
2037.5 110269058 110294986 110325348 110346675 110363579 110378599 110389185 110400343 110416293 110432160 110440230 110441613 110440135
2062 110440135 110430896 110420871 110423756 110428572 110423005 110415721 110410833 110399389 110382438 110370576 110360944 110346007 110329616
2088.5 110329616 110314107 110296309 110274076 110250354 110227263 110201573 110170913 110133159 110088670 110045481 110003793
2110.9 110003793 109955084 109901917 109852147 109805644 109760988 109724474 109692466 109661293 109639060 109622443 109606254
2133.4 109606254 109593999 109584367 109569228 109551346 109536171 109523404 109516716 109518456 109529722 109544170 109553301 109560907
2157.9 109560907 109574676 109589934 109598041 109603858 109614718 109629059 109643924 109654284 109658682 109667099 109682047 109696484
2182.3 109696484 109708893 109717059 109718430 109719431 109722626 109724331 109726274 109731317 109735596 109737217 109739411 109745491 109757912 109767926
2210.9 109767926 109762979 109745741 109733224 109734678 109741926 109741700 109728217 109709787 109695935 109691036 109690142 109678900 109658432
2237.4 109658432 109643006 109634590 109629130 109620559 109598494 109567928 109540176 109512854 109480667 109446669 109414613 109379792
2261.9 109379792 109341776 109311056 109293127 109286296 109286749 109285915 109280384 109281075 109294879 109307396 109302807 109284651 109259295
2288.4 109259295 109222150 109176791 109136188 109100640 109059811 109005356 108932304 108835375 108716130 108591795 108482599
2310.8 108482599 108393514 108306134 108181012 108001232 107806671 107656443 107553315 107445681 107331765 107268000
2331.2 107268000 107257760 107237029 107172060 107092142 107053077 107119846 107368255 107663345 107721734 107462251 107042527
2353.6 107042527 106671107 106419563 106319010 106375873 106543899 106778359 107068944 107404935 107763720 108120346
2374 108120346 108454454 108771944 109077322 109338498 109523141 109630275 109679627 109700227 109711242 109711409 109704101
2396.5 109704101 109695566 109681261 109663844 109649575 109642053 109652209 109683144 109713018 109727073 109742057 109767711 109799647
2421 109799647 109835005 109861863 109878469 109901559 109930050 109951341 109969532 109989691 110007787 110020661 110029268 110035717
2445.4 110035717 110045338 110057545 110068274 110080075 110084021 110076618 110069311 110062063 110054040 110048378 110044217 110045266 110050178
2471.9 110050178 110048354 110039568 110034096 110031259 110022104 110014319 110021341 110032690 110031009 110022271 110014057 110003686 110000122 110004127
2500.5 110004127 110002089 109994686 109985447 109972644 109957910 109945357 109939027 109928203 109902740 109880733 109878969 109881520 109872758
2527 109872758 109862947 109853375 109839964 109832764 109831107 109831774 109840465 109849894 109849989 109844720 109840930 109839237 109833014 109817839 109805357
2557.6 109805357 109803605 109800673 109788263 109774196 109766686 109760141 109744775 109718382 109688151 109662938 109643281 109628654
2582.1 109628654 109617317 109601045 109575856 109551907 109541297 109539545 109528089 109506667 109493661 109488881 109483492 109474754
2606.6 109474754 109460890 109444487 109428430 109413528 109401429 109390879 109375644 109350550 109323406 109310055 109304488 109288263
2631 109288263 109261799 109237897 109220529 109206784 109193659 109174597 109150660 109129190 109106278 109076083 109041452 108998334
2655.5 108998334 108949840 108912325 108876443 108822489 108758390 108706534 108670962 108642066 108619297 108603513 108595705 108603466
2680 108603466 108630419 108667803 108701718 108730233 108763969 108807695 108858049 108912134 108959866 108984506 108986294 108981991
2704.5 108981991 108972657 108949435 108921683 108896089 108862686 108825207 108784342 108722389 108636999 108537173 108443761 108384264
2728.9 108384264 108363736 108376908 108418024 108479369 108552444 108619952 108664775 108683610 108686483 108697975 108732486 108767462
2753.4 108767462 108775020 108754373 108727300 108704543 108674073 108629751 108574498 108510900 108426845 108314288 108206379
2775.8 108206379 108115911 108005404 107865691 107715595 107552171 107377553 107212079 107056582 106885755 106679690
2796.2 106679690 106452930 106231558 106005347 105746150 105446017 105112350 104761398 104403341 104009449 103536928
2816.6 103536928 102976811 102329147 101574123 100684559 99631917 98377162 96848911 94942605 92519844
2835 92519844 89363801 85168660 79616106 72589934 64428693 55912870 48046008 41927227 38574648
2853.3 38574648 38514188 41529131 46760246 52998263 58971757 63563168 66168034 67129064 67659068
2871.7 67659068 68907148 71022731 73282945 74911469 75574684 75298297 74239761 72581631 70512867
2890.1 70512867 68221116 65856963 63494563 61130857 58731455 56249744 53593361 50626570
2906.4 50626570 47224912 43314865 38886991 34045139 29082718 24475642 20735823 18250427
2922.7 18250427 17162432 17400277 18788256 21126361 24359426 28508818 33440194 38840410 44274715
2941 44274715 49200255 53030419 55278414 55799353 54978532 53598619 52514589 52358443 53391904
2959.4 53391904 55606186 58860028 62922537 67464858 72091597 76470435 80394387 83767259
2975.7 83767259 86582208 88888061 90780026 92347407 93646103 94739443 95697790 96566904 97361112
2994.1 97361112 98084575 98755711 99399793 100018382 100605309 101165140 101694059 102192008 102672446 103133595
3014.5 103133595 103559816 103938937 104256809 104509497 104715669 104896200 105054522 105203795 105371881 105571163
3034.9 105571163 105792236 106010675 106218374 106433773 106675398 106925786 107144070 107335448 107523930 107693338
3055.3 107693338 107833314 107957458 108059466 108126366 108172083 108232534 108316958 108390868 108434069 108446908 108438909
3077.7 108438909 108455086 108523297 108613169 108700144 108782494 108859372 108936942 109011078 109065819 109096622 109122050
3100.1 109122050 109161067 109195948 109213006 109234130 109269440 109295428 109293568 109286106 109299016 109341764 109412277 109481442
3124.6 109481442 109522569 109537840 109553850 109586477 109615076 109612811 109591591 109599090 109641778 109678245 109687817 109671104
3149.1 109671104 109643459 109648168 109700322 109756863 109784734 109790206 109794223 109817290 109850621 109863901 109856820 109849107
3173.5 109849107 109855616 109872842 109883785 109904957 109940445 109949470 109935570 109939444 109958541 109976339 109992969 110008824
3198 110008824 110024154 110036933 110052240 110078156 110113811 110142064 110146582 110141981 110147429 110162532 110183907 110205483
3222.5 110205483 110224855 110247540 110253537 110213411 110163128 110181475 110259891 110320497 110345876 110350192 110326266 110303593
3247 110303593 110323477 110357308 110363436 110357320 110375333 110414350 110438430 110444391 110446560 110425162 110378182 110360432 110393584
3273.5 110393584 110437536 110466754 110487771 110512757 110539937 110555542 110549104 110521090 110488689 110474265 110490417 110531247
3298 110531247 110564268 110553968 110505497 110463774 110469091 110518742 110574293 110617065 110653508 110679245 110691488 110683441
3322.4 110683441 110656273 110650051 110683167 110717952 110730422 110712373 110658371 110626447 110649717 110682833 110716200 110736072
3346.9 110736072 110712636 110704219 110752141 110793817 110791051 110775185 110775936 110777760 110740364 110683990 110675275 110733438 110810864
3373.4 110810864 110852492 110856271 110856414 110877657 110911477 110936427 110923517 110863531 110829234 110872090 110919416 110888290
3397.9 110888290 110823774 110839784 110931420 110987854 110983801 110979199 110993075 111022472 111069512 111102128 111114633 111137295
3422.4 111137295 111147285 111121953 111094236 111090922 111087346 111056495 111048543 111111128 111196733 111246932 111257493 111255741
3446.8 111255741 111271477 111304975 111329663 111333084 111318350 111287856 111267161 111259711 111225522 111178219 111192322 111277103
3471.3 111277103 111348748 111360812 111331391 111307383 111341751 111396074 111402750 111400545 111430871 111458623 111458766 111429584
3495.8 111429584 111389256 111363745 111363375 111419749 111520457 111591613 111590838 111533761 111504352 111557686 111634123 111644030
3520.3 111644030 111579585 111558831 111645353 111734605 111759889 111729348 111639583 111581671 111621320 111615705 111494899
3542.7 111494899 111426306 111551011 111730182 111813140 111871684 111926699 111914492 111846864 111817288 111938810 112145996
3565.1 112145996 112180853 112007260 111901009 111925983 111941242 111883378 111753476 111561549 111378491 111332572
3585.5 111332572 111430860 111422992 111286616 111188078 111051381 110795701 110554326 110402250 110301280 110260689
3605.9 110260689 110236478 110144711 110020268 109880507 109757888 109668267 109533012 109412158 109409714 109513855
3626.3 109513855 109628904 109632599 109609985 109659386 109756517 109863245 109972072 110099471 110276377 110491526
3646.7 110491526 110594487 110541952 110546124 110619712 110632467 110597098 110647047 110775065 110896063 111012256 111125696
3669.2 111125696 111183298 111235285 111294091 111267996 111209202 111182344 111190176 111216676 111224842 111229897 111266398 111290431
3693.6 111290431 111303365 111344278 111402977 111433220 111443603 111502445 111621642 111758244 111811459 111756611 111714911
3716.1 111714911 111723757 111740804 111756337 111777306 111769700 111759567 111815274 111895931 111872351 111713314 111578012
3738.5 111578012 111603701 111758590 111851835 111817849 111797011 111731732 111574244 111451530 111396575 111371267 111359143
3760.9 111359143 111363471 111362219 111341929 111316693 111283410 111254680 111245453 111232197 111213875 111220968 111234713 111223173
3785.4 111223173 111194468 111170769 111173713 111205924 111238277 111269188 111305583 111298001 111254907 111219537 111181629 111162734
3809.9 111162734 111180139 111220109 111255288 111267471 111245430 111191428 111168325 111170459 111162722 111154759 111142290 111130679
3834.4 111130679 111144269 111170852 111172175 111133611 111079931 111069906 111136174 111248934 111312306 111236191 111143410
3856.8 111143410 111111939 111121702 111153090 111173832 111185932 111207020 111197281 111148036 111118507 111135292 111163664 111165202
3881.3 111165202 111143386 111127543 111133897 111136365 111115599 111105824 111137044 111186266 111208820 111189890 111141598 111082375
3905.7 111082375 111051261 111058998 111082458 111104059 111117065 111128211 111139166 111127377 111094558 111075985 111088943 111110675
3930.2 111110675 111112607 111105347 111109066 111116600 111129081 111146832 111155760 111157918 111150479 111129951 111114812 111120188 111138904
3956.7 111138904 111148751 111142528 111132312 111128259 111131287 111131811 111121857 111109865 111106098 111113465 111122787 111125815 111124849 111122739
3985.3 111122739 111124349 111128998 111140573 111157393 111165595 111164713
3997.5 111164713
##END=$$ End of the data block
