##TITLE=AXSIZE PM 10S Lote 38678 $$ Begin of the data block
##JCAMP-DX=5.00 $$ ACD/SpecManager v 10.08
##SPECTROMETER/DATA SYSTEM=Alpha
##DATE=10 Jul 2014 09:55:42
##DATA TYPE=INFRARED SPECTRUM
##DATA CLASS=XYDATA
##ORIGIN=
##OWNER=
##NPOINTS=1667
##FIRSTX=599.63549805
##LASTX=3997.56909180
##MAXX=3997.56909180
##MINX=599.63549805
##MAXY=1.12100697
##MINY=0.33116776
##XFACTOR=1.0000000000
##YFACTOR=0.000000010000000
##FIRSTY=1.08315170
##DELTAX=2.03957605
##XUNITS=1/CM
##YUNITS=ARBITRARY UNITS
##XYDATA=(X++(Y..Y))
599.6A08315170o7067j05012j21724r9385m4429j9014J0681L6537K206p7176j64485
$$ 108315170 108248103 108143091 108021367 107921982 107877553 107858539 107869220 107905757 107907963 107830787 107666302
622.1A07666302k15936j93787j12998l2866J0347J8800j1301n4503o6066m9484j7738
$$ 107666302 107450366 107256579 107143581 107110715 107121062 107139862 107128561 107074058 107007992 106958508 106940770
644.5A06940770K8610O9082O9130M0197Q821k2590l6513n4706r5069j20187j17838
$$ 106940770 106969380 107038462 107107592 107147789 107156610 107134020 107097507 107042801 106947732 106827545 106709707
666.9A06709707R370J51038J33848Q1098M9019N8901P8261O8355P4053J10232J29974
$$ 106709707 106719077 106870115 107003963 107085061 107134080 107192981 107271242 107339597 107413650 107523882 107653856
689.4A07653856J27280J17636J00958N8162k3806j10149j68288k18499l05378m59123
$$ 107653856 107781136 107898772 107999730 108057892 108034086 107923937 107755649 107537150 107231772 106772649
709.8A06772649o37555q19027j060939j308131j306963r01890l49951K7251K07091
$$ 106772649 106135094 105316067 104255128 102946997 101640034 100738144 100388193 100415444 100622535
728.1A00622535L36027N27525P30681Q21984Q07381P61199P07412O45685N70655M79924
$$ 100622535 100958562 101486087 102216768 103038752 103846133 104607332 105314744 105960429 106531084 107011008
748.5A07011008L95286L41058K85125K04241J36352R2613O7974N5897L3831J5903J6284
$$ 107011008 107406294 107747352 108032477 108236718 108373070 108465683 108533657 108589554 108623385 108639288 108655572
771A08655572J1825p927l1984l5786k8134l8886n0878l4225P534L2270L0636K6954
$$ 108655572 108667397 108659470 108627486 108591700 108563566 108524680 108473802 108439577 108447111 108479381 108510017 108536971
795.4A08536971J1468n007R501L9243N7149O1489M4918O544k7549l9315l5596k2972
$$ 108536971 108548439 108543432 108552933 108592176 108649325 108710814 108755732 108762276 108734727 108695412 108659816 108636844
819.9A08636844K515K9958M3094M8947M7720M3630O3563P3266L3545o926j7142k5237
$$ 108636844 108639359 108669317 108712411 108761358 108809078 108852708 108916271 108989537 109023082 109016156 108999014 108973777
844.4A08973777m4846o8414q5688r4879j14500j30916j21796j13702j22356j45483
$$ 108973777 108928931 108860517 108774829 108679950 108565450 108434534 108312738 108199036 108076680 107931197
864.8A07931197j70434j74796j69659j76060j96505k40028l10015m11630n73015q01981
$$ 107931197 107760763 107585967 107416308 107240248 107043743 106803715 106493700 106082070 105509055 104707074
885.2A04707074j082754j382482j674581j976263k302480k636349k941805l188563
$$ 104707074 103624320 102241838 100567257 98590994 96288514 93652165 90710360 87521797
901.5H7521797l350257l337551l052079k532834j931930j357966q01236j96719M99427
$$ 87521797 84171540 80833989 77781910 75249076 73317146 71959180 71157944 70961225 71460652
919.8G1460652J271475K046251K738577L262395L528780L486561L177482K717084K213681
$$ 71460652 72732127 74778378 77516955 80779350 84308130 87794691 90972173 93689257 95902938
938.2I5902938J738363J329678R84103O65951L65114J25110k0754j01912j76502k97713
$$ 95902938 97641301 98970979 99955082 100621033 100986147 101111257 101090503 100988591 100812089 100514376
958.6A00514376n23317q85755j307958j579094j511872j168060p73156l85183J26291
$$ 100514376 99991059 99105304 97797346 96218252 94706380 93538320 92765164 92379981 92506272
977I2506272P63350J303929J552248J495099J240093R09787N83822L16834J41347N9724
$$ 92506272 93269622 94573551 96125799 97620898 98860991 99770778 100354600 100671434 100812781 100872505
997.3A00872505N3847Q9824J32847J65259J85073J80435J43302Q1503L374r1982k09046
$$ 100872505 100926352 101016176 101149023 101314282 101499355 101679790 101823092 101904595 101907969 101815987 101606941
1019.8A01606941l36635m46725n08940n17571m80753m30447m47440n55110o98066q46362
$$ 101606941 101270306 100823581 100314641 99797070 99316317 98885870 98438430 97883320 97185254 96338892
1040.2I6338892j004094j208055j474428j730692j897890j938939j837259j624197
$$ 96338892 95334798 94126743 92652315 90921623 89023733 87084794 85247535 83623338
1056.5H3623338j382965j170826r59516o55937j69092N05936J281994K011770K528793
$$ 83623338 82240373 81069547 80110031 79454094 79285002 79790938 81072932 83084702 85613495
1074.9H5613495K724552K626324K370399K078003J803899J549244J301437J059950
$$ 85613495 88338047 90964371 93334770 95412773 97216672 98765916 100067353 101127303
1091.2A01127303Q48591O85871N48565M30226L57390L20923K85709K43771J92821J32430
$$ 101127303 101975894 102661765 103210330 103640556 103997946 104318869 104604578 104848349 105041170 105173600
1111.6A05173600P6544K3198l4273r0062j28365j19066m8387N9080J43683J68252J50728
$$ 105173600 105250144 105273342 105239069 105149007 105020642 104901576 104853189 104912269 105055952 105224204 105374932
1134A05374932J11974P4470N8341N1963L3903Q059j3817m0328p4768j02735j22678
$$ 105374932 105486906 105561376 105619717 105671680 105705583 105713642 105699825 105659497 105584729 105481994 105359316
1156.4A05359316j50752j82390j98102j95396j86074j76728j63948j53232j50251j40882
$$ 105359316 105208564 105026174 104828072 104632676 104446602 104269874 104105926 103952694 103802443 103661561
1176.8A03661561j28937j48129k12908l09837m27878n66780p06351q15976q95452r57018
$$ 103661561 103532624 103384495 103171587 102861750 102433872 101867092 101160741 100344765 99449313 98492295
1197.2I8492295j013780j085180j170755j244419j275504j243645j157755j037949
$$ 98492295 97478515 96393335 95222580 93978161 92702657 91459012 90301257 89263308
1213.5H9263308q92270p28726n38784l05253m7642K02113M37778O61147Q59087J008183
$$ 89263308 88371038 87642312 87103528 86798275 86750633 86952746 87390524 88051671 88910758 89918941
1233.9H9918941J089627J102948J059639R78870Q73893P48700O25205N25504M53651
$$ 89918941 91008568 92111516 93171155 94150025 95023918 95772618 96397823 96923327 97376978
1252.3I7376978M08942L92115L81666L48276L00682K70134K65575K72762K73419K45058
$$ 97376978 97785920 98178035 98559701 98907977 99208659 99478793 99744368 100017130 100290549 100535607
1272.7A00535607J95170J59681J46830J38044J30546J27459J10996Q0168P7235J29319
$$ 100535607 100730777 100890458 101037288 101175332 101305878 101433337 101544333 101624501 101701736 101831055
1293.1A01831055K03323K56443K77627K72500K47109K06423J60003J35052J42765J56152
$$ 101831055 102034378 102290821 102568448 102840948 103088057 103294480 103454483 103589535 103732300 103888452
1313.5A03888452J57273J49298J25789Q7202N4836K7311O235L147J2219K1612L3152
$$ 103888452 104045725 104195023 104320812 104408014 104462850 104490161 104496396 104499543 104511762 104533374 104566526
1335.9A04566526M6504M1127N4896J00052J02258N7221L2961N2512Q1598Q0955N9975
$$ 104566526 104613030 104654157 104709053 104809105 104911363 104968584 105001545 105054057 105135655 105216610 105276585
1358.3A05276585K9361o4051j83344k04039j73855j87838l65317p65669q79562k89953
$$ 105276585 105305946 105241895 105058551 104854512 104680657 104492819 104127502 103361833 102482271 102192318
1378.7A02192318N63705J027131R91631P59780M67432K59101J88578R5236p8797k89023
$$ 102192318 102756023 103783154 104774785 105534565 106001997 106261098 106449676 106544912 106466115 106177092
1399.1A06177092m90845o91759j000929j212001j150358q69393l37780L18134R16398
$$ 106177092 105686247 104994488 103993559 102781558 101631200 100761807 100424027 100742161 101658559
1417.5A01658559J203704R16028N56934K69949k7645l26442n58639n67031n78570o59895
$$ 101658559 102862263 103778291 104335225 104605174 104577529 104251087 103692448 103125417 102546847 101886952
1437.9A01886952n38683m13275l99136m72021p35647j090926j324946j335603j273739
$$ 101886952 101348269 100934994 100535858 100063837 99328190 98237264 96912318 95576715 94302976
1456.2I4302976j075297o25921m31877m49413Q2898J552272L261357M262245L051710
$$ 94302976 93227679 92601758 92169881 91720468 91803366 93355638 96616995 100879240 103930950
1474.6A03930950J301849O11413M05287L10862K69819K87795K50399P5245L207J08516
$$ 103930950 105232799 105844212 106249499 106560361 106830180 107117975 107368374 107443619 107446826 107555342
1495A07555342J48010J7869j7273J26195L27933K22504j67537j68597l934J21986J31989
$$ 107555342 107703352 107721221 107703948 107830143 108158076 108380580 108213043 108044446 108040512 108162498 108294487
1517.4A08294487R7227N0533n4467q2350p5101l0303O9880N8568K6834J93166K78986
$$ 108294487 108391714 108442247 108387780 108305430 108230329 108200026 108269906 108328474 108355308 108548474 108827460
1539.9A08827460m6456k40469j85263o4683J7094M3703J08134K31529K31576k18893
$$ 108827460 108781004 108540535 108355272 108290589 108307683 108351386 108459520 108691049 108922625 108703732
1560.3A08703732l11768r2864L1686O7616k0230m9186O3157K6131j27304r7930k6274
$$ 108703732 108391964 108299100 108330786 108398402 108378172 108328986 108392143 108418274 108290970 108193040 108166766
1582.7A08166766j0574p319q35p74k134j1397k7847k3723j4233j8215j3531l683k1899
$$ 108166766 108156192 108148873 108148038 108147264 108145130 108133733 108105886 108082163 108067930 108049715 108036184 108032501 108010602
1609.2A08010602l8958K0242Q3280k0898j02031N01K3699n5790p9072q1515j1623J13463
$$ 108010602 107971644 107991886 108075166 108054268 107952237 107952738 107976437 107920647 107841575 107760060 107748437 107861900
1633.7A07861900M1390k15674k12526o3395R7191J59204p713m0591R6786j30415l53861
$$ 107861900 107903290 107687616 107475090 107411695 107508886 107668090 107660377 107619786 107716572 107586157 107232296
1656.1A07232296j99997o7007o2514j12974N447J99795K04539Q8549N0306r179j7261
$$ 107232296 107032299 106965292 106902778 106789804 106795251 106995046 107199585 107288134 107338440 107329261 107312000
1678.6A07312000Q3887J41251p5161k96581k19238j46949n6910K5653j4293j18243
$$ 107312000 107395887 107537138 107461977 107165396 106946158 106799209 106742299 106767952 106753659 106635416
1699A06635416l21115l57782k78223k95103k54952j28913k98O8128p3290l16918l12388
$$ 106635416 106314301 105956519 105678296 105383193 105128241 104999328 104999030 105067158 104993868 104676950 104364562
1721.4A04364562k45810k41076k34747k02978j72901k98107m92895m14812l86846m70531
$$ 104364562 104118752 103877676 103642929 103439951 103267050 102968943 102476048 102061236 101674390 101203859
1741.8A01203859n06139n45371o31535r04774j197410j226026j349318j638448j953584
$$ 101203859 100697720 100152349 99520814 98616040 97418630 96192604 94843286 93204838 91251254
1760.1I1251254k629656l189259l788013m934966o274170q055097q250850o700805
$$ 91251254 88621598 85432339 81644326 76709360 70435190 62380093 54129243 47428438
1776.5D7428438n572009m470974k939517j329162K12392J710740L664308O076643P193944
$$ 47428438 41856429 37385455 34445938 33116776 33329168 35039908 38704216 44780859 51974803
1794.8E1974803P271356P340866O802809N441076M065299L184038K609992K128023
$$ 51974803 59246159 66587025 73389834 78830910 82896209 86080247 88690239 90818262
1811.1I0818262J670218J317095J085824Q54379O50668N03427L50791J88250K7215
$$ 90818262 92488480 93805575 94891399 95745778 96396446 96899873 97250664 97438914 97466129
1829.5I7466129j64777k66582l08674l98755m58771m76051o47592r18478j040882j184815
$$ 97466129 97301352 97034770 96726096 96327341 95868570 95392519 94744927 93826449 92785567 91600752
1849.9I1600752j429051j747710k077430k240873k001106j164568J92553J752156L216189
$$ 91600752 90171701 88423991 86346561 84105688 82104582 80940014 81132567 82884723 86100912
1868.2H6100912L869015L500962K975095K463632J903594J420748J053465Q03601O32167
$$ 86100912 89969927 93470889 96445984 98909616 100813210 102233958 103287423 104091024 104723191
1886.6A04723191N15831L98612L02255K54571K13123J83248J69456J51933J33836J29926
$$ 104723191 105239022 105637634 105939889 106194460 106407583 106590831 106760287 106912220 107046056 107175982
1907A07175982J21439R4258P8678J01293J06859O8819M8018M0710J9419K1434L8445
$$ 107175982 107297421 107391679 107470357 107571650 107678509 107747328 107795346 107836056 107855475 107876909 107915354
1929.4A07915354L5691K7967K7906L7241N4229O1500K2685j5509n472J7441L5906L9768
$$ 107915354 107951045 107979012 108006918 108044159 108098388 108159888 108182573 108167064 108161592 108179033 108214939 108254707
1953.9A08254707L1376L0839L7003L5953M4370N3310L1853R346J6511K5343J9181J3685
$$ 108254707 108286083 108316922 108353925 108389878 108434248 108487558 108519411 108528757 108545268 108570611 108589792 108603477
1978.4A08603477J3590J8537K2066K3150K5666K5487Q071j1516o986K694J038j753
$$ 108603477 108617067 108635604 108657670 108680820 108706486 108731973 108740044 108728528 108721542 108724236 108725274 108723521
2002.8A08723521Q4j800o724j2743r966O258Q667m602j180J3471J6188J7274K4640
$$ 108723521 108723605 108721805 108715081 108702338 108692372 108698630 108707297 108702695 108701515 108714986 108731174 108748448 108773088
2029.4A08773088K8348K3759J9252K4283L2651K8086J3769R978J4603J5330J7429K3043
$$ 108773088 108801436 108825195 108844447 108868730 108901381 108929467 108943236 108953214 108967817 108983147 109000576 109023619
2053.8A09023619K3436J9264J8001TQ630J753J1182J3840N865Q047J1479N842K539
$$ 109023619 109047055 109066319 109084320 109102321 109110951 109112704 109123886 109137726 109143591 109151638 109163117 109168959 109171498
2080.3A09171498N412R739J3244Q691o92M30M255N96o08K552m30q905j2672j0025r298
$$ 109171498 109176910 109186649 109199893 109208584 109207892 109208322 109212577 109213173 109212565 109215117 109214687 109205782 109193110 109183085 109173787
2110.9A09173787j6392j9550j0860p081j4758j3948m327k062l588K50Q535J5653J3351
$$ 109173787 109157395 109137845 109126985 109119904 109105146 109091198 109086871 109084809 109081221 109081471 109090006 109105659 109119010
2137.5A09119010K62m935P39O700R834Q703J3446K0886K0170K2078K6810J5569K956
$$ 109119010 109119272 109114337 109115076 109121776 109131610 109140313 109153759 109174645 109194815 109216893 109243703 109259272 109262228
2164A09262228J3649K6572K7001K3675J4603R907J4078J4639J7679K4259K2244J7214
$$ 109262228 109275877 109302449 109329450 109353125 109367728 109377635 109391713 109406352 109424031 109448290 109470534 109487748
2188.4A09487748J3769O378M112J0884J4579J1635J1659J4341J5437K1398K1613Q059
$$ 109487748 109501517 109507895 109512007 109522891 109537470 109549105 109560764 109575105 109590542 109611940 109633553 109641612
2212.9A09641612n150m113R429K1291J8347Q22r501m53J1647J3375N591j717K110Q536
$$ 109641612 109636462 109632349 109641778 109663069 109681416 109682238 109672737 109672284 109683931 109697306 109702897 109701180 109703290 109711826
2241.5A09711826J0681P474k956o402k992m816q356q154j0967j4306p402l839o962
$$ 109711826 109722507 109729981 109727025 109720623 109717631 109712815 109704459 109696305 109685338 109671032 109663630 109659791 109652829
2268A09652829K372J4198P785j336N341J6296J6212O915M88J645J216k300J275N353
$$ 109652829 109655201 109669399 109677184 109675848 109681189 109697485 109713697 109720612 109721100 109722745 109723961 109721661 109722936 109728289
2296.5A09728289J251m339j2624k4688k8181j6737k27J180j0836j8418k6071l8552
$$ 109728289 109729540 109725201 109712577 109687889 109659708 109642971 109642744 109643924 109633088 109614670 109588599 109550047
2321A09550047l9041k3389j3196q548J0824K6346J3447j1051k5022j5605Q011L5477
$$ 109550047 109511006 109487617 109474421 109465873 109476697 109503043 109516490 109505439 109480417 109464812 109472823 109508300
2345.5A09508300N5539L6896j1862n6159o4254l1185J6308M3773L2068J2326K5856
$$ 109508300 109563839 109600735 109588873 109532714 109468460 109437275 109453583 109497356 109529424 109541750 109567606
2367.9A09567606N1809P0929P9179P7856P7808P5447O3265M6360L0994J9098J3804
$$ 109567606 109619415 109690344 109769523 109847379 109925187 110000634 110063899 110110259 110141253 110160351 110174155
2390.4A10174155R442j252q202o020j120L385J025o651l6J8191K0325J1647J3554J4353
$$ 110174155 110183597 110182345 110174143 110168123 110167003 110170388 110171413 110164762 110164726 110182917 110203242 110214889 110228443 110242796
2418.9A10242796J5092K5058K3365J4519J9682J9216K635P03J5235J6892R644R179
$$ 110242796 110257888 110282946 110306311 110320830 110340512 110359728 110362363 110363066 110378301 110395193 110404837 110414016
2443.4A10414016O199%K062M507J335N96N901R822K909o747p534p27O973N687n305
$$ 110414016 110420215 110420215 110422277 110426784 110428119 110428715 110434616 110444438 110447347 110440600 110433066 110432339 110439312 110444999 110439694
2474A10439694j0622o687p725j5354j3018M578J5104O330m614n710l219k467k647l469
$$ 110439694 110429072 110422385 110414660 110399306 110386288 110390866 110405970 110412300 110407686 110401976 110398757 110396290 110393643 110390174
2502.5A10390174J79J371o378j4770j6331o175n13q774j1515k849q11o116l802k003
$$ 110390174 110390353 110391724 110385346 110370576 110354245 110348070 110347557 110338783 110327268 110324419 110323608 110317492 110313690 110311687
2531.1A10311687m268o08L58l719K169O807j430o986n460k468l898j0764j1468n877
$$ 110311687 110307419 110306811 110307169 110303450 110305619 110312426 110310996 110304010 110298550 110296082 110292184 110281420 110269952 110264075
2559.6A10264075j979P99l517r215m029k03n782j4162j9729j6737o866j896j1742k3448
$$ 110264075 110262096 110262895 110259378 110250163 110246134 110245931 110240149 110225987 110206258 110189521 110182655 110180759 110169017 110145569
2588.2A10145569j6308k134j561j0181j4150r453m220k480j79K599m232j4460j0550
$$ 110145569 110129261 110127127 110125566 110115385 110101235 110091782 110087562 110085082 110084903 110087502 110083270 110068810 110058260
2614.7A10058260m327r179j4604j5068j2648o079o32n019j2553j0359p129j0800j0908
$$ 110058260 110053933 110044754 110030150 110015082 110002434 109996355 109995723 109990704 109978151 109967792 109960663 109949863 109938955
2641.2A09938955j0049j6570j5545n054n806j4412k7025l4440k3067j5330k5070l5286
$$ 109938955 109928906 109912336 109896791 109891737 109885931 109871519 109844494 109810054 109786987 109771657 109746587 109711301
2665.7A09711301l2532k2852j4222j2863j6570r155O425K0647K9409K5452J7321J9121
$$ 109711301 109678769 109655917 109641695 109628832 109612262 109603107 109609532 109630179 109659588 109685040 109702361 109721482
2690.2A09721482K6154K3270J5140J8739K1768J0323j394o581r215p557q059j9670
$$ 109721482 109747636 109770906 109786046 109804785 109826553 109836876 109835482 109828901 109819686 109812129 109804070 109784400
2714.6A09784400l3450m1127m1652l9589m4084m6324l5942j6153N436K2185L3295M1449
$$ 109784400 109750950 109709823 109668171 109628582 109584498 109538174 109502232 109486079 109491515 109513700 109546995 109588444
2739.1A09588444M3047K9468J0026L69N424K1971K8479J2564j0335j5628n496o866
$$ 109588444 109631491 109660959 109670985 109671354 109676778 109698749 109727228 109739792 109729457 109713829 109708333 109701467
2763.6A09701467k0302l2437m2188n8996p2325n1319k8491m9293p9334q8000r4188
$$ 109701467 109681165 109648728 109606540 109547544 109475219 109423900 109395409 109346116 109266782 109178782 109084594
2786A09084594j01220r3282p7891q2815j10423j29092j22786j16002j33717j65773
$$ 109084594 108983374 108890092 108812201 108729386 108618963 108489871 108367085 108251083 108117366 107951593
2806.4A07951593j87480j89006j87016k12502k65313l13377l53575m14431n00238n96273
$$ 107951593 107764113 107575107 107388091 107175589 106910276 106596899 106243324 105828893 105328655 104732382
2826.8A04732382p11691q72326j090264j393366j839215k475637l341305m383373n350537
$$ 104732382 104020691 103148365 102058101 100664735 98825520 96349883 93008578 88625205 83274668
2845.2H3274668n911332n794585m773241k785283j95891K279490L982014M632383M291201
$$ 83274668 77363336 71568751 66795510 64010227 63814336 66093826 70075840 74708223 78999424
2863.5G8999424L195477J757729N96863K87664P86703J395154J516319J121783N03540
$$ 78999424 82194901 83952630 84549493 84837157 85623860 87019014 88535333 89657116 90160656
2881.9I0160656j11306o33168j033694j315259j485688j559710j584286j614648j672477
$$ 90160656 90049350 89416182 88382488 87067229 85581541 84021831 82437545 80822897 79150420
2900.2G9150420j767790j931542k206689k613300l124374l702593m271966m648644
$$ 79150420 77382630 75451088 73244399 70631099 67506725 63804132 59532166 54883522
2916.6E4883522m602593l994739k843744j359788J66798J506534K550301L392369M105332
$$ 54883522 50280929 46286190 43442446 42082658 42249456 43755990 46306291 49698660 53803992
2934.9E3803992M583746M718537M482758L864777K884143J644177L59237o41763j068777
$$ 53803992 58387738 63106275 67589033 71453810 74337953 75982130 76341367 75699604 74630827
2953.3G4630827q53616j71811O94001J539779K265388K804362L079546L060728K837646
$$ 74630827 73777211 73605400 74299401 75839180 78104568 80908930 83988476 87049204 89886850
2971.6H9886850K511323K134674J758421J429438J181478R85610Q03703O63328N73290
$$ 89886850 92398173 94532847 96291268 97720706 98902184 99887794 100691497 101354825 101928115
2990A01928115N12421M70293M26602L93009L88491L72279L33548L11029L00514K76482
$$ 101928115 102440536 102910829 103337431 103730440 104118931 104491210 104824758 105135787 105436301 105712783
3010.4A05712783K56694K57277K54178K29526J88756J42097J06144R4974Q9205P8129
$$ 105712783 105969477 106226754 106480932 106710458 106899214 107041311 107147455 107242429 107331634 107409763
3030.8A07409763Q5807J14548J30105J16158J08015J22130J45531J54078J26028J04237
$$ 107409763 107495570 107610118 107740223 107856381 107964396 108086526 108232057 108386135 108512163 108616400
3051.2A08616400J08456R8598P9513P0298N5420L2079J7155K9957N6267N3143K4939
$$ 108616400 108724856 108823454 108902967 108973265 109028685 109060764 109077919 109107876 109164143 109217286 109242225
3073.6A09242225r191l0971r608L0291M7994N2285N4061N1725N0068M6599L6192J7690
$$ 109242225 109233034 109202063 109192455 109222746 109270740 109323025 109377086 109428811 109478879 109525478 109561670 109579360
3098.1A09579360R728K2757J9205r096j0407K2602Tj1921j6391M375L3116O5398O1369
$$ 109579360 109589088 109611845 109631050 109621954 109611547 109634149 109656751 109644830 109628439 109632814 109665930 109731328 109792697
3124.6A09792697J9646n090R131K4748O688k8658l0577J4972M7291L0088K563j6987
$$ 109792697 109812343 109807253 109816384 109841132 109847820 109819162 109788585 109803557 109850848 109880936 109883499 109866512
3149.1A09866512l1126r775L9578M9352J2958p868N25J4985K1052J4412P642j204n877
$$ 109866512 109835386 109825611 109865189 109914541 109927499 109919631 109920156 109935141 109956193 109970605 109978247 109977043 109971166
3175.6A09971166M339M685N317K2125J1790j2780J20J8763J9395J6714N042m268K349
$$ 109971166 109975505 109980190 109985507 110007632 110019422 110006642 110006762 110025525 110044920 110061634 110066676 110062408 110064757
3202.1A10064757J0478R144Q571J1265J4353J7130J1719K729M721J3042J3113L183
$$ 110064757 110075235 110084379 110092950 110104215 110118568 110135698 110147417 110150146 110154867 110167909 110181022 110184205
3226.6A10184205j4127l6132l4869J9825O8068M6504J1778l10k1839k6191P654K5105
$$ 110184205 110170078 110133946 110099077 110118902 110186970 110233474 110245252 110244942 110223103 110196912 110204566 110229671
3251.1A10229671O986q750P617L1412K2971L314k479j9670m4119k0170K7275L8886
$$ 110229671 110236657 110227907 110235524 110266936 110289907 110293221 110290742 110271072 110226953 110206783 110234058 110272944
3275.5A10272944K7263J6964J5711J3674O807p630l0899l6812k3770O235M6265M1556
$$ 110272944 110300207 110317171 110332882 110346556 110353363 110345733 110314834 110278022 110254252 110260487 110306752 110348308
3300A10348308j4007n4193l7121J5580N5170N6208L2734J3793J1349J2850p331k5368
$$ 110348308 110334301 110280108 110242987 110258567 110313737 110369945 110402679 110416472 110427821 110440671 110433340 110407972
3324.5A10407972J157L4737L1185P189k6024n3322k6822K3794L6740L2998Q547l4702
$$ 110407972 110409129 110443866 110475051 110482240 110456216 110402894 110376072 110399866 110436606 110469604 110478151 110443449
3348.9A10443449j8418L7408L7146n603j9229K432O891k8432m5669p331M7517O5076
$$ 110443449 110425031 110462439 110499585 110493982 110474753 110477185 110484076 110455644 110409975 110402644 110450161 110515237
3373.4A10515237L6669O878K372J5092K4712J1087k9385n9712j7333M7445L4440k8587
$$ 110515237 110551906 110558784 110561156 110576248 110600960 110612047 110582662 110522950 110505617 110553062 110587502 110558915
3397.9A10558915m6670J8167P8452M4989j3899j6034J0967L0506M0698L0374J0789
$$ 110558915 110512245 110530412 110608864 110653853 110639954 110623920 110634887 110665393 110706091 110736465 110747254
3420.3A10747254N746j991j8120k3448j4997j3101k4640m852N4061Q1146N3894K1100
$$ 110747254 110753000 110751009 110732889 110709441 110694444 110681343 110656703 110651851 110705912 110787058 110840952 110862052
3444.8A10862052R764Q034M852J43O32Q4j5677j4281m780l1543m7731j371N7292N5480
$$ 110862052 110871816 110879850 110884702 110884845 110885477 110885561 110869884 110855603 110850823 110819280 110771549 110770178 110827470 110882950
3473.4A10882950J7273j3900j3828K8825L8123k992o902K2685K4843L851j8811k0469
$$ 110882950 110900223 110886323 110872495 110901320 110939443 110936451 110929549 110952234 110977077 110980928 110962117 110941648
3497.8A10941648p712M339M3368P7486N9104l576n6911k2351M3237M9698J8490j7143
$$ 110941648 110933936 110938275 110981643 111059129 111118233 111114657 111057746 111035395 111078632 111128330 111146820 111129677
3522.3A11129677O903P2658N7160K63k5678n3883l3629L2449J2350m5955o080J02234
$$ 111129677 111136580 111209238 111266398 111266661 111240983 111187100 111153471 111185920 111198270 111152315 111146235 111248469
3546.8A11248469J34087Q6713O1393M3618J3173k2555J240J60837K65658N8854k15471
$$ 111248469 111382556 111469269 111530662 111574280 111587453 111564898 111566138 111726975 111992633 112051487 111836016
3569.2A11836016j62005p081J0562l7849r5880j43850j04404L6872J11544m7577j34360
$$ 111836016 111674011 111666930 111677492 111639643 111543763 111399913 111295509 111332381 111443925 111396348 111261988
3591.7A11261988m8793p1108j83737j87505j25348n7519L6919N8699k5165p7045r2220
$$ 111261988 111213195 111142087 110958350 110770845 110645497 110587978 110624897 110683596 110658431 110581386 110489166
3614.1A10489166n8329l8040j38807j48571K4593K05803J83213p6354j48046m7004
$$ 110489166 110430837 110392797 110253990 110105419 110130012 110335815 110519028 110442674 110294628 110247624
3634.5A10247624L0601O7174P5400J04761K01118K89882J45459j47546j38557k0253
$$ 110247624 110278225 110345399 110420799 110525560 110726678 111016560 111162019 111014473 110875916 110855663
3654.9A10855663n9700r7418J2708J11150J44732J94872K02560J00375P6723M0686
$$ 110855663 110795963 110698545 110711253 110822403 110967135 111162007 111364567 111464942 111541665 111582351
3675.3A11582351j42658j87004j04165j263Q6331J10662N1808m6897q8644l8802M9424
$$ 111582351 111439693 111252689 111148524 111147261 111233592 111344254 111396062 111349165 111260521 111221719 111271143
3697.7A11271143Q8310L2401k4032N1605J85538K12371J3602j57058r0659J6248N6231
$$ 111271143 111359453 111391854 111367822 111419427 111604965 111817336 111830938 111673880 111583221 111599469 111655700
3720.1A11655700N2643K9647j8513k754J19138J98257O6579j81628k04134J0288J89626
$$ 111655700 111708343 111737990 111719477 111716723 111835861 112034118 112100697 111919069 111714935 111725223 111914849
3742.6A11914849J06979l8338K1386m8637k37620j83523n1820l6192p1895k8396K5988
$$ 111914849 112021828 111983490 112004876 111956239 111718619 111535096 111483276 111447084 111375189 111346793 111372781
3765A11372781K1195j3661p9131r1172k1278K5785J7797J0598J6356j3995n1582l7086
$$ 111372781 111393976 111380315 111301184 111210012 111188734 111214519 111232316 111242914 111259270 111245275 111193693 111156607
3789.5A11156607J0097N8019Q7333J05857J11831J4996q9741p8439r2042q2206K3341
$$ 111156607 111166704 111224723 111312056 111417913 111529744 111544740 111454999 111376560 111284518 111202312 111225653
3811.9A11225653J23930J19662O2501K0278r1970j19340l9387l660J1468L9351P0882
$$ 111225653 111349583 111469245 111531746 111552024 111460054 111340714 111301327 111297667 111309135 111348486 111419368
3834.4A11419368Q9538K8646p6497j15752j07896k9779J24336K61068J97506j62506
$$ 111419368 111508906 111537552 111461055 111345303 111237407 111207628 111331964 111593032 111790538 111628032
3854.8A11628032k63000r9015L6967Q4448K7966J657M0615L218p0667q1825q583O5887
$$ 111628032 111365032 111266017 111302984 111387432 111415398 111417055 111457670 111460888 111390221 111308396 111299813 111365700
3879.2A11365700K4485l0911k7489j8990l052k3413n1141J2613J01471J08027L4261
$$ 111365700 111390185 111359274 111331785 111312795 111309743 111286330 111235189 111247802 111349273 111457300 111491561
3901.7A11491561p5722j60193j18959k6703J7869M5956M9030K098k6035j0657n460
$$ 111491561 111415839 111255646 111136687 111109984 111127853 111173809 111222839 111224937 111198902 111188245 111182785
3924.1A11182785k2078p951J5903j0550l6860j2088J4604K1815K4068J8275J2147j0621
$$ 111182785 111160707 111152756 111168659 111158109 111121249 111109161 111123765 111145580 111169648 111187923 111200070 111189449
3948.6A11189449m9472n0497j2350R811j67o855o532p618N281J5545N794o605q499
$$ 111189449 111139977 111089480 111077130 111086941 111086774 111079919 111073387 111065769 111071050 111086595 111092389 111085784 111077285
3975.1A11077285p63n770k2900k0194J812J3268L314L850J3090M589n889
$$ 111077285 111076522 111070752 111047852 111027658 111029470 111042738 111046052 111049902 111062992 111067581 111061692
3997.5A11061692
$$ 111061692
##END=$$ End of the data block
