##TITLE=$$ Begin of the data block
##JCAMP-DX=5.00 $$ ACD/SpecManager v 10.08
##SPECTROMETER/DATA SYSTEM=Varian
##DATE=16 Apr 2013 15:03:34
##DATA TYPE=INFRARED SPECTRUM
##DATA CLASS=XYDATA
##ORIGIN=
##OWNER=
##NPOINTS=3735
##FIRSTX=399.26403809
##LASTX=4000.35498047
##MAXX=4000.35498047
##MINX=399.26403809
##MAXY=61.70014191
##MINY=22.31151390
##XFACTOR=1.0000000000
##YFACTOR=0.000000100000000
##FIRSTY=40.20257950
##DELTAX=0.96440572
##XUNITS=1/CM
##YUNITS=TRANSMITTANCE
##XYDATA=(X++(Y..Y))
399.3D02025795R1073875K3799515k8633232m3721275k7715073l368873J0498275R101372
$$ 402025795 493099670 516899185 488265953 444544678 416829605 413460732 423959007 433060379
407D33060379j614799j2716179j7329140j2971001k551574P258682J0751648P202072
$$ 433060379 431445580 418729401 401400261 388429260 385877686 393136368 403888016 411090088
414.7D11090088J20163o779289j1609993j2692566p460442M725533J9058113K6975021
$$ 411090088 411210251 404430962 392820969 380128403 372667961 377393494 396451607 423426628
422.4D23426628K3079949J0276603k618904q286171n876083K38304N028267N974922
$$ 423426628 446506577 456783180 454164276 445878105 440002022 440240326 445268593 451243515
430.1D51243515L446541l50647k877655l043404k153015k551536m833794o831894n966072
$$ 451243515 454690056 454339409 451461754 448418350 446265335 443713799 438880005 432048111 426082039
438.8D26082039k300148J547279L526993M237671N327110O590462N909615K296295
$$ 426082039 423781891 425329170 428856163 433093834 438420944 445011406 450921021 453217316
446.5D53217316k042313l660469j805763M09775o63796m785500p164840k812081P889138
$$ 453217316 451175003 447514534 445708771 446118546 445454750 440669250 433504410 430692329 438581467
455.2D38581467J7854080J8326301O541596j0900459k2774086k2363511j2531013j946487
$$ 438581467 456435547 474761848 481303444 470402985 447628899 425265388 412734375 410787888
462.9D10787888L313980M016990M289818N707588O188622M022827Q26759o14814k35215
$$ 410787888 414101868 418118858 422408676 428116264 434304886 438327713 439154472 438539658 438304443
471.6D38304443n84793k826843m575577k877273J565933M757118M110794J472054O78901
$$ 438304443 437719650 434892807 430317230 427439957 429005890 433763008 437873802 439345856 440024757
480.3D40024757K987633O073227P248802O267510M426841K079049j606522o532249
$$ 440024757 443012390 449085617 456334419 462601929 467028770 469107819 467501297 460969048
488D60969048j0581131j1311303q294181l316880J278611L805847L232383o61316o328773
$$ 460969048 450387917 439076614 430782433 427465553 428744164 432550011 435782394 435121078 428792305
496.7D28792305j0312042r319611l071403N111045J0785027J1514893P960968K778091
$$ 428792305 418480263 409160652 406089249 411200294 421985321 433500214 441461182 444239273
504.4D44239273j049042j500969J434288N381546O932908M418716m18053l934021l981819
$$ 444239273 443190231 441689262 443123550 448505096 455438004 459856720 459438667 455504646 451522827
513.1D51522827j591186O82945J444893J048622Q4114j565704l764649n077972l783684
$$ 451522827 449931641 450614586 452059479 453108101 453192215 451626511 447861862 442783890 439000206
521.7D39000206m4060L680115M857635L236886O20040j372222k651978l786316m592819
$$ 439000206 438956146 442636261 447493896 450730782 451350822 449978600 447326622 443540306 438947487
530.4D38947487m292450k840042j365700j018982j774521k745323l421173m095230
$$ 438947487 434655037 431814995 430449295 429430313 427655792 424910469 421489296 417394066
538.1D17394066n032082n703468n205612l277207n97610J870193L522187M069404L262444
$$ 417394066 412361984 406658516 401452904 398175697 397578087 399448280 402970467 407039871 410302315
546.8D10302315J076965j846237m271431n130653m270630k495995r86862o22902j562614
$$ 410302315 411379280 409533043 405261612 400130959 395860329 393364334 392377472 391754570 390191956
555.5C90191956l168335m371491m409943l400497k130928j222954o29158o3476K91977
$$ 390191956 387023621 382652130 378242187 374841690 372710762 371487808 370858650 370795174 371087151
564.2C71087151r7886j217727k080765j612282O4583J541138J454086k41470k376137
$$ 371087151 370989265 369771538 367690773 366078491 366143074 367684212 369138298 368896828 366520691
572.9C66520691l664131l478279j842385O91262K919464L297424J152115k229538m236717
$$ 366520691 362856560 359378281 357535896 358227158 361146622 364444046 365596161 363366623 359129906
581.5C59129906l197975n7946K455826K420998L67164j581421j887168p69806M79469
$$ 359129906 355931931 355873985 358329811 360750809 361117973 359536552 357649384 356879578 357359047
590.2C57359047Q83293M32510k28614m41819L319P11670R49211L32299o20270q45490
$$ 357359047 358242340 358674850 358446236 358004417 358007736 358719406 359668617 360000916 359380646 358535156
599.9C58535156J18561J444626J779556P56645n22499p04574K82707J194687R30519
$$ 358535156 358653717 360098343 361877899 362634544 362112045 361407471 361690178 362884865 363815384
608.5C63815384k71721j231804j151771k65770P16896J406440J808091J906471J565208
$$ 363815384 363543663 362311859 361160088 360894318 361611214 363017654 364825745 366732216 368297424
617.2C68297424Q59146K02713m8484j068m4785l12195n00870k78053K83775P75376
$$ 368297424 369156570 369359283 369310799 369309731 369264946 368952751 368451881 368173828 368457603 369232979
626.9C69232979Q67538N65453J24626j31989M4938O54525J295967J375008P09076p5073
$$ 369232979 370100517 370665970 370790596 370658607 370703545 371358070 372654037 374029045 374738121 374663048
636.5C74663048K823J237945K745438L191147K083893K92701p13691q9531J821785
$$ 374663048 374665871 375903816 378649254 381840401 383924294 384216995 383503304 383413773 385235558
645.2C85235558L861122M842567M216766K391129N53551j02692O47812J806793K077065
$$ 385235558 389096680 393939247 398156013 400547142 401100693 400998001 401645813 403452606 405529671
653.9D05529671J163521M3945j26419P67174J835136K285767K156791J880188J513329
$$ 405529671 406693192 406737137 406610718 407377892 409213028 411498795 413655586 415535774 417049103
662.5D17049103Q11806j4534j25542J030350K811241L791046L179970J622352M52004
$$ 417049103 417860909 417846375 417720833 418751183 421562424 425353470 428533440 430155792 430607796
671.2D30607796L25355P91321J082764J006431R40476J204910J710777K181816K470742
$$ 430607796 430933151 431724472 432807236 433813667 434754143 435959053 437669830 439851646 442322388
679.9D42322388K569999K475930K199592J836434J482315J101875O30074K21824K22855
$$ 442322388 444892387 447368317 449567909 451404343 452886658 453988533 454618607 454840431 455063286
688.6D55063286P65495J491814J855125J690674J338577J173897J187096J158867J099739
$$ 455063286 455828781 457320595 459175720 460866394 462204971 463378868 464565964 465724831 466824570
697.3D66824570J260299J681633J991730J842728J432380J338044J789779K306290
$$ 466824570 468084869 469766502 471758232 473600960 475033340 476371384 478161163 480467453
705D80467453K204552J385307M58412J17111N13611J254082J814041J858292J319542
$$ 480467453 482672005 484057312 484515724 484632835 485146446 486400528 488214569 490072861 491392403
713.7D91392403M34417k62336k00348P52220K089462L057137L265495K874641K243042
$$ 491392403 491826820 491564484 491364136 492116356 494205818 497262955 500528450 503403091 505646133
722.3E05646133J580925J012497P81098J125755J922264K645989K845192K573852K225533
$$ 505646133 507227058 508239555 509020653 510146408 512068672 514714661 517559853 520133705 522359238
731E22359238J992073J685104J149788O76537P77816J562233K500649K916107K635307
$$ 522359238 524351311 526036415 527186203 527862740 528640556 530202789 532703438 535619545 538254852
739.7E38254852K076454J756554J829453K092399K288704K291680K080917J701240
$$ 538254852 540331306 542087860 543917313 546009712 548298416 550590096 552671013 554372253
747.4E54372253J284867J007271R23004Q73794O46782K33803j23558j83220M2000L08685
$$ 554372253 555657120 556664391 557587395 558461189 559107971 559341774 559218216 559034996 559076996 559385681
757.1E59385681L92113K56386q240l30582o74591r37919r32427n52521K1286L44468
$$ 559385681 559777794 560034180 560025940 559695358 559020767 558082848 557150421 556597900 556619186 556963654
766.7E56963654L4332q43010j715241j927604j340943n38826l66249j172371k479820
$$ 556963654 556997986 556154976 554439735 552512131 551171188 550632362 550266113 549093742 546613922
775.4E46613922l422623l510627k955933k320099j966057j910934k079964k479896
$$ 546613922 543191299 539680672 536724739 534404640 532438583 530527649 528447685 525967789
783.1E25967789l045731l465614l363533k694550j850204j297150j171608j282768
$$ 525967789 522922058 519456444 516092911 513398361 511548157 510251007 509079399 507796631
790.8E07796631j429062j557236j604614j364975o67305L63579J376114K162132K827454
$$ 507796631 506367569 504810333 503205719 501840744 501173439 501537018 502913132 505075264 507902718
799.5E07902718L515930M074631M167671L735618L176728K963562L161277L443795
$$ 507902718 511418648 515493279 519660950 523396568 526573296 529536858 532698135 536141930
807.2E36141930L549118L548126L598976L590851L210220K363930J400108Q41027R53598
$$ 536141930 539691048 543239174 546838150 550429001 553639221 556003151 557403259 558244286 559197884
815.9E59197884J602096K409287K950134K887115K159996J154976N35164O82869J286965
$$ 559197884 560799980 563209267 566159401 569046516 571206512 572361488 572896652 573579521 574866486
824.6E74866486J626587J339836P99942O30798R23614J115723O70891k58865r61304
$$ 574866486 576493073 577832909 578632851 579263649 580187263 581302986 581973877 581715012 580753708
833.3E80753708q73642n5161R84269J735153J916694J462479N35355m29421q95195
$$ 580753708 579880066 579824905 580809174 582544327 584461021 585923500 586458855 586029434 585134239
841.9E85134239o28662O1722N64880M72222j57318r46312j497689j558761j077042
$$ 585134239 584505577 584567299 585132179 585604401 585447083 584500771 583003082 581444321 580367279
850.6E80367279k64130M34800O16989K72293k00501m05388l54652l97758p82319j387100
$$ 580367279 580103149 580537949 581154938 581427231 581226730 580821342 580466690 580068932 579286613 577899513
860.3E77899513j907539k188339k276726k230263k028313j716346j503067j601067
$$ 577899513 575991974 573803635 571526909 569296646 567268333 565551987 564048920 562447853
868E62447853j999283k481384k848778l032532k980842k592850j897964j235314j074104
$$ 562447853 560448570 557967186 555118408 552085876 549105034 546512184 544614220 543378906 542304802
876.7E42304802j566773k364082k963981l204766l324051l556022l807640l800621
$$ 542304802 540738029 538373947 535409966 532205200 528881149 525325127 521517487 517716866
884.4E17716866l439866k919616k492714k248154k148247k160148k239342k232933
$$ 517716866 514277000 511357384 508864670 506616516 504468269 502308121 500068779 497835846
892.1D97835846j943245j334076n94253O7138O37093J227569J832695K277527K448502
$$ 497835846 495892601 494558525 493964272 494031410 494668503 495896072 497728767 500006294 502454796
900.8E02454796K484360K632865K957955L285065L452568L508377L603973L771477
$$ 502454796 504939156 507572021 510529976 513815041 517267609 520775986 524379959 528151436
908.5E28151436L927078M070206M324417M700088M913483M608345L793831K946129
$$ 528151436 532078514 536148720 540473137 545173225 550086708 554695053 558488884 561435013
916.2E61435013K576370K720223K937355K822303K435990K191467K363396K785988
$$ 561435013 564011383 566731606 569668961 572491264 574927254 577118721 579482117 582268105
923.9E82268105L041954K885513K447624K045364J837578J688347J360703Q38241M34227
$$ 582268105 585310059 588195572 590643196 592688560 594526138 596214485 597575188 598413429 598847656
932.6E98847656N23682J127167J770668J838417J132011Q7891n92728n44510R995N47981
$$ 598847656 599371338 600498505 602269173 604107590 605239601 605327492 604734764 604190254 604200249 604748230
942.2F04748230P20024N43213K48566N5732Q8387L74412Q13981J171455J204987Q69522
$$ 604748230 605468254 606011467 606260033 606315765 606404152 606778564 607592545 608764000 609968987 610838509
951.9F10838509L71322q659j36910p0495N2948J05667k7123m11148r49402j351089
$$ 610838509 611209831 611201172 611064262 610993767 611046715 611152382 611125259 610714111 609764709 608413620
961.5F08413620j327209q58040k24953K57072N00641O02265N99785L89976o9389n59655
$$ 608413620 607086411 606228371 606003418 606260490 606761131 607363396 607963181 608353157 608283768 607724113
971.2F07724113p18460l83148K30446P16057Q25310O27174L78647K88315L78265N03273
$$ 607724113 607005653 606622505 606852951 607569008 608394318 609021492 609400139 609688454 610066719 610569992
980.8F10569992M88854L00674J09482J42364M11301O30722M99763Q7815j59645J00364
$$ 610569992 611058846 611359520 611469002 611611366 612022667 612653389 613153152 613240967 613081322 613181686
990.5F13181686O60973R12018M84123l28369q56552p29828j79176K98767M54292M04205
$$ 613181686 613842659 614754677 615238800 614910431 614053879 613324051 613144875 613443642 613897934 614302139
1000.1F14302139L50495L44619L43171L55796M18511M66842L58315O1531k54250l77769
$$ 614302139 614652634 614997253 615340424 615696220 616114731 616581573 616939888 617001419 616747169 616369400
1009.7F16369400k81372j39046j34048l02353n49622p53212q17756o91605m11377j19057
$$ 616369400 616088028 615948982 615814934 615512581 614962959 614209747 613391991 612700386 612289009 612169952
1019.4F12169952L2921J6670o8130j38207k18772l44735m38079l81089k11715j30120
$$ 612169952 612202873 612219543 612151413 612013206 611794434 611449699 611011620 610630531 610418816 610288696
1029F10288696k33268l27797j42479K79922N46570L63884o9428k71492q0680J07650
$$ 610288696 610055428 609727631 609585152 609865074 610411644 610775528 610706100 610434608 610353928 610461578
1038.7F10461578j88255r04045j422691j230469m78974J71204K19536k30103o49490
$$ 610461578 610273323 609369278 607946587 606716118 606237144 606408348 606627884 606397781 605748291
1047.4F05748291o00815o5727O25763J089668J151238R26971O90346O08787N85175
$$ 605748291 605147476 605081749 605707512 606797180 607948418 608875389 609565735 610174522 610759697
1056F10759697L82996n7717m82673n64270k64969J18255K91062K76107L29209N96428
$$ 610759697 611142693 611084976 610602303 610038033 609773064 609891319 610182381 610458488 610787697 611384125
1065.7F11384125R46769J141930J070252P69424L12271k02560n74951n67399j43470
$$ 611384125 612330894 613472824 614543076 615312500 615624771 615422211 614847260 614279861 614136391
1074.4F14136391M13055P21855O48842L60985N6419k42195n68428p93152o91337k51427
$$ 614136391 614549446 615271301 615920143 616281128 616337547 616095352 615526924 614733772 614042435 613791008
1084F13791008K10381L40385J00136k61879n54581q20885j128540j316070j109314
$$ 613791008 614001389 614341774 614441910 614180031 613625450 612804565 611676025 610359955 609250641
1092.7F09250641m95453J58691M39606K93083K5597o5765L3950J50833J79482J54419
$$ 609250641 608755188 608913879 609353485 609646568 609672165 609606400 609640350 609791183 609970665 610125084
1102.3F10125084J19095L1357j60523m15954o33164p57828q11996q28056q03452p30515
$$ 610125084 610244179 610275536 610115013 609699059 609065895 608308067 607496071 606668015 605864563 605134048
1112F05134048o22062m88510l35694k23617k79808n64194r14726j020508p28645k45896
$$ 605134048 604511986 604023476 603687782 603464165 603184357 602620163 601705437 600684929 599956284 599710388
1121.6E99710388N1575K0218j21041j04522J8425n6992m55665q66089q27980k51313
$$ 599710388 599761963 599782181 599661140 599556618 599575043 599518051 599062386 598196297 597368317 597117004
1131.2E97117004M39301P19604M84047J14708O4965M20608Q57659R73243O36482P1640
$$ 597117004 597556305 598275909 598759956 598874664 598939629 599360237 600217896 601191139 601827621 601899261
1140.9F01899261l36341l25013P9422O06728R50470R70993P43332M44984K17400J28059
$$ 601899261 601562920 601237907 601317329 601924057 602874527 603845520 604588852 605033836 605251236 605379295
1150.5F05379295K01989M20761O74667P76558N88112J56936l01017n65872n59388l43475
$$ 605379295 605581284 606002045 606676712 607453270 608041382 608198318 607897301 607331429 606772041 606428566
1160.2F06428566k3766L06893N55763O26679M73861J50681k08054m54521m81720k61002
$$ 606428566 606404800 606711693 607267456 607894135 608367996 608518677 608310623 607856102 607374382 607113380
1169.8F07113380J12191M17595M35676J46752k04010l10975j03836J81847K62222J02616
$$ 607113380 607225571 607643166 608078842 608225594 608021584 607710609 607606773 607788620 608050842 608153458
1179.5F08153458p5837o5345J10893K66685K76757J83296R9525Q0605J03149J20392
$$ 608153458 608077621 608012276 608123169 608389854 608666611 608849907 608949432 609030037 609133186 609253578
1189.1F09253578R5558J4382q2207r8648J1215J26572K7580l37639o91375o37513q8005
$$ 609253578 609349136 609363518 609281311 609182663 609193878 609320450 609348030 609010391 608319016 607681503 607593498
1199.7F07593498N87692R07860P57790M58641L66554M89540N50385L57323K517k99988
$$ 607593498 608181190 609089050 609846840 610305481 610672035 611161575 611711960 612069283 612071800 611771812
1209.4F11771812m56543n04570m52308k35253J38207M89731N98716M08822N9928k75192
$$ 611771812 611315269 610810699 610358391 610123138 610261345 610751076 611349792 611758614 611818542 611543350
1219F11543350n20668o58684o48651m59404j66740P0686J59989J62963J91460K55661
$$ 611543350 611022682 610363998 609715347 609255943 609089203 609159889 609319878 609482841 609674301 609929962
1228.6F09929962K66113J81389Q4572P5684J28135J10894m8027k68517m07486m05121
$$ 609929962 610196075 610377464 610462036 610537720 610665855 610776749 610728722 610460205 610052719 609647598
1238.3F09647598l14293k09579j13640k1362M5814M0932o6910k67792n12771p17774
$$ 609647598 609333305 609123726 609010086 608988724 609034538 609075470 609008560 608740768 608227997 607510223
1247.9F07510223p76443o22025l07884o48J44386J14174K5101j4649k899n34l1319
$$ 607510223 606733780 606111755 605803871 605803223 605947609 606061783 606086884 606072235 606069336 606068802 606037483
1258.5F06037483o6108r6665j65214k95334m24958m55246l66020k46429j96610k21634
$$ 606037483 605971375 605874710 605709496 605414162 604989204 604533958 604167938 603921509 603724899 603503265
1268.2F03503265k43072j98860j06468l5477n3253j93444m28619o40373o52504l69034
$$ 603503265 603260193 603061333 602954865 602919388 602866135 602672691 602244072 601603699 600951195 600582161
1277.8F00582161R0713M35410M36020J24435k51960m67301m82864l90282k61459j09139
$$ 600582161 600672874 601108284 601544304 601668739 601416779 600949478 600466614 600076332 599814873 599705734
1287.5E99705734L3036P5721l1814k13623l25928l08800k36130k01149j91421j15738
$$ 599705734 599738770 599814491 599782677 599569054 599243126 598934326 598698196 598497047 598305626 598189888
1297.1E98189888O1378K57760L58810L29514K16217O9923r8190k81792m42467n34858
$$ 598189888 598251266 598509026 598867836 599197350 599413567 599483490 599385300 599103508 598661041 598126183
1306.8E98126183n48630n00870l98178k33803k8000J55793K53295K45743J52283K861
$$ 598126183 597577553 597076683 596678505 596444702 596416702 596572495 596825790 597071533 597223816 597226677
1316.4E97226677j53618k24075j17607J43890L78113L69949P3662l22533n58662n24941
$$ 597226677 597073059 596848984 596731377 596875267 597253380 597623329 597696991 597374458 596815796 596290855
1326E96290855l23524j34049n4550o3286q7738p5264j7433M6845M6882o4544k40746
$$ 596290855 595967331 595833282 595778732 595715446 595627708 595552444 595535011 595581856 595628738 595564194 595323448
1336.7E95323448l50418k94609j17264K6474K7657q0452j92604k67563l50876m64859
$$ 595323448 594973030 594678421 594561157 594587631 594615288 594534836 594342232 594074669 593723793 593258934
1346.3E93258934n34286m64211k72675r5024m4937r8190j46332j41640j52435k60048
$$ 593258934 592724648 592260437 591987762 591892738 591847801 591749611 591603279 591461639 591309204 591049156
1355.9E91049156m29916n13916l91846j08490J31722J19323j79023n69764p67059o24504
$$ 591049156 590619240 590105324 589713478 589604988 589736710 589856033 589677010 589107246 588340187 587715683
1365.6E87715683k60696M7798J09138m1351k35443l69797m70543n74875o28433n57861
$$ 587715683 587454987 587502785 587611923 587570572 587335129 586965332 586494789 585919914 585291481 584733620
1375.2E84733620m21677l95851n67017p88612q12492n67589k53258j32217k69928n14527
$$ 584733620 584311943 583916092 583349075 582560463 581747971 581180382 580927124 580794907 580524979 580010452
1384.9E80010452o89850p40318o90918n59425l84369k96097m45976q18482j170501
$$ 580010452 579320602 578580284 577889366 577329941 576945572 576649475 576203499 575385017 574214516
1393.6E74214516j235619r86977o52427m64058m40903m40178l66897k58065j79405
$$ 574214516 572978897 571991920 571339493 570875435 570434532 569994354 569627457 569369392 569189987
1402.2E69189987j15890j8845Q5335J03416q01j41105j95885j32485k0713N3329M4861
$$ 569189987 569074097 569055252 569140587 569244003 569243202 569102097 568906212 568773727 568753014 568806343 568851204
1412.8E68851204n6992k36473m17213m65164k92244L9253L47938M83475M28620K50244
$$ 568851204 568794212 568557739 568140526 567675362 567383118 567422371 567770309 568253784 568682404 568932648
1422.5E68932648Q774k40555l90053l16010k5406K81716L66478J79710r6779k40936
$$ 568932648 568941422 568700867 568310814 567994804 567969398 568251114 568617592 568797302 568700523 568459587
1432.1E68459587j89629k7122J54457L15971M09127L52478J37291q5869j13487R7656
$$ 568459587 568269958 568242836 568397293 568713264 569122391 569474869 569612160 569526291 569412804 569510460
1441.8E69510460L71323N01289M59938L75938L37487K97737J98974J13411J70174L47443
$$ 569510460 569881783 570383072 570843010 571218948 571556435 571854172 572053146 572166557 572336731 572684174
1451.4E72684174M19693J78871l03078o83556o44149j75171M16412P58476O84014L14789
$$ 572684174 573103867 573282738 572979660 572296104 571651955 571476784 571893196 572651672 573335686 573650475
1461.1E73650475o5346k27051j38931N3558J86920K23847K42958K92854K96822J40495
$$ 573650475 573585129 573358078 573219147 573272705 573459625 573683472 573926430 574219284 574516106 574656601
1470.7E74656601j54419l97911m09508k16484k9068j8806j49193k44789j97525o8856
$$ 574656601 574502182 574104271 573694763 573478279 573449211 573430405 573281212 573036423 572838898 572770042
1480.3E72770042M960l8643j49727k46430k90184k85644k47345j91269j44310j31111
$$ 572770042 572775002 572736359 572586632 572340202 572050018 571764374 571517029 571325760 571181450 571050339
1490E71050339j41678j30119o4431K4720N2185n1651k66648m75845n43861m25034k04010
$$ 571050339 570908661 570778542 570714111 570738831 570791016 570739365 570472717 569996872 569453011 569027977 568823967
1500.6E68823967j3809R2354J76353K96707L73841K29110k01149p14416r74274q29582
$$ 568823967 568810158 568902512 569078865 569375572 569749413 569978523 569777374 569062958 568088684 567259102
1510.2E67259102m71535k38876k69890l84827l20701l6888K42881K71378K0866l15818
$$ 567259102 566787567 566548691 566278801 565893974 565573273 565536385 565779266 566050644 566071510 565755692
1519.9E65755692n17884n10139l86200l09830l85399n71251o90689n72510k33879Q3275
$$ 565755692 565237808 564727669 564341469 564031639 563646240 563074989 562384300 561811790 561577911 561661186
1529.5E61661186J10474j76010n00565n42450k49748J12839K21367j8349m31976p68128
$$ 561661186 561771660 561595650 561095085 560552635 560302887 560415726 560637093 560618744 560186768 559418640
1539.2E59418640q91723q15278o13479l58582j19095L1472L9787q5754k66152l93753
$$ 559418640 558526917 557711639 557098160 556739578 556620483 556651955 556691742 556605988 556339836 555946083
1548.8E55946083m01077l15399k41356k62146l45879l74298k96783k37999l87535p53937
$$ 555946083 555545006 555229607 554988251 554726105 554380226 554005928 553709145 553471146 553083611 552329674
1558.5E52329674j073303j035843o21148j56936m273k07786m93508n97877n27153m70619
$$ 552329674 551256371 550220528 549599380 549442444 549438171 549230385 548736877 548139000 547611847 547141228
1568.1E47141228n18112n50652m17519j54228L6087l586k37503n02090o69937p21512
$$ 547141228 546623116 546072464 545654945 545500717 545536804 545533218 545295715 544793625 544123688 543402176
1577.7E43402176o93665o17294n13267m14353l56903l57819m18739n43442p29713r39942
$$ 543402176 542708511 542091217 541577950 541163597 540806694 540448875 540030136 539486694 538756981 537817039
1587.4E37817039j100158j150551j089592r61304q14209o82869o01082n97877o66847
$$ 537817039 536716881 535566330 534476738 533515434 532701225 532018356 531417274 530819397 530152550
1596.1E30152550p53212q03719q17299q33168q61129q59147p95402p19109p25822q46405
$$ 530152550 529399338 528595619 527778320 526945152 526084023 525224876 524429474 523710365 522984543 522138138
1605.7E22138138r97391j067047j037140r94492j018905j088677j116485j060257r67446
$$ 522138138 521140747 520073700 519036560 518042068 517023163 515934486 514818001 513757744 512790298
1614.4E12790298r10186r02024q97331q55789p84111p16400o78482o78940p13310p54853
$$ 512790298 511880112 510978088 510080757 509224968 508440857 507724457 507045975 506367035 505653725 504898872
1624E04898872p47680o49491m92935l89519m36706o07224p42492o75850l74603J9149
$$ 504898872 504151192 503501701 503008766 502619247 502182541 501575317 500832825 500156975 499782372 499801521
1633.7D99801521K81525K52762o4507n00831q14438q37937n96695k99987j82610l12042
$$ 499801521 500083046 500335808 500271301 499770470 498956032 498118095 497521400 497221413 497038803 496726761
1643.3D96726761n31426o06002m47388k01149j06812k58293m92286n23491k09465K97126
$$ 496726761 496195335 495589333 495141945 494940796 494833984 494575691 494083405 493559914 493350449 493647575
1653D93647575O60401O43501L02277q7624k93693l08838k83471l05671l05100j77955
$$ 493647575 494307976 494951477 495253754 495166130 494872437 494563599 494280128 493974457 493669357 493491402
1662.6D93491402L2272J47629N9776j23787j79939n074K88582N15824O05697O20995
$$ 493491402 493523674 493671303 493731079 493607292 493427353 493422279 493710861 494226685 494832382 495453377
1672.3D95453377O30035O29234O03791O01959O88400Q32024R06143Q28476O83517O70968
$$ 495453377 496083412 496712646 497316437 497918396 498606796 499438820 500344963 501173439 501856956 502527924
1681.9E02527924R30366J418991J943093K294425K380524K281685K188225K226143
$$ 502527924 503458290 504877281 506820374 509114799 511495323 513777008 515965233 518191376
1689.6E18191376K301216K155685J663552J074485Q53043J176491J637153J578255
$$ 518191376 520492592 522648277 524311829 525386314 526239357 527415848 529053001 530631256
1697.3E30631256Q04520j12763l47290L53203J410332J995163J798706J183281O72149
$$ 530631256 531435776 531323013 530975723 531328926 532739258 534734421 536533127 537716408 538388557
1706E38388557M36364L11355J65673R0827K23465N16396P72591Q59413Q03795O81190
$$ 538388557 538824921 539136276 539301949 539392776 539616241 540132637 540905228 541764641 542568436 543249626
1715.6E43249626N08995K88506R6245M0474J27220K25258K06222Q4076j9951l6850
$$ 543249626 543758621 544047127 544143372 544183846 544311066 544536324 544742546 544826622 544806671 544769821
1725.3E44769821k2621o0158j24664r2735J09367L83110N08652L32260p4539m35829
$$ 544769821 544747200 544687042 544562378 544469643 544579010 544962120 545470772 545803032 545728493 545292664
1734.9E45292664m81873j86691J87340L07502P0000l10326n23872m71726l24974k91748
$$ 545292664 544810791 544624100 544811440 545118942 545188942 544878616 544354744 543883018 543558044 543266296
1744.6E43266296l73993m00238k68173q3275k6626j32332k56386k58407j54191o3552
$$ 543266296 542892303 542492065 542223892 542140617 542113991 541981659 541725273 541466866 541312675 541249123
1754.2E41249123m8523o0807m2648j7090m5204j25809j86882j83029j63612k16370
$$ 541249123 541200600 541139793 541097145 541080055 541034851 540909042 540722160 540539131 540375519 540159149
1763.9E40159149l55072m80385m63409k62604K9526K42691K46696M7799k06223l37296
$$ 540159149 539804077 539323692 538860283 538597679 538627205 538869896 539116592 539164391 538958168 538620872
1773.5E38620872k81486j38206o3515j15242k11487k44751k09694j97372k75536m07753
$$ 538620872 538339386 538201180 538137665 538022423 537810936 537566185 537356491 537159119 536883583 536475830
1783.2E36475830m92744m64020l24211j14785J10398K76451L02849J67694m8180k14576
$$ 536475830 535983086 535519066 535194855 535080070 535190468 535466919 535769768 535937462 535889282 535674706
1792.8E35674706k57607k04010j24779o2332l5820p3318j88103l19061l47023k21215
$$ 535674706 535417099 535213089 535088310 535025978 534990158 534916840 534728737 534409676 534062653 533841438
1802.4E33841438m8980q736j50833l21617l13492q2436K11067L68081L25393J64566
$$ 533841438 533792458 533783722 533632889 533311272 532997780 532915344 533126411 533494492 533819885 533984451
1812.1E33984451m692j25808j85967j87111j53999j33019j46141j51253r3040P286
$$ 533984451 533979759 533853951 533667984 533480873 533326874 533193855 533047714 532896461 532803421 532810707
1821.7E32810707M7188l8071j78642k32163j46560j9913J4610o2484j54114j73264
$$ 532810707 532857895 532819824 532641182 532409019 532262459 532242546 532257156 532194672 532040558 531867294
1831.4E31867294j27601o8550j0262O4278J31035J17721r613j88141l16124l56865
$$ 531867294 531739693 531671143 531660881 531725159 531856194 531973915 531964302 531776161 531460037 531103172
1841E31103172l53164l43857l05748k06871q5373l3646r4414k01797k44598j74027
$$ 531103172 530750008 530406151 530100403 529893532 529808159 529774513 529680099 529478302 529233704 529059677
1850.7E29059677m0665O5690Q8005K7694o9236j35804j26152n7640j1101n4893j65978
$$ 529059677 529019012 529084702 529172707 529200401 529131165 528995361 528869209 528811569 528800468 528745575 528579597
1861.3E28579597k48985k48604k17704k47231l38020l82843k92893j11580K7314M2801
$$ 528579597 528330612 528082008 527864304 527617073 527279053 526896210 526603317 526491737 526519051 526561852
1870.9E26561852k5940r4910j34926j68304j96915j86806j34163j02119j53313k61802
$$ 526561852 526535912 526441002 526306076 526137772 525940857 525754051 525619888 525517769 525364456 525102654
1880.6E25102654l27721k87361j79634q6136l5591M921N3253O6261o027j47667k81296
$$ 525102654 524774933 524487572 524307938 524221802 524186211 524191132 524244385 524310646 524304619 524156952 523875656
1891.2E23875656l41148l20091k51427j68190r6779o3667p7134j08490j11618p9002
$$ 523875656 523534508 523214417 522962990 522794800 522698021 522634354 522557220 522448730 522337112 522258110
1900.8E22258110n3635p5378j26648j53656j36948j13372j22605j54838j74179j77613
$$ 522258110 522204475 522129097 522002449 521848793 521711845 521598473 521475868 521321030 521146851 520969238
1910.4E20969238j98555k45819k73437k35215j55296j14403j55716k31361k58827k11525
$$ 520969238 520770683 520524864 520251427 520016212 519860916 519746513 519590797 519359436 519100609 518889084
1920.1E18889084j38741r9640j02729j18943j25732j18713r6627n7754j9112j1482
$$ 518889084 518750343 518650703 518547974 518429031 518303299 518184586 518087959 518030205 518011093 517999611
1929.7E17999611m1542p4005p1335m5242m7226j02768j80283k34489k64550l00903
$$ 517999611 517958069 517884064 517812729 517767487 517720261 517617493 517437210 517202721 516938171 516637268
1939.4E16637268l38440l22609k20985q4267p057k0943n8403l7117L8986Q5564L4905
$$ 516637268 516298828 515976219 515755234 515670967 515663910 515642967 515584564 515547447 515586433 515671997 515706902
1950E15706902r4071k27890l13835l42331l17955k42310j37863o0653n9777j30195
$$ 515706902 515612831 515384941 515071106 514728775 514410820 514168510 514030647 513969994 513910217 513780022
1959.6E13780022k18468k75421k88735k60543j80397m4747J02692J82152J42135J0491
$$ 513780022 513561554 513286133 512997398 512736855 512556458 512511711 512614403 512796555 512938690 512949181
1969.3E12949181j34468k30179k60811k34833j60446o3057k213l6087j56936k76833
$$ 512949181 512814713 512584534 512323723 512088890 511928444 511865387 511863174 511827087 511670151 511393318
1978.9E11393318k98843k08359q7051l6011r0065j97907k76718k76565k01531r2773
$$ 511393318 511094475 510886116 510799065 510763054 510672989 510475082 510198364 509921799 509720268 509627495
1988.6E09627495N531O5231P3090K5291p1868j89209k72179k72827j95847j12304j04981
$$ 509627495 509633026 509698257 509771347 509796638 509724770 509535561 509263382 508990555 508794708 508682404 508577423
1999.2E08577423j89552k91825l12385k14501n6037O2370O9351l9940k07062l36647
$$ 508577423 508387871 508096046 507783661 507569160 507513123 507575493 507644844 507604904 507397842 507061195
2008.8E07061195l41148j99585N608J38473J19133m005j05858j09596n0621j7395m7188
$$ 507061195 506720047 506520462 506526070 506664543 506783676 506779671 506673813 506564217 506513596 506496201 506449013
2019.4E06449013j00556j26114j20582j14937j25999j50452j91460k58026l25165l23105
$$ 506449013 506348457 506222343 506101761 505986824 505860825 505710373 505518913 505260887 504935722 504612617
2029.1E04612617k06527k9869P4463K2888j25237k20070j69983l5781L2425n8022k52914
$$ 504612617 504406090 504376221 504450684 504473572 504348335 504128265 503958282 503922501 503954926 503896904 503643990
2039.7E03643990l93715l48130j22337J33781K30561Q8272j86997l80325l44429j21841
$$ 503643990 503250275 502902145 502779808 502913589 503144150 503232422 503045425 502665100 502320671 502198830
2049.3E02198830J02424J68991O6147j02768k37579l09486l30468l00102k11258r0790
$$ 502198830 502301254 502470245 502536392 502433624 502196045 501886559 501556091 501255989 501044731 500953941
2059E00953941l43J7052k2507o6757p9994o6262m8561m1160m7493o2561p4463p2365
$$ 500953941 500953598 500970650 500948143 500881386 500801392 500735130 500686569 500645409 500597916 500535355 500460892 500388527
2070.5E00388527o8512j01585j97182l17841l76014l16964j82418p6409o3286j10626
$$ 500388527 500320015 500218430 500021248 499703407 499327393 499010429 498828011 498751602 498688316 498577690
2080.2D98577690j37138j00975k8763K4719K6055l1624j37139k57911l37143l27988
$$ 498577690 498440552 498339577 498310814 498335533 498361588 498329964 498192825 497934914 497597771 497269783
2089.8D97269783k33688j04943J1444J00747J50680J18561k9106k38915l71704l23334
$$ 497269783 497036095 496931152 496942596 497043343 497194023 497312584 497283478 497044563 496672859 496349525
2099.5D96349525j41944N035o10j14022j88980j42288k7428M5433K9335l8261j04561
$$ 496349525 496207581 496212616 496212006 496097984 495909004 495766716 495739288 495784721 495814056 495775795 495671234
2110.1D95671234j54419j90277j97639j59073r6627o9503j16959k10190k70538k34604
$$ 495671234 495516815 495326538 495128899 494969826 494873199 494803696 494686737 494476547 494206009 493971405
2119.7D93971405j04561N1842J41601J04828l8337j90926k48184j87302q8806n4779
$$ 493971405 493866844 493918686 494060287 494165115 494126778 493935852 493687668 493500366 493411560 493356781
2129.4D93356781j03683j57700j37558n2910J0758j1292r9297j80969k04277j69220
$$ 493356781 493253098 493095398 492957840 492904930 492915688 492904396 492805099 492624130 492419853 492250633
2139D92250633j05781m7417k6245o5155j53198k36130k52342j84861p6027Q202K1095
$$ 492250633 492144852 492097435 492071190 492006035 491852837 491616707 491364365 491179504 491103477 491111679 491132774
2149.6D91132774m7836j70555k80457k98652j95961m4899K6664m1198j67542k08015
$$ 491132774 491084938 490914383 490633926 490335274 490139313 490094414 490121078 490079880 489912338 489704323
2159.3D89704323j12648J8463M9057m1962j49574j74370j30539j07422j48849k09160
$$ 489704323 489591675 489610138 489659195 489617233 489467659 489293289 489162750 489055328 488906479 488697319
2168.9D88697319k18697j66931r9525o0311o1836r9144j58920k01607j67808l7690
$$ 488697319 488478622 488311691 488212166 488151855 488090019 487990875 487831955 487630348 487462540 487424850
2178.5D87424850J19248J83220R2277r5176k54822l06244k60468j80320j19667j03875
$$ 487424850 487544098 487727318 487819595 487724419 487469597 487163353 486902885 486722565 486602898 486499023
2188.2D86499023j37558j98898k32162j79367m1619R8343J35765L3913j46027k98271
$$ 486499023 486361465 486162567 485930405 485751038 485709419 485807762 485943527 485977440 485831413 485533142
2197.8D85533142l52516l11012k26174j55678j21803j00593m9515L9368J10588Q8806
$$ 485533142 485180626 484869614 484643440 484487762 484365959 484265366 484215851 484255219 484365807 484454613
2207.5D84454613l5820j78376k31246j68763o3057J412J2092L357j8577r1553k21786
$$ 484454613 484418793 484240417 484009171 483840408 483777351 483778763 483790855 483794212 483775635 483684082 483462296
2218.1D83462296l32909l29819k14004r8038q8539j70937k33154j96076r0293q774
$$ 483462296 483129387 482799568 482585564 482487526 482398987 482228050 481994896 481798820 481708527 481699753
2227.7D81699753o714p0190j57090k30560k54517j92184m8981R6855J39199L9711j32180
$$ 481699753 481693039 481622849 481465759 481235199 480980682 480788498 480739517 480836372 480975571 481015282 480883102
2238.3D80883102k59437k74315j92299p6179R765K0447n7945j82762k64664k37274
$$ 480883102 480623665 480349350 480157051 480080872 480090637 480111084 480053139 479870377 479605713 479368439
2248D79368439j28022m0168m8790j26076j82381j74522j44692j52664j95808k18086
$$ 479368439 479240417 479200249 479151459 479025383 478843002 478668480 478523788 478371124 478175316 477957230
2257.6D77957230j83564j11503l8491K2088O8550P7057K0256p9804j43318j07498j869
$$ 477957230 477773666 477662163 477623672 477645760 477714310 477791367 477811623 477731819 477588501 477481003 477479134
2268.2D77479134O9694K9297j01624k29187k71072k11410r4910O676K3307p9383k68136
$$ 477479134 477548828 477578125 477476501 477247314 476976242 476764832 476669922 476676598 476699905 476620522 476352386
2278.8D76352386m39643m82636l62167j54953O599L5477m8218j43890j60523r6359
$$ 476352386 475912743 475430107 475067940 474912987 474919586 474955063 474906845 474762955 474602432 474506073
2288.5D74506073m0588q2360k08511k96745k32926m4746J04103P4921r7161k37388
$$ 474506073 474465485 474383125 474174614 473877869 473644943 473600197 473704300 473779221 473682060 473444672
2298.1D73444672k20337r2888K212L82l0861j2512K3079k7810j89590l49617l71780
$$ 473444672 473224335 473131447 473133659 473134041 473103180 473090668 473113747 473085937 472896347 472546730 472174950
2308.7D72174950k46811r8000m3487q2093j19056q0338J6480R4299R7237L5133l4676
$$ 472174950 471928139 471830139 471786652 471704559 471585503 471505165 471521645 471615944 471713181 471748314 471713638
2319.3D71713638p2632j04255j98937l79066n52216n69610l84827j34697j7395p9193
$$ 471713638 471641006 471536751 471337814 470958748 470406532 469836922 469452095 469317398 469300003 469220810
2329D69220810j70517j41754l7575k8458j49726k06566j1750L26615M60777J84517
$$ 469220810 469050293 468908539 468870964 468842506 468692780 468486214 468474464 468801079 469261856 469446373
2338.6D69446373l10135o24771n67017k94456o0921O7787J70327K39296J48506j07956
$$ 469446373 469136238 468511467 467944450 467649994 467589073 467656860 467827187 468066483 468214989 468107033
2348.3D68107033k77367q8844L70788O49605L62091m09813j199684j599045j539154
$$ 468107033 467829666 467740822 468111610 468761215 469123306 468713493 467513809 465914764 464375610
2356.9D64375610j170158o05469R6588P62787J081200Q51478K24381l88184o54602
$$ 464375610 463205452 462599983 462696571 463459358 464540558 465392036 465616417 465228233 464573631
2365.6D64573631n58166l07656r6015K5520R5978J59912K46429L65334M74090M79966
$$ 464573631 464015465 463707809 463611794 463637314 463733292 463893204 464139633 464504967 464979057 465459023
2375.3D65459023L26805Q5563r0446j20545p9116r2698j77536k23884j49994k4414
$$ 465459023 465785828 465871391 465780945 465660400 465581284 465488586 465311050 465087166 464937172 464912758
2384.9D64912758J449j29203l05939l65143k53944o9161M6921K8343q2016j88102k14768
$$ 464912758 464914207 464785004 464479065 464113922 463859978 463790817 463837738 463866081 463784065 463595963 463381195
2395.5D63381195j53236n8480p820l8109j19361j84288j93787j63994j35689j26800
$$ 463381195 463227959 463169479 463161659 463123550 463004189 462819901 462626114 462462120 462326431 462199631
2405.2D62199631j23673j10397q7509o3477m0321k0371j6403m6692j12228j92719k57682
$$ 462199631 462075958 461965561 461878052 461814575 461774254 461753883 461737480 461690788 461578560 461385841 461128159
2415.8D61128159k81182k48451j62125n6266J2092R232l7842o4316m1542j5602n1231
$$ 461128159 460846977 460598526 460436401 460380135 460392227 460401459 460363617 460299301 460257759 460242157 460190926
2426.4D60190926j46599k24152k20337j61552j29662j58386j94054j67465q7738l5248
$$ 460190926 460044327 459820175 459599838 459438286 459308624 459150238 458956184 458788719 458700981 458665733
2436D58665733o3438j33820j61476j13106m1198j7739n3672r4262q6746m1923k1592
$$ 458665733 458602295 458468475 458306999 458193893 458152695 458134956 458081284 457987022 457900276 457858353 457836761
2446.6D57836761p1105j68038k39906k32315j60256q7661o2447p4768q6594r0713j18828
$$ 457836761 457765656 457597618 457357712 457125397 456965141 456877480 456815033 456740265 456653671 456562958 456444130
2457.2D56444130j83716k32925j93711o9389L4447J1940j20697k26593j90087m0626
$$ 456444130 456260414 456027489 455833778 455764389 455798836 455810776 455690079 455463486 455273399 455232773
2466.9D55232773Q1596P3624l6011j40190j73302j58195j50337j71128k02636k23275
$$ 455232773 455314369 455387993 455351982 455211792 455038490 454880295 454729958 454558830 454356194 454132919
2476.5D54132919k24113j96686j35155n5275P058L0899L0708K5749m501j02921k59895
$$ 454132919 453908806 453712120 453576965 453521690 453528748 453559647 453590355 453616104 453611603 453508682 453248787
2487.1D53248787l80249l55263j77383L7384J49803J12419j4839j45416k35100k80991
$$ 453248787 452868538 452513275 452335892 452373276 452523079 452635498 452620659 452475243 452240143 451959152
2496.8D51959152k89078k69317k48757k55203k80456k77443k14081j16348m1809j1826
$$ 451959152 451670074 451400757 451152000 450896797 450616341 450338898 450124817 450008469 449966660 449954834
2506.4D49954834P095M8790R3499R0904K7199n2872r8496j03874r6931q9379p0037
$$ 449954834 449961929 450010719 450104218 450195122 450222321 450169449 450070953 449967079 449870148 449780769 449710732
2517D49710732m3183m6463j06315j87569k21291j83410j30425j33324j91841k29149
$$ 449710732 449667549 449621086 449514771 449327202 449105911 448922501 448792076 448658752 448466911 448237762
2526.7D48237762j78871n7335N3368Q1482J5831j05019k27203l01781k98729k30484
$$ 448237762 448058891 448001556 448054924 448136406 448152237 448047218 447820015 447518234 447219505 446989021
2536.3D46989021j54304j35193j86539k52151k59171j82800o4316K8839N0202n646
$$ 446989021 446834717 446699524 446512985 446260834 446001663 445818863 445754547 445783386 445833588 445827942
2546D45827942j08223k01988k28768j64642m3831N9929Q7090K6741q9417k12707k90566
$$ 445827942 445719719 445517731 445288963 445124321 445080490 445140419 445227509 445254250 445164833 444952126 444661560
2556.6D44661560k73514j48773K4796J35460J02653n0507k17704l07045l05901k55012
$$ 444661560 444388046 444239273 444264069 444399529 444502182 444451675 444233971 443926926 443621025 443366013
2566.2D43366013j83106r3269n379K6856l5821j62086k63596k68707j74637l4408Q1749
$$ 443366013 443182907 443089638 443084259 443111115 443075294 442913208 442649612 442380905 442206268 442171860 442253609
2576.8D42253609J08146N188j97639l78304l92074k04811M3716J51367M0627j67046
$$ 442253609 442361755 442366943 442169304 441791000 441398926 441194115 441237831 441389198 441429825 441262779
2586.5D41262779k80456k24991r5711l4866q8692j85699k28501j77612o3210N3215
$$ 441262779 440982323 440757332 440661621 440626755 440538063 440352364 440123863 439946251 439883041 439936256
2596.1D39936256J09749O4698p5684k44408l48587l35274k30636j07842k6207L357
$$ 439936256 440046005 440110703 440035019 439790611 439442024 439106750 438876114 438768272 438742065 438745422
2605.7D38745422r53k4071o6414j32027k11181k70844k65388j72234k8763P6371P4462
$$ 438745422 438744469 438720398 438653984 438521957 438310776 438039932 437774544 437602310 437573547 437649918 437724380
2616.4D37724380j2397q5411p1984o675Q316p5112j93901k46353k06222j38054j07460
$$ 437724380 437711983 437626572 437554588 437547913 437556229 437481117 437287216 437040863 436834641 436696587 436589127
2627D36589127j09635j06277j03646j54380k72446l81661l77082k35901m8256O7558
$$ 436589127 436479492 436373215 436269569 436115189 435842743 435461082 435084000 434848099 434799843 434867401
2636.6D34867401O5956q888q1787j06659q1101l1051M654k365m7341r5405j24893j59531
$$ 434867401 434933357 434924469 434842682 434736023 434654922 434623871 434628525 434626160 434578819 434483414 434358521 434198990
2648.2D34198990k40441l53393m09279l22494j11580R6244J76201J15586M310o9465
$$ 434198990 433958549 433605156 433195877 432873383 432761803 432858047 433034248 433149834 433154144 433084679
2657.8D33084679r9144j34316j98135k52915k40287j47820k7428M4594K4071o9046
$$ 433084679 432985535 432851219 432653084 432400169 432159882 432012062 431984634 432029228 432053299 431984253
2667.5D31984253j65367j95389j42174n1613P553J984n1041j14402j63880j85775j61667
$$ 431984253 431818886 431623497 431481323 431429710 431437263 431439247 431388206 431273804 431109924 430924149 430762482
2678.1D30762482q4305L586K0561p6370k24648k93808k13508m9172O1302M4556n4398
$$ 430762482 430678177 430681763 430702324 430625954 430401306 430107498 429893990 429844818 429906120 429950676 429896278
2688.7D29896278j49383k14997k82974l57856l73688k64969n9586J23902J79596J02768
$$ 429896278 429746895 429531898 429248924 428891068 428517380 428252411 428192825 428316727 428496323 428599091
2698.3D28599091k5483j24778j72692j89209j94740j87492j54190q8768r423L7155
$$ 428599091 428573608 428448830 428276138 428086929 427892189 427704697 427550507 427461739 427452316 427489471
2708D27489471k021j33095k81029l28483k18697k1744J15814R6817m7798k03819k80304
$$ 427489471 427487450 427354355 427073326 426744843 426526146 426504402 426620216 426717033 426669235 426465416 426185112
2718.6D26185112k61497j80855p6218J5831N2071L357j06774k08511k43530k12174
$$ 426185112 425923615 425742760 425666542 425682373 425734444 425737801 425631027 425422516 425178986 424966812
2728.2D24966812j54304r5482l3150K3804L1166n0316j90697k93503k74925j42555
$$ 424966812 424812508 424717026 424683876 424707680 424738846 424688530 424497833 424204330 423929405 423786850
2737.9D23786850J1024Q6747N1078n8555j74141k41776k43415j99318j52474j37405
$$ 423786850 423797874 423884621 423935699 423877144 423703003 423461227 423217812 423018494 422866020 422728615
2747.5D22728615j53198j66626j46866r6550m8332k8992l7384n2796o3133p9689j21384
$$ 422728615 422575417 422408791 422261925 422165375 422117043 422088051 422050667 421997871 421934738 421855049 421733665
2758.1D21733665j87492k43149k39334j56288l7003L5058Q049q0529j31683q3084K0447
$$ 421733665 421546173 421303024 421063690 420907402 420870399 420905457 420913506 420832977 420701294 420618210 420638657
2768.7D20638657O7825n188j47095k45476k32505j35041l0632K0333j679q3046j77536
$$ 420638657 420706482 420701294 420554199 420308723 420076218 419941177 419910545 419930878 419929199 419846153 419668617
2779.3D19668617k13508j39046R346J04141L5248j71394l59230l83034k44293p3777
$$ 419668617 419455109 419316063 419325409 419429550 419464798 419293404 418934174 418551140 418306847 418233070
2789D18233070O180j6250p4082j17798j54762j98288k17438j60217k2392J24702J81236
$$ 418233070 418239250 418223000 418148918 418031120 417876358 417678070 417460632 417300415 417278023 417402725 417583961
2799.6D17583961R7161q9188k79655l83072l74527k99988k25944j74714j16996k9145
$$ 417583961 417681122 417591934 417312279 416929207 416554680 416254692 416028748 415854034 415737038 415707893
2809.2D15707893M8676L9139q0529k26478k78244k00958q3886m4288j04180j80053
$$ 415707893 415756569 415795708 415715179 415488701 415210457 415009499 414925613 414881325 414777145 414597092
2818.9D14597092j85738j26266p9804j02692j74026k28004k20414j57966p8316k1057
$$ 414597092 414411354 414285088 414205284 414102592 413928566 413700562 413480148 413322182 413243866 413222809
2828.5D13222809j0948n0125j11924j55182j53083j15128p1030l8681j5869j220j7281
$$ 413222809 413211861 413161736 413049812 412894630 412741547 412626419 412555389 412516708 412500839 412499619 412482338
2839.1D12482338r0256k10342l15209l32107k46735j34697j10588k24457l94973m58603
$$ 412482338 412392082 412181740 411866531 411534424 411287689 411152992 411042404 410817947 410422974 409964371
2848.8D09964371l16239m3144J59302J45721l4523j92375j95579r1172k7389p4425
$$ 409964371 409648132 409604988 409764290 409910011 409875488 409683113 409487534 409396362 409368973 409294548
2858.4D09294548j58234j70211j00861l2616k2812m0664l2578p057j3504n5504p4081
$$ 409294548 409136314 408966103 408865242 408832626 408809814 408769150 408736572 408729515 408716011 408660507 408586426
2869D08586426l7422p515p4654k36092l79943m06380l34320k57988k21291j73530o3248
$$ 408586426 408549004 408541489 408466835 408230743 407850800 407444420 407110100 406852112 406630821 406457291 406394043
2879.6D06394043O9199J23787N8174o5194j56631j96190k32429k98615l61214l54805
$$ 406394043 406463242 406587029 406645203 406580009 406423378 406227188 405994759 405696144 405334930 404980125
2889.3D04980125k50282p8049R4719J94474J65329P629j94931l05939k37884l9826
$$ 404980125 404729843 404651794 404746513 404940987 405106316 405113945 404919014 404613075 404375191 404335365
2898.9D04335365J28670J24397n9890k95907m28924l89671k27547n8327J9951j8387
$$ 404335365 404464035 404588432 404528542 404232635 403803711 403414040 403186493 403128166 403148117 403129730
2908.6D03129730j22566k14653k51808k50015k46582k49100k26364j58615q1368n9891
$$ 403129730 403007164 402792511 402540703 402290688 402044106 401795006 401568642 401410027 401328659 401268768
2918.2D01268768j19972k10648k48413j92566p3852M3144J10665J10588L9482r0142
$$ 401268768 401148796 400938148 400689735 400497169 400423317 400466461 400577126 400687714 400727196 400637054
2927.8D00637054k33192l14674k75002j25160M7111J32180P4539q9302k56119l25203
$$ 400637054 400403862 400089188 399814186 399689026 399736137 399868317 399942856 399853554 399597435 399272232
2937.5C99272232k63748j27716j8501m044o7215j26343j12571l1624M7493N5503k2010
$$ 399272232 399008484 398880768 398862267 398858223 398791008 398664665 398552094 398520470 398567963 398623466 398601456
2948.1C98601456j42403k42043k70690k13013j00556p934j1482j25618k69013l17077
$$ 398601456 398459053 398217010 397946320 397733307 397632751 397624817 397613335 397487717 397218704 396901627
2957.7C96901627k07329n188J41487J23062m0550k18582k74506j72005M197J19781
$$ 396901627 396694298 396689110 396830597 396953659 396913109 396694527 396420021 396248016 396252213 396371994
2967.4C96371994R7084k8458j48239j83601j55640j53007k27051l26920l52020k63443
$$ 396371994 396469078 396440620 396292381 396108780 395953140 395800133 395573082 395246162 394894142 394630699
2977C94630699j28441n0087o0577j03455j11351q0337n6648o8436r6970j14326j24397
$$ 394630699 394502258 394452171 394391594 394288139 394176788 394096451 394039803 393971367 393874397 393760071 393635674
2987.6C93635674j53199k05993k55661k73209k53448k08970j52397r7770o8360q0452
$$ 393635674 393482475 393276482 393020821 392747612 392494164 392285194 392132797 392035027 391966667 391886215
2997.3C91886215j16577j40152j39275j53770k24915l27873l74603k99301j33972K0179
$$ 391886215 391769638 391629486 391490211 391336441 391111526 390783653 390409050 390109749 389975777 389995956
3006.9C89995956Q9455Q2321M8065N112o4773j64986k51656k72789k27241j67504j42936
$$ 389995956 390085411 390167732 390215797 390220909 390156136 389991150 389739494 389466705 389239464 389071960 388929024
3017.5C88929024j47743j40877j04943p7858j16081k21443l16353l02009j62049l624
$$ 388929024 388781281 388640404 388535461 388457603 388341522 388120079 387803726 387501717 387339668 387336044
3027.2C87336044K3575j27563l39318m27589l18642j16157J0719n188q5716j24436
$$ 387336044 387359619 387232056 386892738 386465149 386146507 386030350 386041069 386035881 385950165 385825729
3036.8C85825729j07269j02158j51634k18200k37770j98250j38054r0904o5346p4845
$$ 385825729 385718460 385616302 385464668 385246468 385008698 384810448 384672394 384581490 384516144 384441299
3046.5C84441299j43508k59095l48739l44315k70729k29225k75765l45497l35502k44866
$$ 384441299 384297791 384038696 383689957 383345642 383074913 382845688 382569923 382224426 381888924 381644058
3056.1C81644058j81389k15339k68784k02446l8J84822J91269K5520j59034k44217
$$ 381644058 381462669 381247330 380978546 380776100 380776062 380960884 381152153 381177673 381018639 380774422
3065.7C80774422k59705l08952m19846n10750m89997l50876j59264J1368J10283J02234
$$ 380774422 380514717 380205765 379785919 379275169 378785172 378434296 378275032 378286400 378396683 378498917
3075.4C78498917j8883j96190l24974l37830k69355k15569k31552k89078l34968l61519
$$ 378498917 378480034 378283844 377958870 377621040 377351685 377136116 376904564 376615486 376280518 375918999
3085C75918999l90702m10690l71551k60735j51024j35727k15645k78434k09961j9684
$$ 375918999 375528297 375117607 374746056 374485321 374334297 374198570 373982925 373704491 373494530 373474846
3094.7C73474846J63154K11678J08795o2790k11754l06625l61786l91998l95699l79371
$$ 373474846 373638000 373849678 373958473 373895683 373683929 373377304 373015518 372623520 372227821 371848450
3104.3C71848450l76473m15993m72526m56657k82135L6735L57094N00603L94439J25237
$$ 371848450 371471977 371055984 370583458 370126801 369844666 369881401 370238495 370739098 371133537 371258774
3114C71258774j49460l38059m50286n07393m64058k64015L1395K23655J43471j59836
$$ 371258774 371109314 370771255 370320969 369813576 369349518 369085503 369116898 369340553 369484024 369324188
3123.6C69324188m31404m36096j73798J40343K92549K46086J16043J3657m8561j15166
$$ 369324188 368892784 368456688 368282890 368423233 368715782 368961868 369077911 369091568 369043007 368927841
3133.3C68927841j97639k56005k52418j98288j39084j08376j05781j13182j23177j54762
$$ 368927841 368730202 368474197 368221779 368023491 367884407 367776031 367670250 367557068 367433891 367279129
3142.9C67279129k35443l61862m71421m62608k79045K0065K79618L64418K65083Q9378
$$ 367279129 367043686 366681824 366210403 365747795 365468750 365488815 365768433 366132851 366397934 366487312
3152.5C66487312m5242r9068j02844r6168r5482j12419j55335k00920j86691p2518
$$ 366487312 366442070 366343002 366240158 366143990 366048508 365936089 365780754 365579834 365393143 365320625
3162.2C65320625Q9951J80321J26648j3428j06964q3428L510M9820J6365m8905q5525
$$ 365320625 365410576 365590897 365717545 365704117 365597153 365513725 365517235 365567055 365583420 365534515 365448990
3172.8C65448990q5983q0452q0681o7978k8801J7280L7690K2239j2931m5739o3629
$$ 365448990 365363007 365282555 365201874 365133896 365105095 365122375 365160065 365182304 365169373 365123634 365060005
3183.4C65060005o1378l8605q011O943j0338n7030j16539j72043k03704j80588q1520
$$ 365060005 364998627 364960022 364952011 364958954 364948616 364891586 364775047 364603004 364399300 364218712 364137192
3194C64137192O5040J77460J80473P9804l8681q8349n7945j182K6588J1826l1090q3084
$$ 364137192 364202232 364379692 364560165 364639969 364601288 364512939 364454994 364453812 364480400 364492226 364461136 364378052
3205.6C64378052j15586q5144K6741J64566K14806J02120j29624l41492m11453l17345
$$ 364378052 364262466 364177322 364204063 364368629 364583435 364685555 364555931 364214439 363802986 363485641
3215.2C63485641j25999P2746K11754K57607K16827J42860J04523J22719J42364R4109
$$ 363485641 363359642 363432388 363644142 363901749 364118576 364261436 364365959 364488678 364631042 364725151
3224.9C64725151j6251r6473o7253M1542J11656N5199j00785k54783l30887l25318
$$ 364725151 364708900 364612427 364545174 364586716 364698372 364753571 364652786 364398003 364067116 363741798
3234.5C63741798k65884j60637p744J55983K50435K15721P7439o4888j24207j04942
$$ 363741798 363475914 363315277 363307533 363463516 363713951 363929672 364007111 363942223 363818016 363713074
3244.2C63713074q8578j37443k09389j85203J983K59896L84941K46467o7596l08685
$$ 363713074 363624496 363487053 363277664 363092461 363094444 363354340 363739281 363985748 363918152 363609467
3253.8C63609467k97280r4566O6070K3766j46751k27318r8801J30921K39410J18637
$$ 363609467 363312187 363217621 363283691 363307457 363160706 362933388 362834587 362965508 363204918 363323555
3263.4C63323555j24969k79618k23999j4381J91498K72560K19841J02768p973q5030
$$ 363323555 363198586 362918968 362694969 362680588 362872086 363144646 363364487 363467255 363459282 363374252
3273.1C63374252j31797j45493j12000l6544L2959L6239l4141j02883p4920O2408K05269
$$ 363374252 363242455 363096962 362984962 362948418 362981377 363017616 362983475 362880592 362805672 362868080 363073349
3283.7C63073349K18506O2408j65825l15246l01705j59912P63P6142K5558j10550k27089
$$ 363073349 363291855 363354263 363188438 362873192 362571487 362411575 362412338 362488480 362514038 362403488 362176399
3294.3C62176399k18735o5917J25885J99508Q4648j31378k80609k65160j27525J8578
$$ 362176399 361957664 361891747 362017632 362217140 362301788 362170410 361889801 361624641 361497116 361515694
3303.9C61515694R7961J02005L9826q7624k45247l34511k61421m9591J44501J65367
$$ 361515694 361613655 361715660 361755486 361667862 361422615 361088104 360826683 360777092 360921593 361086960
3313.6C61086960J1558j59454j87263o2447P9803J04523k289j49536k51541l02277
$$ 361086960 361098518 360939064 360751801 360689354 360769157 360873680 360871391 360721855 360470314 360168037
3323.2C60168037l41911l75099l44620j96876L2158K10304K10533L2692j75324k38838
$$ 360168037 359826126 359451027 359106407 358909531 358941689 359151993 359362526 359395218 359219894 358981056
3332.9C58981056j08986R3956J96228J26343m2000j88064k58103k76107k68403k16140
$$ 358981056 358872070 358966026 359162254 359288597 359246597 359058533 358800430 358524323 358255920 358039780
3342.5C58039780j00556L1128Q0872k632j59188k63824k40174j19972Q39N7068N6000
$$ 358039780 357939224 357970352 358051224 358048592 357889404 357625580 357385406 357265434 357266273 357323341 357379341
3353.1C57379341M2229L6049J2054o3133j78452k64244k40898r1553J04485K22282
$$ 357379341 357421570 357457619 357469673 357406540 357228088 356963844 356722946 356631393 356735878 356958160
3362.8C56958160J84594J8119j80168l21350l71895l40767k53143j49422q7738j08604
$$ 356958160 357142754 357160873 356980705 356659355 356287460 355946693 355693550 355544128 355456390 355347786
3372.4C55347786j82838k19040j51024j9150N8212M578j33019k32086k15912j11999
$$ 355347786 355164948 354945908 354794884 354775734 354833946 354838524 354705505 354473419 354257507 354145508
3382.1C54145508L8P0572R9602R8877O9809K1324j7052k7847l7270q7356j72730k22397
$$ 354145508 354145546 354216118 354315720 354414597 354484406 354505730 354488678 354460831 354423561 354336205 354163475 353941078
3393.6C53941078j70059l5820P8468P8354l9787j97182l07655l31726k74010j49078
$$ 353941078 353771019 353735199 353813667 353892021 353852234 353655052 353347397 353015671 352741661 352592583
3403.3C52592583K8877K25143L75328M10691L05481J08413p8773j68953j53618j04751
$$ 352592583 352621460 352846603 353221931 353632622 353938103 354046516 353967743 353798790 353645172 353540421
3412.9C53540421r7352j28250j19819j8120J23863J87454J20545Q240j6938O8016J38436
$$ 353540421 353443069 353314819 353195000 353176880 353300743 353488197 353608742 353616982 353600044 353668060 353806496
3423.5C53806496O3285j32675k73742k09504K8992K62184L34511K41318R9640J7814
$$ 353806496 353869781 353737106 353463364 353253860 353282852 353545036 353879547 354120865 354220505 354238319
3433.2C54238319J1979K6435P553m6958r4872r1782l3302L2387M6120K937k5673M4441
$$ 354238319 354250298 354276733 354284286 354237328 354142456 354050674 354017372 354049759 354095879 354098816 354073143 354117584
3444.7C54117584K11296L63465L75976K32163L9634p4882p6065k2431J7586K8687L2425
$$ 354117584 354328880 354692345 355068321 355300484 355340118 355265236 355189171 355166740 355184326 355213013 355245438
3455.3C55245438M1542N4741Q2931J50719K58903L62473L99933L48587K39372J23863
$$ 355245438 355286980 355341721 355424652 355575371 355834274 356196747 356596680 356945267 357184639 357308502
3465C57308502L4561k3880o0272q3237r0789o3706K6970J87721L70942M90684M81834
$$ 357308502 357343063 357319183 357258911 357175674 357084885 357021179 357048149 357235870 357606812 358097496 358579330
3475.6C58579330L46947J42250o7596k30980l02506k52113j06659L7117Q4610L4905
$$ 358579330 358926277 359068527 359000931 358769951 358467445 358215332 358108673 358145790 358230400 358265305
3485.2C58265305j4267K4910J29051J95999J66893Q9874N1766P5721J20163J62926
$$ 358265305 358251038 358275948 358404999 358600998 358767891 358857765 358909531 358985252 359105415 359268341
3494.9C59268341K42577L88221N40276N78117M39759J90391l6125j52397j60446j09940
$$ 359268341 359510918 359899139 360439415 361017532 361457291 361647682 361611557 361459160 361298714 361188774
3504.5C61188774m5662R16R384q850Q77R4299K57950M03023M39758L54576K02828M4212
$$ 361188774 361143112 361144028 361153412 361144562 361145439 361239738 361497688 361900711 362340469 362695045 362897873 362942085
3516.1C62942085q7890j59874j20926M3220K51618L62968L00217J29814K518O256R3422
$$ 362942085 362854195 362694321 362573395 362616615 362868233 363231201 363531418 363661232 363663750 363670006 363763428
3526.7C63763428J51443J24932O2980N4360J35154K57111L30009K90947J49651j6975
$$ 363763428 363914871 364039803 364102783 364157143 364292297 364549408 364879417 365170364 365320015 365303040
3536.4C65303040j19133j18447m9553L0136J05515K09770L51257M58947M30450K50473
$$ 365303040 365183907 365065460 365015907 365046043 365151558 365361328 365712585 366171532 366601982 366852455
3546C66852455L6430o0729n112R2315J02196K2278k3003P5188K85835M66462M98199
$$ 366852455 366888885 366828156 366823044 366915359 367017555 367039833 367016830 367092018 367377853 367844315 368342514
3556.6C68342514L80058K00196M6577l6163k6856Q2169K48680L50304K56652l1166
$$ 368342514 368722572 368922768 368969345 368933182 368906326 368988495 369237175 369587479 369844131 369812965
3566.2C69812965l16925l39050j4191M46282O93779N55267J94779m6349K4185K91977
$$ 369812965 369496040 369156990 369142799 369589081 370282860 370838127 371032906 370986557 371010742 371302719
3575.9C71302719M92134M92668L92495L51638L81775L41034J19858k12441m67109n08194
$$ 371302719 371794853 372287521 372680016 373031654 373413429 373754463 373874321 373661880 373194771 372686577
3585.5C72686577l43208p0038K10228M13856M62380L21617P2517r8381l3302K52952
$$ 372686577 372343369 372273331 372483559 372897415 373359795 373681412 373753929 373655548 373622246 373875198
3595.2C73875198N70565P03964N78308K98958N2872l1930L3188J24321J13297j7548
$$ 373875198 374445763 375149727 375728035 376026993 376079865 376047935 376081123 376205444 376318741 376301193
3604.8C76301193j50680j38436M5739K59513L14598J61591n2223j13259O1722L51754
$$ 376301193 376150513 376012077 376057816 376317329 376631927 376793518 376741295 376628036 376689758 377041512
3614.5C77041512N38826M89959K63367N4970L7994K13623M02451M03671J92986m1123
$$ 377041512 377580338 378070297 378333664 378388634 378426628 378640251 379042702 379446373 379639359 379598236
3624.1C79598236q8997M6311J39465l319l02124m63867k98386O8245L24517L00140
$$ 379598236 379509239 379555550 379695015 379691696 379389572 378925705 378627319 378695564 379020081 379320221
3633.8C79320221J14746R041P5798J95465J98517M2267j71166k89955j97563J35269
$$ 379320221 379434967 379444008 379519806 379715271 379913788 379956055 379784889 379494934 379297371 379432640
3643.4C79432640O00166R46236R06143M11949l00712q41217r49059o54907j92490K01302
$$ 379432640 380032806 380979042 381885185 382297134 381996422 381155205 380206146 379551239 379358749 379560051
3653C79560051M04358M03290K55088O7139m7302m9400r156k4261j04637j57242r5291
$$ 379560051 379964409 380367699 380622787 380689926 380642624 380593224 380584068 380559807 380455170 380297928 380202637
3663.6C80202637O5307K27776L04184K63367J20277o1073j56174m2305K49977M74320
$$ 380202637 380267944 380495720 380799904 381063271 381183548 381122475 380966301 380923996 381173973 381648293
3673.3C81648293L39622j93787q11462j090775q71047l73459K7237J25656j1216j79672
$$ 381648293 381987915 381794128 380982666 379891891 379020844 378647385 378674622 378800278 378789062 378609390
3682.9C78609390k16789o6833K29759N54352P39936O61202L31802r6397m34914n66330
$$ 378609390 378392601 378325768 378555527 379109879 379849815 380511017 380842819 380746422 380311508 379745178
3692.6C79745178m67911j94091J33476L47328L32184J33781n9471r8266k6436k1668
$$ 379745178 379277267 379083176 379216652 379563980 379896164 380029945 379970474 379872208 379845772 379824104
3702.2C79824104j70402l46680l46069j23215J47285K45438J11275j31569l17001l64800
$$ 379824104 379653702 379307022 378960953 378837738 378985023 379230461 379341736 379210167 378893166 378528366
3711.9C78528366k91710j55525j4992Q8310J48163J86119K01416J34125p4539l60374
$$ 378528366 378236656 378081131 378066139 378154449 378302612 378488731 378690147 378824272 378749733 378389359
3721.5C78389359n12848l43895R4146M91524N28450J62392l28751n84640m42887j6746
$$ 378389359 377876511 377532616 377626762 378118286 378646736 378809128 378480377 377895737 377452850 377436104
3731.2C77436104M35486O85386O19660K52914k70386p00531p97004n07508n7373J85967
$$ 377436104 377871590 378556976 379176636 379429550 379159164 378458633 377661629 377154121 377096748 377282715
3740.8C77282715R15m86679q95691r07554n24102l5438K56233K76947J73912J18370
$$ 377282715 377283630 376796951 375901260 374993706 374469604 374434166 374690399 374967346 375141258 375259628
3750.4C75259628J51520K09961K42653K50854K27471J19781j00937l50151m59442l30734
$$ 375259628 375411148 375621109 375863762 376114616 376342087 376461868 376360931 376010780 375551338 375220604
3760.1C75220604m2191K14501L03001K34566J06964j0376j06773j75438j76392p9918
$$ 375220604 375178413 375392914 375695915 375930481 376037445 376027069 375920296 375744858 375568466 375488548
3769.7C75488548P1030J77422J68609O7291l7536p1945l2387K3117K2850o8779k20909
$$ 375488548 375559578 375737000 375905609 375972900 375935364 375863419 375831032 375854149 375876999 375808220 375587311
3780.3C75587311l40729l29132j63841O3095K13165K21748J49231R9106R6398O6299
$$ 375587311 375246582 374917450 374753609 374816704 375029869 375251617 375400848 375499954 375596352 375662651
3790C75662651o1417k56538m14085m65393m25225l33404j98212l7155O0730n493j94664
$$ 375662651 375601234 375344696 374930611 374465218 374039993 373706589 373508377 373471222 373531952 373526459 373331795
3800.6C73331795k86942q6326L23104N97039M63409K1744l46680l71666j43737N2528
$$ 373331795 373044853 372958527 373281631 373878670 374342079 374363823 374017143 373645477 373501740 373554268
3810.2C73554268R4185J23176K95105N22995N53665K83547r1591k82402k17514r7656
$$ 373554268 373648453 373771629 374066734 374589729 375143394 375426941 375335350 375052948 374835434 374737778
3819.9C74737778j46408l63770n45082n06210k58103K4414J57738P9575j25084k83051
$$ 374737778 374591370 374227600 373682518 373176308 372918205 372942619 373100357 373179932 373054848 372771797
3829.5C72771797k46620o142K82173M11034K98042N4970j31721j85852j85662k27775
$$ 372771797 372525177 372519035 372801208 373212242 373510284 373565254 373433533 373247681 373062019 372834244
3839.2C72834244k80762k19688l281K21138K39334j640l08876m16222k42882L0747
$$ 372834244 372553482 372333794 372330513 372551651 372790985 372789345 372480469 372064247 371821365 371852112
3848.8C71852112J47095J6822k23159l77617l79563l01857k23045j38969k1286Q3770
$$ 371852112 371999207 372016029 371792870 371415253 371035690 370733833 370510788 370371819 370350533 370434303
3858.4C70434303P7515o5918k38686l00827k19993p5760O2065J94893L09944K99034
$$ 370434303 370511818 370445900 370207214 369906387 369686394 369610634 369672699 369867592 370177536 370476570
3868.1C70476570N8060l09982m87862k37770K96860O67572N62210J35650j54915m7569
$$ 370476570 370534630 370224648 369736786 369499016 369795876 370463448 371025658 371161308 371006393 370958824
3877.7C70958824K57645L49579P0266l43551n60189n06973l71666l13644k78130j25351
$$ 370958824 371216469 371566048 371636314 371292763 370732574 370225601 369853935 369540291 369262161 369136810
3887.4C69136810J28212K86179J91002q6594l09677l03955j03836J15356K06490J56822
$$ 369136810 369265022 369551201 369742203 369655609 369345932 369041977 368938141 369053497 369259987 369416809
3897C69416809O4659M1504J25733K55241L09830J98593p1793l99055o45447p00951
$$ 369416809 369481468 369522972 369648705 369903946 370213776 370412369 370340576 369941521 369296074 368595123
3906.7C68595123n21660j56745K36930M49105L53317K7122k85186l66936j98593O1836
$$ 368595123 368073463 367916718 368153648 368602753 368956070 368983192 368698006 368331070 368132477 368194313
3916.3C68194313K39868K67678J64680l1204k71721m70047n31235m35181k57759q4419
$$ 368194313 368434181 368701859 368866539 368835335 368563614 368093567 367562332 367127151 366869392 366784973
3926C66784973O9695K27852L61480L82843K44751J1292j93749k85072k51312j25313
$$ 366784973 366854668 367082520 367444000 367826843 368071594 368082886 367889137 367604065 367352753 367227440
3935.6C67227440K3651Q5068k5940k50359l80363k50283O9199L15819L07464J16044
$$ 367227440 367251091 367336159 367310219 367059860 366679497 366429214 366498413 366814232 367121696 367237740
3945.2C67237740m8066p9612m7341m7874q4725j14631j35041j56326j30653m120J53923
$$ 367237740 367189674 367110062 367062721 367014847 366930122 366815491 366680450 366524124 366393471 366389351 366543274
3955.8C66543274J65787n5237l73421n60913n37300m11797l04947k22511j29623m9782
$$ 366543274 366709061 366653824 366280403 365719490 365182190 364770393 364465446 364242935 364113312 364063530
3965.5C64063530r918N3711K15759L92952L80325J11161k11602l37295k54402j48163
$$ 364063530 364053612 364107323 364323082 364716034 365096359 365207520 364995918 364658623 364404221 364256058
3975.1C64256058j19477j03683p8201j63155l87917n27458l96347k17628l89061q22640
$$ 364256058 364136581 364032898 363954697 363791542 363403625 362876167 362479820 362262192 361873131 361050491
3984.8C61050491q82759k66151L54729Q7051q37479j174240m83856j39809j524086
$$ 361050491 360167732 359901581 360256310 360343361 359505882 358331642 357847786 357707977 356183891
3993.5C56183891l449859l038521m65355j939964j5357170m1094685o7723198
$$ 356183891 352734032 349695511 349230156 347290192 331933022 290838337 223115139
4000.2B23115139
$$ 223115139
##END=$$ End of the data block
