##TITLE=$$ Begin of the data block
##JCAMP-DX=5.00 $$ ACD/SpecManager v 10.08
##SPECTROMETER/DATA SYSTEM=Alpha
##DATE=11 Jun 2014 08:19:42
##DATA TYPE=INFRARED SPECTRUM
##DATA CLASS=XYDATA
##ORIGIN=
##OWNER=
##NPOINTS=1765
##FIRSTX=399.75695801
##LASTX=3997.56933594
##MAXX=3997.56933594
##MINX=399.75695801
##MAXY=0.64176083
##MINY=0.07987151
##XFACTOR=1.0000000000
##YFACTOR=1.000000000000000e-9
##FIRSTY=0.33246303
##DELTAX=2.03957629
##XUNITS=1/CM
##YUNITS=ARBITRARY UNITS
##XYDATA=(X++(Y..Y))
399.8C32463026Q779794P848412Q825689R686679Q589387Q286864R023517P878095
416.1D01381463P896155R465724P478774O229400O897688O138802N442709O298542
432.4D57229257O162434M918009N118818N335182M348546M482209N028964L880322
448.7D96503741L241330L886998L282785K679586L334105K440393J199723J957237
465E18525898K339960J692712K532363L414929K485275K307415L058851K608359K195298
483.4E41161060K798796K388597J713633K348065K278507J350522J656056J908242
499.7E57603478J123906J227676J736582J164257R55284J391888P79509M3512O37054
518.1E66663146Q87036K27929L68535P52091L33131M16398R12845N39362L99173J126229
$$ y = [332463026, 341242820, 349091232, 357916921, 367603600, 376192987, 384479851, 393503368, 401381463, 409277618, 418743342, 426222116, 432451516, 439349204, 445488006, 450930715, 457229257, 463391691, 468309700, 473428518, 478763700, 483112246, 487594455, 492623419, 496503741, 499745071, 503632069, 506914854, 509594440, 512928545, 515368938, 516568661, 518525898, 520865858, 522558570, 525090933, 528505862, 530991137, 533298552, 536357403, 538965762, 541161060, 543959856, 546348453, 548062086, 550410151, 552688658, 554039180, 555695236, 557603478, 558727384, 559955060, 561691642, 562855899, 563811183, 565203071, 565982580, 566026092, 566663146, 567550182, 567778111, 568146646, 568898737, 569231868, 569648266, 570561111, 571100473, 571499646, 572625875]
538.4E72625875J108349N57482R03189J100719M51505M98057Q72910K78294j28925
556.8E78267455K77698K57611K7061N65112Q03768K35081L44694O41346m7327k29775
577.2E81142724M86016N01871M65095J197934J152992L89636N29945O23166p3194P3731
597.6E86489916M79042m28915j021087n47707p33971r40919n6088K37703k22266M32730
618E83688438J213074Q68261J012980J429320P29740M38451J251042J253843P74324
636.3E92659473J283706J366496N60045O86467R89735R9420k48730K26200k70665p00533
656.7E96651614j18494k90454r41336n37693l13640o60479J99795N98251p6472k45571
677.1E94265521K99751j50799r05097o82831r41992j918971k156437k512812l841400
$$ y = [572625875, 573734224, 574291706, 575194895, 576295614, 576747119, 577245176, 578118086, 578396380, 578267455, 578545153, 578802764, 578829825, 579394937, 580198705, 580433786, 580778480, 581419826, 581372499, 581142724, 581628740, 582130611, 582595706, 583793640, 584946632, 585336268, 585866213, 586489379, 586416185, 586489916, 586968958, 586540043, 585518956, 584971249, 584237278, 583296359, 583240271, 583477974, 583255708, 583688438, 584901512, 585769773, 586782753, 588212073, 588941813, 589380264, 590631306, 591885149, 592659473, 593943179, 595309675, 595869720, 596556187, 597545922, 597645342, 597396612, 597622812, 597352147, 596651614, 596533120, 596242666, 595301330, 594763637, 594449997, 593789518, 593989313, 594587564, 594511092, 594265521, 594565272, 594414473, 593509376, 592826545, 591884553, 589965582, 587809145, 585296333, 581454933]
695.5E81454933m851163n396366o533444p859885q730829r380639q978188o973624
711.8E22750795n223394m640460l509223n11766L790319Q508206J2674153J5078723
728.1E48917353J5726149J5201807J3331116J0689616Q423030O346643M256487L020465
744.4F25912666K460838J692652J147151J091481P87973L65794L42667K91586O0797
762.8F34153605J39951L34144K56896K58922L66509L13521L22819M85718M95851K58148
783.2F37386084J05559N4896q7619j79290j48893j21772j51753j04070m649j53899
803.6F36594594l78609l84569m57943o47962p05302p63058j025856j273990j402854
821.9F29554451j684845k008438k210736k570391l132105l611803m152894m902720
$$ y = [581454933, 576603770, 571207404, 564673960, 556814075, 548083246, 538702607, 529724419, 522750795, 517527401, 512886941, 509377718, 508865952, 512656271, 521164477, 533838630, 548917353, 564643502, 579845309, 593176425, 603866041, 612289071, 618635714, 622892201, 625912666, 628373504, 630066156, 631213307, 632304788, 633092761, 633458555, 633801222, 634092808, 634153605, 634293556, 634627700, 634884596, 635143518, 635510027, 635823548, 636146367, 636632085, 637127936, 637386084, 637491643, 637546539, 637458920, 637279630, 637130737, 637008965, 636857212, 636753142, 636748493, 636594594, 636215985, 635831416, 635373473, 634725511, 634020209, 633257151, 632231295, 630957305, 629554451, 627869606, 625861168, 623650432, 621080041, 617947936, 614336133, 610183239, 605280519]
838.3F05280519n765319p309914j0254979j2408912r495080l823101k958477p738590
854.6E45526147j3493598j8203616k2716075k8690815l7869453n0840348o0757250
868.9C12954992n3694546l0392081q234665P268578K3007796L8813203M9588025N4625362
885.2C93936664N4838925M9214781L8676142K7629197J9528449J4215886J0489822
899.4F08529866Q047938O382525M839182L670037K983331K247215J636624J448870
915.8F39785588J130879N62489K52008K9862l02493l54827k24888l51250m15624k32219
936.2F39879525k93494l96788j94311j16885k83181l87192o13034j069247j400054
954.5F35125339j644373k037108k298176k317608k508282k818406k968490l203213
$$ y = [605280519, 599515200, 592205286, 581950307, 569541395, 560046315, 556223214, 553264737, 545526147, 532032549, 513828933, 491112858, 462422043, 424552590, 373712242, 312954992, 259260446, 228868365, 220633700, 227902278, 250910074, 289723277, 339311302, 393936664, 448775589, 497990370, 536666512, 564295709, 583824158, 598040044, 608529866, 616577804, 622960329, 627799511, 631469548, 634452879, 636700094, 638336718, 639785588, 640916467, 641478956, 641730964, 641760826, 641458333, 641103506, 640878618, 640527368, 640111744, 639879525, 639586031, 639189243, 638994932, 638878047, 638594866, 638207674, 637594640, 636525393, 635125339, 633480966, 631443858, 629145682, 626828074, 624319792, 621501386, 618532896, 615329683]
970.8F15329683l624618m004359m492045n181789n752266o153703o457805o485641
987.1E73177457o318510o221413o033242n674064n420685n288720n149901n185008
1003.5E27885914n476594n708754n762041n760431n620688n290747m853189m215062
1019.8D85198408l376931k553165j817792j105786m37021J13607M98503N67287K54274
1038.1D77341384k43455p13259j074672j178980r87649n94467J14352J078695J866579
1056.5D75608528K309322K569348K427965J619995L75151j048654k533406l689945
1072.8D77638304m079252l763169l017187k027542q94874L53426J661509K853155L660947
1091.2D72385317L797323L119349J904160P62254Q8245j30624P3343N28425Q77679
$$ y = [615329683, 611705065, 607700706, 603208661, 598026872, 592274606, 586120903, 579663098, 573177457, 566858947, 560637534, 554604292, 548930228, 543509543, 538220823, 533070922, 527885914, 522409320, 516700566, 510938525, 505178094, 499557406, 494266659, 489413470, 485198408, 481821477, 479268312, 477450520, 476344734, 475907713, 476021320, 476519823, 477087110, 477341384, 477097929, 476384670, 475309998, 474131018, 473143369, 472548902, 472663254, 473741949, 475608528, 477917850, 480487198, 482915163, 484535158, 484910309, 483861655, 481328249, 477638304, 473559052, 469795883, 466778696, 464751154, 463856280, 464209706, 465871215, 468724370, 472385317, 476182640, 479301989, 481206149, 481968403, 482056648, 481926024, 481999367, 482527792, 483405471]
1109.5D83405471J046777J151800J074701O95616K66284L3856q0288j67191j75983
1127.9D87251043k27242m74185q56370j321375j819045k166330k299339k273619k045781
1146.2D73767757j710414j418680j120478p43032l00228K28405Q53210J440078J859457
1164.6D72856075K037018J888841J497627J143724R63032Q36342O31571L20524p3254
1182.9D82101500n41538j024187j451850j812756k103090k321303k440125k439498
1199.3D67967153k331794k154886j975745j906306j990706k164453k399057k677471
1215.6D50366735k901315l016144l126771l225088l243148l247410l260642l215194
1231.9D25131023l142476l091067l033191l030211l079921l074467l004968l012985
$$ y = [483405471, 484452248, 485604048, 486678749, 487374365, 487640649, 487674505, 487594217, 487427026, 487251043, 487023801, 486549616, 485693246, 484371871, 482552826, 480386496, 478087157, 475813538, 473767757, 472057343, 470638663, 469518185, 468775153, 468474925, 468703330, 469556540, 470996618, 472856075, 474893093, 476781934, 478279561, 479423285, 480386317, 481222659, 481854230, 482174754, 482101500, 481559962, 480535775, 479083925, 477271169, 475168079, 472846776, 470406651, 467967153, 465635359, 463480473, 461504728, 459598422, 457607716, 455443263, 453044206, 450366735, 447465420, 444449276, 441322505, 438097417, 434854269, 431606859, 428346217, 425131023, 421988547, 418897480, 415864289, 412834078, 409754157, 406679690, 403674722, 400661737]
1248.2D00661737l097713l126204l149718l241778l285199l260106l277361l278107
1264.5C74945551l280520l351093l424137l435374l489077l590792l608495l598601
1280.8C47167462l654897l737211l796071l889293l945529l989518m114806m238129
1297.2C15802008m264057m279673m317105m272908m260480m297972m301488m255325
1313.5B81553000m213244m191607m169911m178554m270136m390955m468292m543245
1329.8B47127056m516527m400432m398480m632220m753113m538104m400312m466311
1346.1B11021557m558637m607365m603132m582406m564642m482449m523903m703283
1362.4A74395740m538223m221797m244089m236043m195451m255176m041046l866166
$$ y = [400661737, 397564024, 394437820, 391288102, 388046324, 384761125, 381501019, 378223658, 374945551, 371665031, 368313938, 364889801, 361454427, 357965350, 354374558, 350766063, 347167462, 343512565, 339775354, 335979283, 332089990, 328144461, 324154943, 320040137, 315802008, 311537951, 307258278, 302941173, 298668265, 294407785, 290109813, 285808325, 281553000, 277339756, 273148149, 268978238, 264799684, 260529548, 256138593, 251670301, 247127056, 242610529, 238210097, 233811617, 229179397, 224426284, 219888180, 215487868, 211021557, 206462920, 201855555, 197252423, 192670017, 188105375, 183622926, 179099023, 174395740, 169857517, 165635720, 161391631, 157155588, 152960137, 148704961, 144663915, 140797749]
1378.7A40797749l891572l818572l644347l630772l592976l404818l597543l952495
1395.1A11264654l858358l754504l613278l388979l323793k959200k518803k247720
1411.4H5600019j935170j586414j301170q06391r9369L61912O60651Q71986J082309
1429.7H2848363J179114J098707J196392J384780J135192Q88423P64332O86609O98931
1448.1I1880843O39424M75943L24324M40418P86461P77073O48544P91169R66542Q75138
1468.5I8605879Q39278J212105J590110J585365J580685J678057J826100J883395K073787
1486.8A12874761K597392L107555K953358K944849L644012L962115L565267K962753
1503.2A38612062L248065M873649M618734L625929L480822L575146L733620L715426
$$ y = [140797749, 136906177, 133087605, 129443258, 125812486, 122219510, 118814692, 115217149, 111264654, 107406296, 103651792, 100038514, 96649535, 93325742, 90366542, 87847739, 85600019, 83664849, 82078435, 80777265, 79970874, 79871505, 80233417, 80894068, 81766054, 82848363, 84027477, 85126184, 86322576, 87707356, 88842548, 89730971, 90495303, 91181912, 91880843, 92520267, 92996210, 93320534, 93760952, 94547413, 95324486, 95973030, 96764199, 97730741, 98605879, 99445157, 100657262, 102247372, 103832737, 105413422, 107091479, 108917579, 110800974, 112874761, 115472153, 118579708, 121533066, 124477915, 128121927, 132084042, 135649309, 138612062, 141860127, 146733776, 151352510, 154978439, 158459261, 162034407, 165768027, 169483453]
1519.5A69483453M159257M170775L664345L758177L468156L339216L783628L247306
1535.8A99074313K593845L763572M746884M183322L948137L791899L984153M131645
1552.1B30217770M089400L859341N427301P546723N282938M370183M662275M897654
1568.4B70353585N229980M311592L812372M719585M350096L511966L437131L330678
1584.7C03056985L094167K884030K659678K450973K301723K063990J842886J736730
1601.1C22091162J609743J359731J202613J152337R63598O02484N32210Q78423P19965
1619.4C31112266L98606M88966O05613O25074O91474N08129M76718J230091J743913
1637.8C37880850J487881J347184J298547J810431K417147J698167J989960L978789
$$ y = [169483453, 173642710, 177813485, 181477830, 185236007, 188704163, 192043379, 195827007, 199074313, 201668158, 205431730, 210178614, 214361936, 218310073, 222101972, 226086125, 230217770, 234307170, 238166511, 243593812, 251140535, 256423473, 260793656, 265455931, 270353585, 275583565, 279895157, 283707529, 288427114, 292777210, 296289176, 299726307, 303056985, 306151152, 309035182, 311694860, 314145833, 316447556, 318511546, 320354432, 322091162, 323700905, 325060636, 326263249, 327415586, 328379184, 328981668, 329513878, 330392301, 331112266, 331510872, 331999838, 332605451, 333230525, 333921999, 334430128, 334906846, 336136937, 337880850, 339368731, 340715915, 342014462, 343824893, 346242040, 347940207, 349930167, 353908956]
1654.1C53908956L303498K319247K457290L083319L368646K804041K987146L774792
1670.4C78006935L413826L457249L919422L275544K563834K912253M664451M456669
1686.7D06670183L342569L277987K818585K980500L459185L565967M412920L577530
1703D34105426K898812L321201K993524K441645K066612K085328L078491L436386K483159
1721.4D58910584K131314K231806K056092J817733J673222K585858L096342K083510
1737.7D76586461K059102K334952K058059J840443J827389K299815K636433K021074
1754D93663728J674444J759976J706064J934707J760721J276195J117647J124263J605153
1772.4E07622898J642346Q59141L88384J79649k03014o44386j080572j676738k062440
$$ y = [353908956, 357212454, 359531701, 361988991, 365072310, 368440956, 371244997, 374232143, 378006935, 381420761, 384878010, 388797432, 392072976, 394636810, 397549063, 402213514, 406670183, 410012752, 413290739, 416109324, 419089824, 422549009, 426114976, 430527896, 434105426, 437004238, 440325439, 443318963, 445760608, 447827220, 449912548, 452991039, 456427425, 458910584, 461041898, 463273704, 465329796, 467147529, 468820751, 471406609, 474502951, 476586461, 478645563, 480980515, 483038574, 484879017, 486706406, 489006221, 491642654, 493663728, 495338172, 497098148, 498804212, 500738919, 502499640, 503775835, 504893482, 506017745, 507622898, 509265244, 510124385, 510512769, 510692418, 510489404, 509845018, 508764446, 507087708, 505025268]
1790.7E05025268j768291j441121j448155j129508l71426L07202P28875J145304J672148
1809.1E02720296K298057K696813K804637K964496L088534K876341K703906K781748
1825.4E24934828K527058K532542K725125K275645J898170J812160J502156J147509
1841.7E41355193J521468J969158J634956J346469J254439J189709J183748J187623
1858E52642763J186251J101911Q27730O16312J003504J483261J261056R78172R37700
1876.4E62038660R07898Q66473Q74340Q81553P56919P80940R40264Q30471P85470Q94487
1896.8E70557475Q33690P49588P08521O66558O70255P47859P95126O26028M20391N72384
1917.2E77347875P96437O96897P34628P85291O16193N38289N49197N61417N79536N38170
$$ y = [505025268, 503256977, 501815856, 500367701, 499238193, 498866767, 499173969, 499902844, 501048148, 502720296, 505018353, 507715166, 510519803, 513484299, 516572833, 519449174, 522153080, 524934828, 527461886, 529994428, 532719553, 534995198, 536893368, 538705528, 540207684, 541355193, 542876661, 544845819, 546480775, 547827244, 549081683, 550271392, 551455140, 552642763, 553829014, 554930925, 555758655, 556374967, 557378471, 558861732, 560122788, 561100960, 562038660, 562946558, 563813031, 564687371, 565568924, 566325843, 567106783, 568047047, 568877518, 569662988, 570557475, 571391165, 572140753, 572849274, 573515832, 574186087, 574933946, 575729072, 576355100, 576775491, 577347875, 578144312, 578841209, 579575837, 580361128, 580977321, 581515610, 582064807, 582626224, 583205760, 583743930]
1937.6E83743930L87907M53770P02977O71089N03480M67599M70638M19557L96371M16577
1958E88633895M12345L64125L46601M20332N22792N32508M76301M45902M62532M80175
1978.4E93097508M19617L70085L75569L42428K74301L43382M88639M34160L46601L87788
1998.8E96880078L65675L04162L39091L37243K76506K89321K84195K24650K97785L83675
2019.2E99982381K88904K30372K89380K77817K27511K71142K75552K01225K06232K70606
2039.6F02521122K82704K64049K81095K69711K37227K76446K80381J97350K09332K62141
2060F05081558K08438K10702K91526K62380J94788K32816K61128K14696K20179K55525
2080.3F07433736K09630J78575K12670K10762K04265K17438J88529J46806J57476J62065
$$ y = [583743930, 584131837, 584585607, 585288584, 585959673, 586463153, 586930752, 587401390, 587820947, 588217318, 588633895, 589046240, 589410365, 589756966, 590177298, 590700090, 591232598, 591708899, 592154801, 592617333, 593097508, 593517125, 593887210, 594262779, 594605207, 594879508, 595222890, 595711529, 596145689, 596492290, 596880078, 597245753, 597549915, 597889006, 598226249, 598502755, 598792076, 599076271, 599300921, 599598706, 599982381, 600271285, 600501657, 600791037, 601068854, 601296365, 601567507, 601843059, 602044284, 602250516, 602521122, 602803826, 603067875, 603348970, 603618681, 603855908, 604132354, 604412735, 604610085, 604819417, 605081558, 605289996, 605500698, 605792224, 606054604, 606249392, 606482208, 606743336, 606958032, 607178211, 607433736, 607643366, 607821941, 608034611, 608245373, 608449638, 608667076, 608855605, 609002411, 609159887, 609321952]
2100.7F09321952J29521J45912J70052J25527J04189J33992J09553Q0228J25169J39833
2121.1F10585928P8082P5817J33217J18672Q3983J05322J22845Q8870O8784R0778J03056
2143.6F11655354J06872J26719J28746J17242J55032J74403J37329J57774K28763K36928
2164F13225162K00033J85073J87516J98305K20358K34365K14160K08855K21431J93596
2184.4F15288854J72853K28226K74420K10643J42693J55926J69397J65402J74880J42813
2204.8F17126107J19269J71006K00391J60038J21594J14023J10686J25468J44243J21653
2225.2F18514478P6413P8440J12116J02282Q5890J05083J13189R6798J06454J16170
2245.6F19507313J00851J03056J18375J01090P9989J00851J07110J20461J51395J18614
$$ y = [609321952, 609451473, 609597385, 609767437, 609892964, 609997153, 610131145, 610240698, 610320926, 610446095, 610585928, 610664010, 610739827, 610873044, 610991716, 611075699, 611181021, 611303866, 611392736, 611461520, 611552298, 611655354, 611762226, 611888945, 612017691, 612134933, 612289965, 612464368, 612601697, 612759471, 612988234, 613225162, 613425195, 613610268, 613797784, 613996089, 614216447, 614450812, 614664972, 614873827, 615095258, 615288854, 615461707, 615689933, 615964353, 616174996, 616317689, 616473615, 616643012, 616808414, 616983294, 617126107, 617245376, 617416382, 617616773, 617776811, 617898405, 618012428, 618123114, 618248582, 618392825, 618514478, 618590891, 618669331, 618781447, 618883729, 618969619, 619074702, 619187891, 619284689, 619391143, 619507313, 619608164, 619711220, 619829595, 619930685, 620010674, 620111525, 620218635, 620339096, 620490491, 620609105]
2265.9F20609105P3552J08003J51992J21951R0182J02341P4029R835J5616L2843j0729
2288.4F21378720k5153j1444m1903o3061m4525q0228j57058j89602k00093k06173j50740
2310.8F20208740o9082j35541l04222l31461k08795q1062q5831j95861j34587P8678
2331.2F18740976R6083l2187m6432P6354K61247O88553R19401k61724j577377j446605
2351.6F17418289m90427k9564J32621L86118N15223N49078O13272O88613O99877O17505
2372F21100605N02824L99590K95937J88112O4373l5941o6281n9187p0393o8605o3837
2394.4F22187197r4712r8645o7294o1929p9334q9705j10984j50740j68025j33217j10805
2416.9F21021807j42097j68860j73748j97708k15233k09510k29836k39670k30491k56956
$$ y = [620609105, 620682657, 620790660, 620942652, 621064603, 621154785, 621257126, 621331155, 621340990, 621356606, 621389449, 621378720, 621353567, 621342123, 621300220, 621237159, 621192634, 621112406, 620955348, 620765746, 620565653, 620359480, 620208740, 620139658, 620004117, 619699895, 619368434, 619159639, 619078577, 618992746, 618796885, 618662298, 618740976, 618837059, 618804872, 618758440, 618834794, 619096041, 619784594, 620703995, 620442271, 618864894, 617418289, 616927862, 616898298, 617030919, 617417037, 617932260, 618481338, 619094610, 619783223, 620483100, 621100605, 621603429, 622003019, 622298956, 622487068, 622551441, 622515500, 622449219, 622390032, 622319639, 622251034, 622187197, 622092485, 621993840, 621926546, 621864617, 621785283, 621695578, 621584594, 621433854, 621265829, 621132612, 621021807, 620879710, 620710850, 620537102, 620339394, 620124161, 619914651, 619684815, 619445145, 619214654, 618957698]
2437.3F18957698k93016l24965l90589m53174m41492m22895m84287n69403o28114o94752
2457.7F14255011p82251q58009r05931r67264j063109j166045j294733j443386j538813
2476F04235470j609206j749575j894474j984358k046764k056241k050161k060116k010107
2494.4E86774468j901626j800180j678705j550436j470804j423895j393378j375497
2510.7E74179947j359343j299024j160800j002908q58366o94871n14865l10421p4089
2529E66905260J54674L78549O16133Q28028R95159J127243J199663J231790J257181
2547.4E74693680J247465J197935J143038J047909R12786Q16464P27177O26921N43058
2565.8E82956433M55082L96430L55721K53916J55091J39415J27375P0453J5438j2100
$$ y = [618957698, 618664682, 618339717, 617949128, 617495954, 617054462, 616631567, 616147280, 615577877, 614949763, 614255011, 613472760, 612614751, 611708820, 610741556, 609678447, 608512402, 607217669, 605774283, 604235470, 602626264, 600876689, 598982215, 596997857, 594951093, 592894852, 590844691, 588784575, 586774468, 584872842, 583072662, 581393957, 579843521, 578372717, 576948822, 575555444, 574179947, 572820604, 571521580, 570360780, 569357872, 568499506, 567804635, 567289770, 566979349, 566905260, 567059934, 567438483, 568054616, 568882644, 569877803, 571005046, 572204709, 573436499, 574693680, 575941145, 577139080, 578282118, 579330027, 580242813, 581059277, 581786454, 582413375, 582956433, 583411515, 583807945, 584163666, 584417582, 584572673, 584712088, 584839463, 584909916, 584925354, 584913254]
2586.2E84913254l8982o6995q2851q1360l8326J6987K1995r299j1086J2874M8697J15753
2610.6E84800661J75535J96994K13146K60472L18289L58701L78012L89815L96967L90350
2631E87878942L90947M07517M19736M02510L60489L15666K79129K63274K48313J92821
2651.4E91159344J21116P2360K7657k7239q6844j45555j90079j95086k01821k36988
2671.8E90296865k52307k78175l19540l07680k65359k75851l39448l57688l02672k99931
2692.2E87298214l58939l52084l09050l12746l63410m19855m35233m00901l70085l76463
2712.6E83599448l74257l83497m25398m46022m26292m11808m27306m15385l85702m10199
2733E79493582m34816l97622l75867m09722m30525m43756m83215m70102m15802m37021
$$ y = [584913254, 584874272, 584807277, 584724426, 584643066, 584604740, 584621727, 584643722, 584634423, 584623337, 584636211, 584684908, 584800661, 584976196, 585173190, 585386336, 585646808, 585965097, 586323798, 586701810, 587091625, 587488592, 587878942, 588269889, 588677406, 589097142, 589499652, 589860141, 590175807, 590454936, 590718210, 590966523, 591159344, 591280460, 591352820, 591380477, 591353238, 591266394, 591120839, 590930760, 590735674, 590533853, 590296865, 590044558, 589766383, 589446843, 589139163, 588873804, 588597953, 588258505, 587900817, 587598145, 587298214, 586939275, 586587191, 586278141, 585965395, 585601985, 585182130, 584746897, 584345996, 583975911, 583599448, 583225191, 582841694, 582416296, 581970274, 581543982, 581132174, 580704868, 580289483, 579903781, 579493582, 579058766, 578661144, 578285277, 577875555, 577445030, 577001274, 576518059, 576047957, 575632155, 575195134]
2753.4E75195134m83215m53472m37022m81247m76718m61698n00083n22554n56469o12676
2773.8E70209980n91934n51164n75006n92112n80252o13987o95884p17700o90698p19250
2794.2E63881993p65025p53403p18534p36475p93457q54313r14991r17852q97646r46462
2814.6E55583835r71675r59635j031876j115203j122713j138389j224637j307964j342654
2832.9E45369089j426041j578629j686931j830340k149283k530516k715170k430975
2849.3E29021204j749874j128673q63493q53955q94010r74715j124025j270294j378059
2867.6E18784106j443625j408040j245976j061618r76443r72331r65297r23097q77381
2886E08910298q96573r16660q68856q49247q37505p70510p28666p23780p39276q33809
$$ y = [575195134, 574711919, 574258447, 573821425, 573340178, 572863460, 572401762, 571901679, 571379125, 570822656, 570209980, 569618046, 569066882, 568491876, 567899764, 567319512, 566705525, 566009641, 565291941, 564601243, 563881993, 563116968, 562363565, 561645031, 560908556, 560115099, 559260786, 558345795, 557427943, 556530297, 555583835, 554612160, 553652525, 552620649, 551505446, 550382733, 549244344, 548019707, 546711743, 545369089, 543943048, 542364419, 540677488, 538847148, 536697865, 534167349, 531452179, 529021204, 527271330, 526142657, 525279164, 524425209, 523531199, 522556484, 521432459, 520162165, 518784106, 517340481, 515932441, 514686465, 513624847, 512648404, 511676073, 510710776, 509787679, 508910298, 508013725, 507097065, 506228209, 505378962, 504541457, 503770947, 503042281, 502318501, 501579225, 500745416]
2906.4E00745416j025230j298398j582950j701325j530230j159072p84904m79937k41518
2924.7D90941852j15961l6656J46240L33130L60638L57926M10884M01617L54111L33637
2945.1D93487418K59399J02162n4508j55270k40505l02851k74479j74910m2051R5278
2965.5D92699683J90884K40802K62410K70933K80946K80619L35604M83870N24432L89188
2985.9D95959371K79755J96457R0688O4790L1680l2335l3140l1502k2977l6568j44302
3008.3D96321917k33800k08288j18315p9215j27703k09182l05564l75747m32819n06223
3028.7D93725061n36054n61386n80162o07222p25449p90298p32451o92010p19667p85142
3049.1D86995220q39501q35151p98643p94798q37445q84592q79109q35508q05319p92116
$$ y = [500745416, 499720186, 498421788, 496838838, 495137513, 493607283, 492448211, 491663307, 491183370, 490941852, 490825891, 490789235, 490935475, 491268605, 491629243, 491987169, 492398053, 492799670, 493153781, 493487418, 493746817, 493848979, 493794471, 493639201, 493398696, 493095845, 492821366, 492646456, 492604405, 492699683, 492890567, 493131369, 493393779, 493664712, 493945658, 494226277, 494561881, 495045751, 495570183, 495959371, 496239126, 496435583, 496526271, 496591061, 496622741, 496590406, 496557266, 496525764, 496502787, 496466219, 496321917, 496088117, 495879829, 495761514, 495682299, 495554596, 495345414, 495039850, 494664103, 494231284, 493725061, 493189007, 492627621, 492047459, 491440237, 490714788, 489924490, 489192039, 488500029, 487780362, 486995220, 486155719, 485320568, 484521925, 483727127, 482889682, 482005090, 481125981, 480290473, 479485154, 478693038]
3069.5D78693038p98374q22485q68678r32187r23037q32945p96855q37028q86649q98331
3089.9D70096469q74728q56608q59201r28790j003384r72837r30518r59873r88812
3108.3D61721718r86099j023501j068711j075328j098245j068205r91791j023859j117408
3126.6D52268571j175732j187056j154214j153529j191705j214147j211375j225710
3143D42755103j273423j285553j282096j307517j323671j340866j374036j385003j382351
3161.3D30800587j389235j400233j418858j456291j518249j535356j463652j382351
3177.6D19236362j388103j465648j519323j531362j502067j465201j487434j497865
3193.9D07379359j453012j434356j468659j506537j522958j536429j498371j405150
$$ y = [478693038, 477894664, 477072179, 476203501, 475271314, 474348277, 473515332, 472718477, 471881449, 470994800, 470096469, 469221741, 468365133, 467505932, 466577142, 465573758, 464600921, 463670403, 462710530, 461721718, 460735619, 459712118, 458643407, 457568079, 456469834, 455401629, 454409838, 453385979, 452268571, 451092839, 449905783, 448751569, 447598040, 446406335, 445192188, 443980813, 442755103, 441481680, 440196127, 438914031, 437606514, 436282843, 434941977, 433567941, 432182938, 430800587, 429411352, 428011119, 426592261, 425135970, 423617721, 422082365, 420618713, 419236362, 417848259, 416382611, 414863288, 413331926, 411829859, 410364658, 408877224, 407379359, 405926347, 404491991, 403023332, 401516795, 399993837, 398457408, 396959037, 395553887]
3210.3C95553887j381189j430392j477331j477867j440972j442433j456558j430184
3226.6C84016961j396686j377583j392841j441657j441211j388669j371294j358152
3242.9C72848868j318037j335114j398027j394391j316309j273483j326085j395076
3259.2C62092346j403153j351297j295119j284391j287401j295328j304120j248717
3275.5C51622820j172364j163274j191854j201421j181901j134068j063525j048804
3291.8C42465609j125931j158625j111150j109481j126736j098425j107007j168936
3308.2C33459318j205147j208096j216591j233756j260519j311183j341433j335859
3324.5C23346734j375675j414776j403570j424432j388907j299322j352817j450091
$$ y = [395553887, 394172698, 392742306, 391264975, 389787108, 388346136, 386903703, 385447145, 384016961, 382620275, 381242692, 379849851, 378408194, 376966983, 375578314, 374207020, 372848868, 371530831, 370195717, 368797690, 367403299, 366086990, 364813507, 363487422, 362092346, 360689193, 359337896, 358042777, 356758386, 355470985, 354175657, 352871537, 351622820, 350450456, 349287182, 348095328, 346893907, 345712006, 344577938, 343514413, 342465609, 341339678, 340181053, 339069903, 337960422, 336833686, 335735261, 334628254, 333459318, 332254171, 331046075, 329829484, 328595728, 327335209, 326024026, 324682593, 323346734, 321971059, 320556283, 319152713, 317728281, 316339374, 315040052, 313687235, 312237144]
3340.8C12237144j421184j345664j292288j252473j237809j240969j221299j176954
3357.1C02048504j151591j164764j161129j093506j043261j085937j160472j134336
3373.4B93053508j028329r50694r27031r55075r03786p84635p54059p17789o73443
3391.8B85358667p36683p42436o09487n08100n50031o60181o27459m71144l98845m16428
3412.2B79637873m40210m65840l82751k25485j98513j87486p5668j4693m6074J2338
3432.6B77613491J48892J15663n4061l9816R5367K19047M48942N09412L75807L64899
3453B79797643M33445N25266O02782O08802O45339P59960Q24481P38561O48618O94722
3473.4B86279619P57992P82371Q54820R45836R39339R69738J107633J122534J007438
$$ y = [312237144, 310815960, 309470296, 308178008, 306925535, 305687726, 304446757, 303225458, 302048504, 300896913, 299732149, 298571020, 297477514, 296434253, 295348316, 294187844, 293053508, 292025179, 291074485, 290147454, 289192379, 288288593, 287503958, 286749899, 286032110, 285358667, 284621984, 283879548, 283270061, 282761961, 282211930, 281551749, 280924290, 280453146, 280054301, 279637873, 279197663, 278731823, 278349072, 278123587, 277925074, 277737588, 277661920, 277647227, 277601153, 277613491, 277762383, 277878046, 277823985, 277784169, 277879536, 278098583, 278547525, 279056937, 279432744, 279797643, 280231088, 280756354, 281359136, 281967938, 282613277, 283373237, 284197718, 284936279, 285584897, 286279619, 287037611, 287819982, 288674802, 289620638, 290559977, 291529715, 292637348, 293759882, 294767320]
3491.7B94767320R89586J089722J047969R59903J221776J415044J127571J076102J386494
3510.1C05081487J469969J310140J163960J136303J208812J396835J528382J540542
3526.4C15836430J624912J615285J457006J536072J761823J660586J397401J431733
3542.7C28321248J902104K205938J782596J619816K012789J925349J602113J655669
3559C43027622J614302J236826J842648L576487L361076J723200J490862K039402K261609
3577.4C62174034K287328J986087J424074K029359L788412L292978J500547J837998
3593.7C80320817K784133K630145K539038K458841J588225J477719K824634L200471
3610C99824023K538681K051771J434863K687901M161984K222985j08898M94897N003900
$$ y = [294767320, 295756906, 296846628, 297894597, 298854500, 300076276, 301491320, 302618891, 303694993, 305081487, 306551456, 307861596, 309025556, 310161859, 311370671, 312767506, 314295888, 315836430, 317461342, 319076627, 320533633, 322069705, 323831528, 325492114, 326889515, 328321248, 330223352, 332429290, 334211886, 335831702, 337844491, 339769840, 341371953, 343027622, 344641924, 345878750, 347721398, 351297885, 354658961, 356382161, 357873023, 359912425, 362174034, 364461362, 366447449, 367871523, 369900882, 373689294, 376982272, 378482819, 380320817, 383104950, 385735095, 388274133, 390732974, 392321199, 393798918, 396623552, 399824023, 402362704, 404414475, 405849338, 408537239, 412699223, 414922208, 414813310, 415308207, 420312107]
3628.4D20312107O116688K000540J178384J890809J850515J742333Q98570k79039R77725
3646.7D36688632N391538N720258P40319M3899K670556K078831N94974M84437l21776
3665.1D54091668n49763K090990K454370Q6457L118098M100919J57326r01490j294673
3683.4D63353902j751333O17653L805697K150893p51287j149326o63877L08633J881540
3701.8D67802495J181394j084656j094311J483857L686041J283020j593292j432628
3718.1D70231920k59965L73512N63056M34666j092761k120167m71682K416283L198296
3736.5D73273158k66731m022240k038211L470272J131356j549751K828360K946257
3752.8D75772470j536101j948446N46187P20710j063347q54224L9667R84073J275867
$$ y = [420312107, 426428795, 428429335, 429607719, 431498528, 433349043, 435091376, 435989946, 435710907, 436688632, 442080170, 447800428, 448540747, 448584646, 451255202, 453334033, 453929007, 454413444, 454091668, 453541905, 455632895, 458087265, 458173722, 461291820, 465392739, 465550065, 464648575, 463353902, 461602569, 462220222, 466025919, 468176812, 467425525, 466276199, 465612322, 465920955, 467802495, 468983889, 467899233, 466804922, 468288779, 471974820, 473257840, 471664548, 470231920, 469971955, 470345467, 470908523, 471343189, 470250428, 468130261, 467658579, 470074862, 473273158, 473006427, 468984187, 466945976, 470416248, 471547604, 469997853, 472826213, 475772470, 474236369, 472287923, 472834110, 473554820, 472491473, 471637249, 471676916, 472660989, 473936856]
3771.1D73936856n44369j668901o46114J029640N91517n16027m8518P0750l74168q46475
3791.5D70984191j195669n81027p72506k40087K350926N46694n78433J466334n72950
3809.9D71407473l228873j853079J188308K90514M45008K545714k31534j660407j039177
3828.2D67863947j012444o92398q64654K20865K265870J258403k10792n21272j963824
3846.6D66343701l927827l177345L949911P314026n98431l994643k350122N6565N94973
3865D64210808j081019j5200J824141N30869p33614j892954r40562N59450k40356P20113
3885.4D62941676J99676j329362N66631M48853k198815k043874O4314J361161J926989
3903.7D61937249J067012r29951j416594j043618j073927k71111Q15034K31772o87897
$$ y = [473936856, 473392487, 471723586, 471077472, 472107112, 472698629, 472182602, 472134084, 472204834, 471830666, 470984191, 469788522, 469207495, 468434989, 468194902, 470545828, 471092522, 470514089, 471980423, 471407473, 468178600, 466325521, 467513829, 467804343, 468249351, 470795065, 470563531, 468903124, 467863947, 466851503, 466159105, 465294451, 465515316, 467781186, 469039589, 468828797, 468307525, 466343701, 462415874, 459238529, 463188440, 470502466, 469904035, 465909392, 463559270, 463615835, 464210808, 463129789, 463114589, 464938730, 465469599, 464735985, 462843031, 461902469, 462461919, 462221563, 462941676, 463141352, 461811990, 462378621, 462827474, 460628659, 458584785, 458649099, 460010260, 461937249, 463004261, 462074310, 460657716, 459614098, 458540171, 458269060, 459084094, 459315866, 458627969]
3922.1D58627969k23547l0160q28058m84436O48140L34263o69658r27895n48512J22219
3942.5D56020325m6461n29588k2471J98424k65926m03225k97189k56926j27941q1927
3962.9D54187095l04699l80218k31683j94907k03401j06156j42992k80976k21014j22428
3983.2D51998621k41369l54677k54929j92851k40177k04742j78367
3997.5D50331509
$$ y = [458627969, 458404422, 458374262, 457546204, 457061768, 457709908, 458044171, 457374513, 456446618, 455898106, 456020325, 455973864, 455444276, 455421805, 455620229, 455354303, 454951078, 454653889, 454396963, 454269022, 454187095, 453882396, 453502178, 453270495, 453075588, 452872187, 452766031, 452623039, 452342063, 452121049, 451998621, 451757252, 451402575, 451147646, 450954795, 450714618, 450509876, 450331509]
##END=$$ End of the data block
