##TITLE=$$ Begin of the data block
##JCAMP-DX=5.00 $$ ACD/SpecManager v 10.08
##SPECTROMETER/DATA SYSTEM=Alpha
##DATE=11 Jun 2014 08:19:42
##DATA TYPE=INFRARED SPECTRUM
##DATA CLASS=XYDATA
##ORIGIN=
##OWNER=
##NPOINTS=1765
##FIRSTX=399.75695801
##LASTX=3997.56933594
##MAXX=3997.56933594
##MINX=399.75695801
##MAXY=0.64183891
##MINY=0.07992356
##XFACTOR=1.0000000000
##YFACTOR=1.000000000000000e-9
##FIRSTY=0.33032954
##DELTAX=2.03957629
##XUNITS=1/CM
##YUNITS=ARBITRARY UNITS
##XYDATA=(X++(Y..Y))
399.8 330329537 339737445 348248214 357185483 366617501 375201762 383580327 392124355 399309456
416.1 399309456 406992972 416801155 424792141 431118727 437702328 443776399 449361622 455568433
432.4 455568433 461584628 466609836 471894830 477296442 481681973 486105889 490919948 494657576
448.7 494657576 498086572 502258182 505521953 507991612 511375189 514107049 515412390 517250240
465 517250240 519636631 521502554 523876071 526933670 529270113 531688094 534906209 537502706 539640844
483.4 539640844 542462409 544883072 546584964 548867702 551084399 552482128 554186344 556035817
499.7 556035817 557138443 558455169 560431302 561724901 562424362 563560188 564327061 564441621 565247178
518.1 565247178 566357732 566593707 566770732 567456663 567880690 568268716 569034398 569475293 569875300 571126163
538.4 571126163 572432160 573110402 573925138 574883521 575340807 575835705 576632202 576887786 576781213 577067614
558.8 577067614 577267826 577229261 577801168 578598499 578827977 579212129 579863667 579811037 579665661 580302656
579.2 580302656 580848575 581221044 582317352 583406746 583712280 584193826 584912956 584984720 585045516 585345626
599.6 585345626 584918499 584195733 583852351 583008587 581828952 581621230 581847370 581703365 582230270 583536088
620 583536088 584452510 585403144 586785853 587545991 587962866 589194655 590539098 591430306 592793763
638.4 592793763 594197512 594697773 595240235 596169710 596407652 596322298 596592963 596300066 595511913 595290244
658.8 595290244 594998300 594147205 593651533 593276680 592502773 592659831 593376637 593497813 593353629 593590081
679.2 593590081 593305349 592369497 591701865 590706766 588718653 586533964 584062278 580282390 575467527
697.5 575467527 570109785 563613772 555801868 547135592 537766874 528695822 521649539 516489267
713.8 516489267 511958122 508582294 508183181 511930048 520356536 533047080 548145533 563829482
730.2 563829482 579005182 592352986 603006780 611339390 617670476 622015297 625091195 627529025
746.5 627529025 629237592 630376041 631328464 631998241 632382691 632817686 633202672 633324444 633442521
764.8 633442521 633722007 633998215 634304762 634714603 635053635 635336041 635761142 636247277 636578977 636735082
785.2 636735082 636750340 636664033 636509299 636321068 636160791 636046171 636018574 636059642 635995746 635759950 635465741
807.7 635465741 635009289 634282112 633522570 632782876 631739616 630379915 628953218 627342880 625419080
826 625419080 623254001 620696604 617546618 613901019 609739840 604807377 598974407 591684341 581533194
844.4 581533194 569154024 559596837 555727720 552766919 545054436 531586885 513390720 490700632
860.7 490700632 462038279 424163133 373349249 312714964 259155214 228834018 220660865 227980852
877 227980852 250963628 289753050 339402437 394080758 448906004 498074025 536694586 564280391
893.3 564280391 583780169 597971976 608461678 616552830 622981489 627837121 631496370 634440899
909.6 634440899 636657774 638312757 639781117 640893579 641454160 641750634 641838908 641559064 641145527
928 641145527 640830576 640470028 640081465 639834464 639553726 639209867 639044642 638932109 638643265 638241351
948.4 638241351 637625813 636572003 635194361 633588016 631602645 629333436 626981974 624407351 621546924
966.8 621546924 618583918 615414262 611789286 607752562 603242993 598059118 592308223 586165249
983.1 586165249 579725564 573252857 566956937 560765207 554703832 548955619 543528080 538289368
999.4 538289368 533141792 527928352 522454739 516767979 511026323 505266249 499595821 494252682
1015.7 494252682 489409387 485239863 481888026 479316741 477492929 476448268 476059765 476144165 476599753
1034.1 476599753 477157861 477436692 477241695 476556242 475453526 474213541 473193735 472606659 472731084
1052.4 472731084 473829538 475747675 478115916 480687648 483059824 484651536 485068589 484069377 481527001
1070.8 481527001 477795064 473681808 469901651 466886669 464858830 463954121 464290112 465929508 468781561
1089.1 468781561 472461343 476300657 479483724 481399536 482113302 482194066 482116997 482216954 482735008
1107.5 482735008 483624607 484675735 485807955 486864358 487544566 487833738 487900615 487820268 487652034
1125.8 487652034 487448722 487157285 486655593 485835165 484565973 482765675 480584443 478273928 476002365
1144.2 476002365 473953903 472249418 470842391 469707072 468945563 468641073 468862414 469730228 471219987
1162.6 471219987 473101705 475097030 476934344 478431582 479604125 480554134 481358528 482012808 482383639
1180.9 482383639 482330024 481777757 480742902 479292840 477486789 475379407 473024011 470544010 468110204
1199.3 468110204 465823501 463677913 461652964 459706366 457722247 455583215 453199089 450536907
1215.6 450536907 447668105 444669574 441521019 438265651 435001194 431747645 428493679 425276399
1231.9 425276399 422136605 419054329 416028351 413012296 409923404 406819046 403803468 400792301
1248.2 400792301 397713870 394610107 391448140 388199508 384926289 381665647 378384203 375104010
1264.5 375104010 371814013 368434310 364969313 361520261 358065903 354519248 350922734 347304374
1280.8 347304374 343622535 339885890 336119831 332251638 328296781 324277043 320121437 315853268
1297.2 315853268 311584026 307312906 302999228 298708737 294424921 290121794 285833657 281614423
1313.5 281614423 277445078 273270488 269095302 264900357 260606468 256207436 251740247 247177750
1329.8 247177750 242648587 238264412 233866990 229205251 224436581 219926968 215564474 211111844
1346.1 211111844 206554368 201942876 197332397 192746386 188174501 183679625 179152548 174441621
1362.4 174441621 169873923 165627792 161397457 157215178 153063029 148803502 144746378 140877932
1378.7 140877932 136982039 133161157 129507199 125846148 122233972 118841171 115275629 111340478
1395.1 111340478 107457399 103669763 100056708 96694998 93393721 90432100 87904908 85665993
1411.4 85665993 83735533 82141750 80844432 80040120 79923555 80287673 80980264 81893206 83027728
1429.7 83027728 84228322 85285336 86423554 87780423 88917643 89833207 90631716 91315411 91985010
1448.1 91985010 92626549 93136825 93489423 93921140 94663441 95423974 96087866 96898727 97884886 98792657
1468.5 98792657 99679478 100915223 102490105 104071006 105649993 107319385 109148532 111033551 113087974
1486.8 113087974 115683019 118831433 121819980 124792695 128474042 132453442 136013910 138966560
1503.2 138966560 142197862 147056937 151679471 155319318 158820778 162424162 166191250 169904023
1519.5 169904023 174004152 178174749 181928560 185750678 189211562 192519903 196297139 199550077
1535.8 199550077 202123582 205882028 210678756 214902997 218886584 222706079 226676419 230768904
1552.1 230768904 234838367 238714293 244177639 251744241 257040948 261421233 266076237 270967007
1568.4 270967007 276225954 280578047 284399688 289127260 293523222 297076702 300510079 303813398
1584.7 303813398 306900680 309787989 312445045 314869225 317109823 319132298 320959747 322648525
1601.1 322648525 324211717 325589985 326827258 327969581 328879982 329405785 329844236 330651432 331356198
1619.4 331356198 331734955 332203716 332823008 333461165 334147215 334642112 335095286 336290896 338035405
1637.8 338035405 339555711 340925515 342220455 344046861 346528113 348250240 350243866 354314774
1654.1 354314774 357699543 360036433 362515926 365666658 369115263 371963292 374979079 378796130
1670.4 378796130 382249266 385751992 389735192 393059313 395641148 398568153 403286874 407788306
1686.7 407788306 411143243 414446652 417291075 420270741 423721462 427285492 431738824 435397476
1703 435397476 438362330 441737205 444763601 447202533 449264258 451366723 454465598 457936138 460476935
1721.4 460476935 462660342 464912683 466948718 468728334 470362902 472926915 476060331 478190929
1737.7 478190929 480284780 482655853 484746814 486619711 488453090 490739912 493403971 495477736
1754 495477736 497198761 498987257 500683188 502602816 504384220 505677581 506773770 507866263 509483576
1772.4 509483576 511188984 512097180 512484372 512654781 512463212 511811733 510709643 509029567 506964803
1790.7 506964803 505187035 503764927 502353549 501224339 500824749 501147151 501931965 503110468 504766703
1809.1 504766703 507055402 509796202 512657821 515649498 518728077 521581948 524261117 527029276
1825.4 527029276 529582262 532156289 534912527 537203431 539108634 540931821 542440295 543596208
1841.7 543596208 545163393 547193766 548840821 550165474 551405907 552607715 553814948 555015504
1858 555015504 556204200 557304204 558137715 558757961 559766352 561268985 562516987 563467383 564425349
1876.4 564425349 565369427 566245198 567112863 567977190 568729520 569543362 570535362 571401238 572188437 573061705
1896.8 573061705 573888421 574654818 575385630 576063037 576725245 577468634 578270435 578901231 579331756 579915643
1917.2 579915643 580705047 581393063 582141459 582934678 583548784 584109008 584692955 585257709 585808814 586337507
1937.6 586337507 586738646 587196708 587902606 588587642 589105964 589595258 590099990 590532959 590910196 591329157
1958 591329157 591782629 592160106 592476606 592871547 593387961 593928814 594421268 594880879 595369160 595893264
1978.4 595893264 596345127 596713901 597072124 597408772 597680390 598026454 598539829 598990977 599335372 599716127
1998.8 599716127 600076556 600389957 600741267 601072907 601334810 601627946 601940811 602180541 602470875 602869213
2019.2 602869213 603182018 603413343 603705943 604001403 604236126 604497790 604765892 604970515 605188370 605472684
2039.6 605472684 605760396 606035531 606346071 606628776 606860578 607147217 607455075 607664645 607846022 608082116
2060 608082116 608303845 608541846 608857989 609139860 609347105 609589636 609860301 610085607 610299766 610526085
2080.3 610526085 610722661 610921085 611154258 611365259 611570299 611810982 612029493 612192035 612350881 612508595
2100.7 612508595 612638533 612791836 612993002 613168180 613299370 613445997 613571763 613641322 613721848 613833427
2121.1 613833427 613920927 614002883 614139199 614283741 614389658 614497066 614625931 614725411 614797533 614899874
2141.5 614899874 615022123 615139723 615285277 615454495 615600765 615749002 615907490 616048634 616228700 616469026
2161.9 616469026 616701066 616915703 617118001 617293835 617490232 617744267 618022323 618256152 618446290 618649304
2182.3 618649304 618870437 619084656 619318843 619571984 619767606 619923770 620103359 620298207 620488763 620670438
2202.7 620670438 620820463 620938897 621086776 621276975 621455729 621604979 621734798 621855021 621987224 622131348
2223.1 622131348 622261584 622366428 622476995 622599006 622688174 622770905 622907043 623074055 623213232 623307168
2243.5 623307168 623373568 623452485 623572528 623729348 623871148 623961806 624054611 624172211 624298334 624443114
2263.9 624443114 624579310 624673724 624778032 624924302 625051260 625147521 625250876 625322163 625325620 625342548 625394285
2286.3 625394285 625406325 625406504 625430226 625416815 625358641 625303805 625234187 625113189 624947608 624760151 624577463
2308.8 624577463 624441922 624361932 624213398 623913109 623607695 623447895 623417079 623396456 623304844 623227715
2329.2 623227715 623239994 623245955 623208165 623218954 623356998 623665452 624378502 625277042 624998033 623427272
2349.6 623427272 621938884 621422708 621556461 621841133 622151971 622588515 623209596 623891354 624504685
2367.9 624504685 625077903 625648916 626179159 626590133 626833618 626963317 627027273 627024174 626964509 626886845
2388.3 626886845 626803696 626730204 626677215 626617074 626533151 626448154 626376331 626293421 626204967 626118600 626002550
2410.8 626002550 625861943 625756860 625666082 625519216 625340104 625160992 624971151 624783278 624603033 624374092 624096572
2433.2 624096572 623839080 623588502 623298824 622975409 622618854 622213304 621797502 621396661 620925367 620338202
2453.6 620338202 619697750 618993044 618182302 617318749 616441786 615506053 614460826 613282204 611953437
2471.9 611953437 610521078 609019578 607396781 605617225 603710711 601719379 599679172 597613096
2488.3 597613096 595529199 593467593 591468811 589559257 587760031 586070001 584477186 582964599
2504.6 582964599 581531227 580178142 578868628 577554166 576257169 575044453 573975682 573106170
2520.9 573106170 572445035 571964204 571673512 571610689 571769893 572139621 572758973 573621988 574637294 575768888
2541.3 575768888 577012837 578295350 579557300 580803931 582036138 583179832 584186852 585119724
2557.6 585119724 586005270 586783886 587431490 587977648 588448822 588859379 589203894 589455009 589634895 589781165
2578 589781165 589874506 589943945 590027630 590060771 589991033 589893758 589842558 589818716 589809954 589804351 589796662 589792550 589787960
2604.5 589787960 589817405 589899838 590005815 590133846 590320230 590572953 590871930 591212213 591586173 591987550
2624.9 591987550 592423618 592866182 593276858 593658984 594029427 594418228 594832659 595232844 595570683 595845103
2645.3 595845103 596105576 596361220 596576869 596729159 596797645 596792102 596756935 596705556 596618891 596470475 596255958
2667.7 596255958 596025407 595823169 595627546 595382988 595065892 594728768 594443977 594187498 593871653 593507230
2688.1 593507230 593182504 592873812 592543483 592230141 591920078 591583848 591210544 590807438 590408564 590040267
2708.5 590040267 589688778 589316785 588937044 588553488 588120699 587651491 587217033 586809576 586386144 585992992
2728.9 585992992 585629642 585214376 584765673 584349334 583973050 583598375 583182335 582727313 582249880 581799448
2749.3 581799448 581392705 580959857 580486417 580021441 579568326 579113066 578665137 578184605 577645123 577106535
2769.7 577106535 576590836 576048255 575487077 574934781 574356914 573758245 573164284 572530329 571820676 571108818
2790.1 571108818 570442080 569739044 568959236 568187416 567468703 566726923 565920293 565069437 564182699 563294768
2810.5 563294768 562417984 561484456 560469270 559428811 558381736 557303369 556197941 555047631 553813040
2828.9 553813040 552519917 551185787 549742997 548142076 546439290 544609368 542475045 539954185
2845.2 539954185 537239313 534783542 532973170 531794906 530924141 530086279 529213667 528258026 527122676
2863.5 527122676 525808513 524411798 522992015 521590948 520320475 519238293 518257260 517307341 516383290
2881.9 516383290 515477598 514583349 513684273 512776971 511880696 511005342 510171354 509405971 508677185 507939696
2902.3 507939696 507185221 506368637 505369484 504070044 502470136 500752985 499222100 498080969 497320652
2920.6 497320652 496823370 496504843 496341407 496334612 496518850 496854067 497221708 497618139 498074740 498489469
2941 498489469 498809218 499120682 499434322 499612659 499569327 499386460 499139100 498840749 498558015 498377442
2961.4 498377442 498347431 498450845 498624474 498854488 499125063 499410003 499739140 500062704 500374556 500840247
2981.8 500840247 501422346 501881480 502175450 502343833 502401173 502444625 502487183 502499819 502494931 502447069 502381682
3004.3 502381682 502338052 502226830 501998484 501792789 501718283 501690209 501565218 501316488 500967562 500550628
3024.7 500550628 500114858 499653578 499150544 498603255 498051107 497456163 496701151 495876253 495144248 494475305
3045.1 494475305 493759960 492963552 492114156 491252095 490427345 489636093 488795549 487897187 487017483 486179531
3065.5 486179531 485373318 484582067 483757347 482880622 481989026 481106311 480240285 479384452 478494346 477594703
3085.8 477594703 476721168 475840598 474961758 474105030 473234445 472278923 471265197 470295250 469348282
3104.2 469348282 468358338 467344046 466335714 465306669 464255780 463210911 462141812 461065650
3120.5 461065650 460034162 458983332 457855433 456642747 455373824 454184502 453074276 451909542
3136.8 451909542 450677007 449424297 448169410 446907401 445622772 444273472 442857534 441450387
3153.2 441450387 440081477 438706696 437324286 435967863 434604704 433178782 431694388 430191398
3169.5 430191398 428698421 427217573 425754875 424314439 422838867 421298802 419774324 418297410
3185.8 418297410 416808009 415301651 413803011 412266344 410682410 409140646 407659471 406164974
3202.1 406164974 404651195 403143078 401634693 400124282 398622304 397142112 395658493 394177467
3218.4 394177467 392739475 391298532 389815211 388334155 386890948 385474771 384073913 382683814
3234.7 382683814 381269634 379831672 378415436 377033114 375675350 374279290 372817069 371400684
3251.1 371400684 370093644 368788570 367400050 366005480 364669412 363354653 362021595 360665798
3267.4 360665798 359325856 358023107 356729209 355469316 354287475 353116930 351901412 350675702
3283.7 350675702 349457473 348267645 347153723 346077830 344940424 343762606 342634976 341520190
3300 341520190 340372652 339244276 338112384 336919487 335679531 334411770 333149225 331888497 330573678
3318.4 330573678 329214960 327886343 326581270 325189859 323688090 322167456 320697933 319289684
3334.7 319289684 317911267 316494673 315027475 313606739 312271297 310981482 309715271 308431655
3351 308431655 307083279 305741668 304531038 303388506 302178055 300959468 299863666 298856944 297790498
3369.3 297790498 296565384 295308352 294210136 293239176 292292207 291336268 290427387 289598674 288793594
3387.7 288793594 288040996 287333399 286540478 285740972 285119861 284630090 284084201 283400893 282741755 282229483
3408.1 282229483 281776339 281345606 280955523 280533880 280124992 279846817 279609770 279393315 279300749 279276967
3428.5 279276967 279261291 279326528 279467255 279533654 279480547 279502213 279660136 279888004 280311406 280814409
3448.9 280814409 281158328 281471014 281923175 282529205 283212245 283855349 284472376 285200149 286028236 286753565
3469.3 286753565 287369251 288102955 288998425 289914548 290821344 291770339 292721063 293721706 294834375
3487.6 294834375 295922816 296927094 297982544 299175262 300330162 301357210 302570641 303943723
3504 303943723 305070877 306206048 307646155 309101105 310415894 311705589 312978476 314242750 315693498
3522.3 315693498 317294389 318890929 320584863 322295904 323827565 325373054 327099204 328752100
3538.6 328752100 330184966 331681430 333671391 335945308 337770283 339416325 341488391 343560964
3554.9 343560964 345357984 347193748 348926783 350197583 352006346 355574965 359012008 360850453
3571.3 360850453 362465769 364619523 366960287 369270831 371257365 372688442 374769509 378737777
3587.6 378737777 382271647 383957773 385924309 388733327 391303331 393896490 396551132 398291677
3603.9 398291677 399843812 402762085 406103820 408782989 410937935 412409484 415121317 419398516
3620.2 419398516 421803683 421863347 422488511 427629530 433862537 435922831 437153399 439087570 441002905
3638.6 441002905 442849129 443847775 443612188 444602489 450120568 456053406 456918359 457038492 459774464
3656.9 459774464 461877972 462545335 463137925 462803453 462168366 464299142 466851741 466921955 470040023
3675.3 470040023 474223077 474473506 473664045 472412258 470661640 471301436 475197673 477470607 476800412
3693.6 476800412 475670040 474977672 475293159 477279186 478556544 477429122 476213247 477686197 481522381
3712 481522381 482924134 481361181 479917288 479585379 479879886 480454236 480927378 479836613 477746993
3730.3 477746993 477317989 479714960 482912630 482667148 478604347 476588249 480214238 481433153 479903221
3748.7 479903221 482787579 485800803 484288126 482301116 482795268 483495295 482406765 481492788 481488794
3767.1 481488794 482527196 483905971 483380437 481676459 481071085 482202798 482807934 482231319 482147694
3785.4 482147694 482208014 481827855 480986446 479827195 479285866 478511930 478306860 480717421 481232136
3803.8 481232136 480633318 482148707 481592864 478342533 476475865 477599472 477752090 478179067 480864793
3822.1 480864793 480701834 478980303 477909178 476972759 476315558 475394368 475589544 477867603 479151785
3840.5 479151785 479017109 478563905 476564288 472519040 469274879 473335952 480784714 480171293 476139158
3858.8 476139158 473794311 473904073 474556684 473511189 473556191 475365907 475780815 474993259 473089427
3877.2 473089427 472128689 472706139 472489685 473214686 473409712 472072750 472684354 473199397 471022278
3895.5 471022278 468962848 468983620 470340699 472342700 473469257 472534031 471061170 469930649 468837231
3913.9 468837231 468657434 469561577 469828457 469147921 468900353 468845129 467996567 467520297 468246043 468625456
3934.3 468625456 467933893 466954738 466336608 466513604 466633737 466145545 466021299 466157556 465951234 465651542
3954.7 465651542 465413123 465146393 464959353 464818031 464511007 464172870 463935435 463697195 463499099 463434488
3975.1 463434488 463323295 463033944 462758631 462585092 462346196 462034553 461817265 461674422 461504459 461350083
3995.5 461350083 461190522
3997.5 461190522
##END=$$ End of the data block
