##TITLE=$$ Begin of the data block
##JCAMP-DX=5.00 $$ ACD/SpecManager v 10.08
##SPECTROMETER/DATA SYSTEM=Alpha
##DATE=11 Jun 2014 08:19:42
##DATA TYPE=INFRARED SPECTRUM
##DATA CLASS=XYDATA
##ORIGIN=
##OWNER=
##NPOINTS=1765
##FIRSTX=399.75695801
##LASTX=3997.56933594
##MAXX=3997.56933594
##MINX=399.75695801
##MAXY=0.64193875
##MINY=0.08009801
##XFACTOR=1.0000000000
##YFACTOR=1.000000000000000e-9
##FIRSTY=0.33119595
##DELTAX=2.03957629
##XUNITS=1/CM
##YUNITS=ARBITRARY UNITS
##XYDATA=(X++(Y..Y))
$$ plain form
399.8 331195951 339912176 348021895 356971264 366517663 374987781 383066773 391672999 399257243
416.1 399257243 406879276 415907472 423460156 430127293 437111855 443103164 448457718 454628706
432.4 454628706 460711539 465729386 471086949 476736605 481254607 485627204 490307242 493717402
448.7 493717402 496786535 500734627 503875375 506447732 509997189 512714684 514097989 516135693
465 516135693 518502474 520164311 522486746 525653005 528054357 530526817 533782542 536324501 538385153
483.4 538385153 541103244 543442249 545148611 547479570 549793601 551229715 552853644 554592013
499.7 554592013 555652857 556994975 558829129 559948087 560717583 562014043 562900305 562992811 563603163
518.1 563603163 564584732 564919949 565306544 566081345 566429257 566776872 567646146 568183005 568448126 569436729
$$ packed form
399.8C31195951Q716225Q109719Q949369R546399Q470118Q078992Q606226P584244
416.1C99257243P622033R028196P552684O667137O984562N991309N354554O170988
432.4D54628706O082833N017847N357563N649656M518002M372597M680038L410160
448.7D93717402L069133L948092L140748K572357L549457K717495J383305K037704
465E16135693K366781J661837K322435L166259K401352K472460L255725K541959K060652
483.4E38385153K718091K339005J706362K330959K314031J436114J623929J738369
499.7E54592013J060844J342118J834154J118958P69496J296460Q86262R2506O10352
518.1E63603163R81569L35217L86595P74801L47912L47615Q69274N36859K65121R88603
$$ plain form
538.4 569436729 570666969 571416974 572345257 573410630 573835015 574203193 574936688 575313270 575326920 575540781
558.8 575540781 575665295 575681448 576322377 577139854 577391148 577758431 578337908 578247368 578136921 578785121
579.2 578785121 579262733 579581618 580653012 581757128 582212806 582825422 583459854 583381176 583447218 583915055
599.6 583915055 583602786 582835197 582439125 581664264 580620050 580462217 580634892 580449879 580956936 582196712
620 582196712 583028674 583898008 585239291 586093068 586664855 587928534 589208007 590067089 591423929
638.4 591423929 592788458 593255401 593828380 594781339 595010877 594934821 595262051 595050514 594255388 593979895
658.8 593979895 593755007 593067467 592696607 592348218 591435492 591433585 592075527 592182338 592053711 592334569
679.2 592334569 592116773 591155410 590423346 589469731 587605178 585506439 582987666 579097092 574273586
$$ packed form
538.4E69436729J230240P50005R28283J065373M24385L68178P33495L76582J3650K13861
558.8E75540781J24514J6153O40929Q17477K51294L67283N79477r0540j10447O48200
579.2E78785121M77612L18885J071394J104116M55678O12616O34432p8678O6042M67837
599.6E83915055l12269p67589l96072p74861j044214j57833J72675j85013N07057J239776
620E82196712Q31962Q69334J341283Q53777N71787J263679J279473Q59082J356840
638.4E91423929J364529M66943N72979R52959K29538p6056L27230k11537p95126k75493
658.8E93979895k24888o87540l70860l48389r12726j907O41942J06811j28627K80858
679.2E92334569k17796r61363p32064r53615j864553k098739k518773l890574m823506
$$ plain form
697.5 574273586 569009662 562575698 554791510 546159625 536817729 527788699 520808935 515667617
713.8 515667617 511067212 507588923 507164419 511022925 519570172 532293737 547358811 562966943
730.2 562966943 578025281 591267288 601956010 610404134 616765857 621061146 624132276 626618445
746.5 626618445 628280759 629331529 630326092 631116331 631589413 632037103 632381499 632502854 632705271
764.8 632705271 633065104 633306265 633537471 633932531 634304404 634632230 635095954 635574579 635814190 635934770
785.2 635934770 636046588 636030078 635871708 635692000 635580301 635518074 635494053 635490596 635379076 635118783 634831965
807.7 634831965 634412646 633767962 633076072 632288814 631175578 629828930 628431439 626839817 624963343
826 624963343 622839868 620261192 617014170 613278270 609156728 604371905 598647654 591340840 581095874
$$ packed form
697.5E74273586n263924o433964p784188q631885r341896r029030o979764n141318
713.8E15667617m600405l478289m24504L858506Q547247J2723565J5065074J5608132
730.2E62966943J5058338J3242007J0688722Q448124O361723M295289L071130K486169
746.5F26618445J662314J050770R94563P90239M73082M47690L44396J21355K02417
764.8F32705271L59833K41161K31206L95060L71873L27826M63724M78625K39611J20580
785.2F35934770J11818j6510j58370j79708j11699o2227k4021l457j11520k60293k86818
807.7F34831965m19319o44684o91890p87258j113236j346648j397491j591622j876474
826F24963343k123475k578676l247022l735900m121542m784823n724251p306814j0244966
$$ plain form
844.4 581095874 568659186 559149384 555384338 552488029 544755161 531212032 512952447 490259707
860.7 490259707 461659670 423841119 373056561 312480718 258994401 228722140 220562339 227900863
877 227900863 250975341 289872378 339569181 394281209 449132055 498292595 536893129 564429700
893.3 564429700 583887935 598127425 608692288 616776228 623136163 627941251 631613135 634635031
909.6 634635031 636920333 638549626 639941633 641031742 641602278 641876042 641938746 641661108 641272366
928 641272366 640993834 640630543 640228391 640040696 639820635 639455318 639243841 639127374 638857007 638437569
948.4 638437569 637767434 636665761 635275245 633682728 631699622 629414380 627052784 624473155 621616364
966.8 621616364 618662834 615491092 611873090 607844114 603303134 598096788 592371702 586236715
$$ packed form
844.4E81095874j2436688r509802l765046k896309p732868j3543129j8259585k2692740
860.7D90259707k8600037l7818551n0784558o0575843n3486317l0272261q159801P338524
877B27900863K3074478L8897037M9696803N4712028N4850846M9160540L8600534K7536571
893.3E64429700J9458235J4239490J0564863Q083940O359935M805088L671884L021896
909.6F34635031K285302J629293J392007J090109N70536K73764O2704k77638l88742
928F41272366k78532l63291m02152j87695k20061l65317k11477j16467k70367m19438
948.4F38437569o70135j101673j390516j592517j983106k285242k361596k579629k856791
966.8F21616364k953530l171742l618002m028976m540980n206346n725086o134987
$$ plain form
983.1 586236715 579786658 573338449 567068279 560891032 554864109 549137712 543701589 538450599
999.4 538450599 533267677 528002501 522538841 516929984 511242747 505475342 499768376 494385362
1015.7 494385362 489511371 485336781 482021838 479519457 477750719 476685822 476243794 476342946 476845592
1034.1 476845592 477402180 477622986 477355361 476651818 475597501 474411368 473423868 472843558 472928911
1052.4 472928911 473974824 475882590 478283703 480883569 483245581 484809279 485195041 484172642
1068.7 484172642 481635362 477923214 473840863 470097959 467107117 465099603 464199603 464515388 466148436
1087.1 466148436 469013900 472682536 476481169 479628026 481528074 482261747 482394487 482353389 482474655
1105.4 482474655 483020961 483913481 484943837 486057162 487110764 487798452 488089889 488178879 488118589
$$ packed form
983.1E86236715o450057o448209o270170o177247o026923n726397n436123n250990
999.4E38450599n182922n265176n463660n608857n687237n767405n706966n383014
1015.7D94385362m873991m174590l314943k502381j768738j064897m42028R9152N02646
1034.1D76845592N56588K20806k67625p03543j054317j186133r87500n80310Q5353
1052.4D72928911J045913J907766K401113K599866K362012J563698L85762j022399
1068.7D84172642k537280l712148m082351l742904k990842k007514r00000L15785J633048
1087.1D66148436K865464L668636L798633L146857J900048P33673J32740m1098J21266
1105.4D82474655N46306Q92520J030356J113325J053602O87688K91437Q8990o0290
$$ plain form
1123.8 488118589 487927437 487709105 487458736 487019569 486224532 484922707 483071506 480871379 478566825
1142.2 478566825 476288527 474208534 472483486 471107215 470032632 469299376 468982875 469194800 470076144
1160.5 470076144 471593589 473493278 475483268 477304846 478780717 479912788 480833948 481638014 482272595
1178.9 482272595 482608795 482546002 482019693 481020302 479568839 477732629 475610435 473257303 470801204
1197.2 470801204 468412727 466124862 463927150 461886525 459964335 457982808 455825895 453427941
1213.5 453427941 450748384 447869688 444888026 441759497 438504934 435242742 431991249 428726792
1229.9 428726792 425501078 422340035 419227749 416204154 413228899 410187721 407096118 404048115
1246.2 404048115 401002318 397909939 394798785 391635537 388373971 385074407 381805480 378519922
$$ packed form
1123.8D88118589j91152k18332k50369m39167p95037j301825j851201k200127k304554
1142.2D78566825k278298k079993j725048j376271j074583p33256l16501K11925Q81344
1160.5D70076144J517445J899689J989990J821578J475871J132071R21160Q04066O34581
1178.9D82272595L36200o2793n26309r99391j451463j836210k122194k353132k456099
1197.2D70801204k388477k287865k197712k040625j922190j981527k156913k397954
1213.5D53427941k679557k878696k981662l128529l254563l262192l251493l264457
1229.9D28726792l225714l161043l112286l023595k975255l041178l091603l048003
1246.2D04048115l045797l092379l111154l163248l261566l299564l268927l285558
$$ plain form
1262.5 378519922 375228792 371940166 368577212 365147471 361730456 358256191 354665518 351063460
1278.8 351063460 347455889 343769073 340013474 336215407 332326323 328378141 324384272 320249468
1295.1 320249468 315968007 311681777 307428122 303134769 298847407 294561654 290251523 285969675
1311.4 285969675 281764507 277588427 273381352 269155055 264932722 260644019 256238192 251756102
1327.8 251756102 247206748 242710635 238343909 233940795 229270279 224492624 219971389 215610504
1344.1 215610504 211157247 206585914 201972112 197368503 192785174 188216627 183719903 179178283
1360.4 179178283 174458310 169899538 165674880 161469802 157287076 153104827 148831725 144774631
1376.7 144774631 140897095 137013927 133211210 129552141 125894964 122302972 118915640 115339741
$$ packed form
1262.5C78519922l291130l288626l362954l429741l417015l474265l590673l602058
1278.8C51063460l607571l686816l755599l798067l889084l948182l993869m134804
1295.1C20249468m281461m286230m253655m293353m287362m285753m310131m281848
1311.4B85969675m205168m176080m207075m226297m222333m288703m405827m482090
1327.8B51756102m549354m496113m366726m403114m670516m777655m521235m360885
1344.1B15610504m453257m571333m613802m603609m583329m568547m496724m541620
1360.4A79178283m719973m558772m224658m205078m182726m182249m273102m057094
1376.7A44774631l877536l883168l802717l659069l657177l591992l387332l575899
$$ plain form
1393 115339741 111400031 107526064 103745587 100121230 96745014 93450800 90497583 87970868 85755043
1411.4 85755043 83864838 82302034 81020646 80220051 80098011 80443956 81112429 82008123 83136700
1429.7 83136700 84353380 85451096 86640812 88034183 89174442 90055883 90810128 91495208 92200354
1448.1 92200354 92860833 93374990 93710996 94127633 94916932 95709123 96360102 97165033 98155864 99053204
1468.5 99053204 99920437 101149336 102744646 104357645 105956972 107628576 109460182 111362785 113444343
1486.8 113444343 116074644 119248077 122225836 125172868 128862247 132891342 136481017 139434069
1503.2 139434069 142655730 147504717 152168497 155884385 159436703 163020849 166729525 170432523
1519.5 170432523 174589485 178814203 182573140 186400115 189881548 193189234 196978033 200292364
$$ packed form
1393A15339741l939710l873967l780477l624357l376216l294214k953217k526715k215825
1411.4H5755043j890205j562804j281388q00595j22040L45945O68473Q95694J128577
1429.7H3136700J216680J097716J189716J393371J140259Q81441P54245O85080P05146
1448.1I2200354O60479N14157L36006M16637P89299P92191O50979Q04931R90831Q97340
1468.5I9053204Q67233J228899J595310J612999J599327J671604J831606J902603K081558
1486.8A13444343K630301L173433K977759K947032L689379M029095L589675K953052
1503.2A39434069L221661M848987M663780L715888L552318L584146L708676L702998
1519.5A70432523M156962M224718L758937L826975L481433L307686L788799L314331
$$ plain form
1535.8 200292364 202917889 206648275 211394623 215640739 219655573 223478362 227459356 231602162
1552.1 231602162 235739499 239630818 245026663 252580076 257936031 262352616 267037600 271967590
1568.4 271967590 277247638 281606674 285423160 290130526 294529080 298086137 301513821 304804116
1584.7 304804116 307846129 310686529 313326687 315761179 318025708 320053518 321853638 323494643
1601.1 323494643 325003207 326338232 327546775 328641683 329507321 330025256 330439806 331167549 331816971
1619.4 331816971 332182586 332600057 333138883 333748370 334444463 334927708 335322767 336471319 338268399
1637.8 338268399 339882910 341324449 342659920 344512582 347051799 348863006 350921422 355008692
1654.1 355008692 358435273 360854506 363416553 366640061 370172083 373081595 376110286 379952163
$$ packed form
1535.8B00292364K625525L730386M746348M246116M014834L822789L980994M142806
1552.1B31602162M137337L891319N395845P553413N355955M416585M684984M929990
1568.4B71967590N280048M359036L816486M707366M398554L557057L427684L290295
1584.7C04804116L042013K840400K640158K434492K264529K027810J800120J641005
1601.1C23494643J508564J335025J208543J094908Q65638N17935M14550P27743O49422
1619.4C31816971L65615M17471N38826O09487O96093M83245L95059J148552J797080
1637.8C38268399J614511J441539J335471J852662K539217J811207K058416M087270
1654.1C55008692L426581K419233K562047L223508L532022K909512L028691L841877
$$ plain form
1670.4 379952163 383473873 387027979 391033530 394385338 397005081 399952948 404682100 409231246
1686.7 409231246 412640423 415997088 418886364 421878099 425354451 428992957 433518469 437208623
1703 437208623 440183282 443558782 446605653 449105769 451203763 453279376 456362069 459884822 462500244
1721.4 462500244 464739680 467042118 469134510 470959038 472616762 475190490 478332549 480467260
1737.7 480467260 482550770 484914869 487021685 488916427 490764022 493048966 495704949 497787267
1754 497787267 499521464 501334071 503071845 505023420 506816864 508111656 509220064 510332763 511945009
1772.4 511945009 513656855 514600992 515014648 515191495 515001297 514355838 513255954 511568129 509493530
1790.7 509493530 507697463 506251395 504836261 503739715 503400803 503754079 504522026 505690932 507390618
$$ packed form
1670.4C79952163L521710L554106M005551L351808K619743K947867M729152M549146
1686.7D09231246L409177L356665K889276K991735L476352L638506M525512L690154
1703D37208623K974659L375500L046871K500116K097994K075613L082693L522753K615422
1721.4D62500244K239436K302438K092392J824528J657724K573728L142059K134711
1737.7D80467260K083510K364099K106816J894742J847595K284944K655983K082318
1754D97787267J734197J812607J737774J951575J793444J294792J108408J112699J612246
1772.4E11945009J711846R44137M13656J76847j90198o45459j099884j687825k074599
1790.7E09493530j796067j446068j415134j096546l38912L53276P67947J168906J699686
$$ plain form
1809.1 507390618 509738803 512493849 515353858 518361092 521466315 524333298 527005732 529780328
1825.4 529780328 532347918 534928441 537714064 540055692 541982055 543803573 545333505 546503663
1841.7 546503663 548040450 550060511 551761448 553148627 554417193 555621743 556825042 558014810
1858 558014810 559197962 560305476 561141610 561760664 562787056 564343989 565672755 566676974 567619681
1876.4 567619681 568523228 569386244 570259631 571124017 571867764 572680414 573685348 574558556 575338423
1894.7 575338423 576215386 577060819 577840149 578585446 579286397 579953551 580677688 581477940 582142770 582612813
1915.1 582612813 583228648 584047377 584736645 585466862 586261451 586895406 587485433 588101208 588675976 589225888
1935.5 589225888 589776218 590189517 590622008 591312826 592011571 592544734 593032181 593529344 593979180 594392836
$$ packed form
1809.1E07390618K348185K755046K860009L007234L105223K866983K672434K774596
1825.4E29780328K567590K580523K785623K341628J926363J821518J529932J170158
1841.7E46503663J536787K020061J700937J387179J268566J204550J203299J189768
1858E58014810J183152J107514Q36134O19054J026392J556933J328766J004219R42707
1876.4E67619681R03547Q63016Q73387Q64386P43747Q12650J004934Q73208P79867
1894.7E75338423Q76963Q45433P79330P45297P00951O67154P24137Q00252O64830M70043
1915.1E82612813O15835Q18729O89268P30217P94589O33955N90027O15775N74768N49912
1935.5E89225888N50330M13299M32491O90818O98745N33163M87447M97163M49836M13656
$$ plain form
1955.9 594392836 594834626 595275342 595633447 595966876 596392095 596912444 597450137 597958446 598418534 598875463
1976.3 598875463 599361241 599794269 600207090 600642800 601015568 601296604 601656854 602167368 602600515 602941275
1996.7 602941275 603341877 603715122 604009926 604345918 604691207 604987025 605308115 605620503 605865180 606182039
2017.1 606182039 606569827 606852412 607096493 607423186 607741714 607991636 608274043 608571291 608799636 609024167
2037.5 609024167 609294415 609561861 609833241 610152900 610455751 610717535 611002207 611277580 611495912 611740470
2057.9 611740470 612019300 612224936 612435818 612753093 613046110 613266051 613539159 613818765 614010096 614223838
2078.3 614223838 614510179 614746869 614950716 615213811 615447104 615631282 615845740 616043687 616203904 616395712
2098.7 616395712 616596580 616742313 616883874 617085993 617281437 617421627 617566168 617703974 617820799 617967606
$$ packed form
1955.9E94392836M41790M40716L58105L33429M25219N20349N37693N08309M60088M56929
1976.3E98875463M85778M33028M12821M35710L72768K81036L60250N10514M33147L40760
1996.7F02941275M00602L73245K94804L35992L45289K95818L21090L12388K44677L16859
2017.1F06182039L87788K82585K44081L26693L18528K49922K82407K97248K28345K24531
2037.5F09024167K70248K67446K71380L19659L02851K61784K84672K75373K18332K44558
2057.9F11740470K78830K05636K10882L17275K93017K19941K73108K79606J91331K13742
2078.3F14223838K86341K36690K03847K63095K33293J84178K14458J97947J60217J91808
2098.7F16395712K00868J45733J41561K02119J95444J40190J44541J37806J16825J46807
$$ plain form
2119.1 617967606 618127346 618234098 618314862 618444204 618576407 618674576 618790746 618920922 619016647 619104564
2139.5 619104564 619227707 619364500 619496822 619633853 619779527 619938254 620127141 620315552 620473981 620672643
2159.9 620672643 620938599 621180058 621366143 621556580 621773481 622008145 622272074 622553229 622793734 623000801
2180.3 623000801 623224139 623458743 623683691 623916626 624160469 624378383 624594808 624827504 625023365 625188053
2200.7 625188053 625368834 625525594 625654459 625834286 626050472 626226723 626357138 626483440 626614630 626752317
2221.1 626752317 626907885 627059877 627179563 627310872 627482057 627624810 627723277 627838969 627985060 628115833
2241.5 628115833 628235817 628366888 628485978 628597319 628722906 628846884 628950834 629058421 629184246 629324257
2261.9 629324257 629474819 629608512 629712582 629837930 629996181 630135894 630263865 630402386 630502999 630532324
$$ packed form
2119.1F17967606J59740J06752Q0764J29342J32203R8169J16170J30176R5725Q7917
2139.5F19104564J23143J36793J32322J37031J45674J58727J88887J88411J58429J98662
2159.9F20672643K65956K41459J86085J90437K16901K34664K63929K81155K40505K07067
2180.3F23000801K23338K34604K24948K32935K43843K17914K16425K32696J95861J64688
2200.7F25188053J80781J56760J28865J79827K16186J76251J30415J26302J31190J37687
2221.1F26752317J55568J51992J19686J31309J71185J42753R8467J15692J46091J30773
2241.5F28115833J19984J31071J19090J11341J25587J23978J03950J07587J25825J40011
2261.9F29324257J50562J33693J04070J25348J58251J39713J27971J38521J00613K9325
$$ plain form
2282.3 630532324 630554974 630593240 630602062 630601704 630617082 630618572 630597830 630572557 630527854 630441785 630312502 630155981
2306.7 630155981 629985452 629848301 629799724 629704475 629449964 629188359 629053354 629044771 629042149 628879488 628724098
2329.2 628724098 628821790 628968239 628958285 628908515 628987730 629296005 630022526 630868793 630525410 628996968
2349.6 628996968 627712965 627434552 627552927 627648532 627918184 628400743 628985524 629644573 630289912 630853117
2370 630853117 631405532 631939054 632344723 632586956 632708490 632738650 632729530 632726312 632700562 632624507 632542849
2392.4 632542849 632490814 632435560 632359207 632305324 632257164 632154703 632042706 631960690 631874859 631792784 631742835
2414.8 631742835 631668746 631505370 631304502 631131947 630953372 630762994 630584955 630363584 630107045 629868746
2435.2 629868746 629620135 629333913 629015207 628649175 628227353 627796829 627384901 626926482 626364410 625734866
$$ packed form
2282.3F30532324K2650L8266Q822l58J5378J490k0742k5273m4703q6069j29283j56521
2306.7F30155981j70529j37151m8577r5249k54511k61605j35005q583k622j62661j55390
2329.2F28724098R7692J46449r954m9770P9215L08275P26521Q46267l43383j528442
2349.6F28996968j284003k78413J18375R5605K69652M82559N84781O59049O45339N63205
2370F30853117N52415N33522M05669K42233J21534L0160r120l218k5750p6055q1658
2392.4F32542849n2035n5254p6353n3883m8160j02461j11997q2016q5831q2075m9949
2414.8F31742835p4089j63376k00868j72555j78575j90378j78039k21371k56539k38299
2435.2F29868746k48611k86222l18706l66032m21822m30524m11928m58419n62072o29544
$$ plain form
2455.6 625734866 625053942 624284208 623446047 622562230 621590137 620507240 619315624 617996573 616563559
2474 616563559 615051031 613442719 611696839 609813511 607808053 605716288 603628278 601560771 599470317
2492.3 599470317 597417831 595504284 593746901 592103124 590513289 588963211 587490380 586118042
2508.7 586118042 584816337 583512843 582198560 580966055 579910100 579068005 578411400 577909350 577614486
2527 577614486 577580690 577786565 578208923 578849077 579697788 580731511 581912696 583165050 584428072
2545.4 584428072 585710645 587002933 588255048 589443922 590536833 591501117 592358589 593120098 593781650
2563.7 593781650 594362497 594869673 595298111 595649838 595904231 596080303 596251905 596399546 596474111 596513927
2584.1 596513927 596552610 596568406 596534014 596466482 596422076 596408308 596395850 596396089 596410692 596436381 596483827 596552730
$$ packed form
2455.6F25734866o80924p69734q38161q83817r72093j082897j191616j319051j433014
2474F16563559j512528j608312j745880j883328k005458k091765k088010k067507k090454
2492.3E99470317k052486j913547j757383j643777j589835j550078j472831j372338
2508.7E86118042j301705j303494j314283j232505j055955q42095o56605n02050k94864
2527E77614486l3796K05875M22358O40154Q48711J033723J181185J252354J263022
2545.4E84428072J282573J292288J252115J188874J092911R64284Q57472P61509O61552
2563.7E93781650N80847N07176M28438L51727K54393J76072J71602J47641P4565L9816
2584.1E96513927L8683J5796l4392o7532m4406j3768j2458K39J4603K5689M7446O8903
$$ plain form
2608.6 596552730 596674562 596877098 597120345 597369313 597645402 597979009 598374426 598788440 599201322 599628210
2629 599628210 600061297 600501060 600935876 601349175 601749957 602143407 602513015 602840960 603130102 603380978
2649.4 603380978 603578031 603714228 603796363 603831172 603828073 603781104 603663325 603483796 603306532 603152812
2669.8 603152812 602964818 602722704 602468908 602197945 601889074 601577103 601279676 600968480 600647211 600362360
2690.2 600362360 600088894 599778354 599451005 599113166 598763227 598409772 598040879 597653270 597285926 596946537
2710.6 596946537 596566737 596157491 595792055 595411420 594954491 594489157 594048500 593635976 593276441 592934310
2731 592934310 592535079 592085242 591675341 591310322 590906024 590457439 590021729 589589298 589146256 588725090
2751.4 588725090 588319480 587896347 587448239 586977661 586502254 586062133 585610807 585082650 584549189 584035516
$$ packed form
2608.6E96552730J21832K02536K43247K48968K76089L33607L95417M14014M12882M26888
2629E99628210M33087M39763M34816M13299M00782L93450L69608L27945K89142K50876
2649.4F03380978J97053J36197Q2135L4809l099m6969j17779j79529j77264j53720
2669.8F03152812j87994k42114k53796k70963l08871l11971k97427l11196l21269k84851
2690.2F00362360k73466l10540l27349l37839l49939l53455l68893l87609l67344l39389
2710.6E96946537l79800m09246l65436l80635m56929m65334m40657m12524l59535l42131
2731E92934310l99231m49837m09901l65019m04298m48585m35710m32431m43042m21166
2751.4E88725090m05610m23133m48108m70578m75407m40121m51326n28157n33461n13673
$$ plain form
2771.8 584035516 583470285 582902968 582380712 581822336 581216991 580631495 580038667 579345405 578588426 577884853
2792.2 577884853 577194750 576419115 575623930 574900627 574181914 573397338 572552562 571656406 570744634 569844902
2812.5 569844902 568912387 567928672 566939950 565921009 564821839 563698709 562559307 561307371 559961915
2830.9 559961915 558601618 557154179 555536151 553801298 551936090 549777687 547239840 544515014
2847.2 544515014 542090178 540339410 539154768 538218141 537327230 536413491 535460949 534390926 533134282
2865.6 533134282 531741798 530281126 528830230 527547240 526479363 525492787 524513006 523550451 522619903
2883.9 522619903 521749914 520903468 520022392 519138396 518257976 517372668 516566157 515853941 515145600 514385104
2904.3 514385104 513539553 512526214 511231840 509642839 507938802 506403923 505245745 504484355 504003823
$$ packed form
2771.8E84035516n65231n67317n22256n58376o05345n85496n92828o93262p56979p03573
2792.2E77884853o90103p75635p95185p23303p18713p84576q44776q96156r11772q99732
2812.5E69844902r32515r83715r88722j018941j099170j123130j139402j251936j345456
2830.9E59961915j360297j447439j618028j734853j865208k158403k537847k724826
2847.2E44515014k424836j750768j184642r36627q90911r13739r52542j070023j256644
2865.6E33134282j392484j460672j450896j282990j067877r86576r79781r62555r30548
2883.9E22619903q69989q46446q81076q83996q80420q85308q06511p12216p08341p60496
2904.3E14385104q45551j013339j294374j589001j704037j534879j158178p61390m80532
$$ plain form
2922.7 504003823 503708303 503558159 503551781 503732383 504083157 504497409 504948735 505437195 505852342 506181538
2943.1 506181538 506511986 506821871 506993949 506950974 506768584 506530821 506239712 505963027 505804837 505792975
2963.5 505792975 505887628 506052792 506312311 506644249 506964326 507263720 507584572 507972896 508463621 508983433
2983.9 508983433 509407938 509730101 509935319 510007918 510061443 510104775 510100842 510095775 510083258 510063112 510032177
3006.3 510032177 509912968 509703219 509508371 509392798 509329498 509228289 509014487 508687556 508303642 507879436
3026.7 507879436 507379532 506834745 506274521 505709171 505109489 504370987 503564954 502827585 502113223 501371980
3047.1 501371980 500583887 499724835 498849928 498032123 497241557 496386528 495475501 494582176 493711382 492875308
3067.5 492875308 492095768 491301626 490419805 489474177 488545328 487673938 486819148 485937268 485054195 484194696
$$ packed form
2922.7E04003823k95520j50144o378J80602L50774M14252M51326M88460M15147L29196
2943.1E06181538L30448L09885J72078m2975j82390k37763k91109k76685j58190j1862
2963.5E05792975R4653J65164K59519L31938L20077K99394L20852L88324M90725N19812
2983.9E08983433M24505L22163K05218P2599N3525M3332l933n067j2517k0146l0935
3006.3E10032177j19209k09749j94848j15573o3300j01209k13802l26931l83914m24206
3026.7E07879436m99904n44787n60224n65350n99682p38502q06033p37369p14362p41243
3047.1E01371980p88093q59052q74907q17805p90566q55029r11027q93325q70794q36074
3067.5D92875308p79540p94142q81821r45628r28849q71390q54790q81880q83073q59499
$$ plain form
3087.9 484194696 483317703 482396632 481482148 480579078 479600608 478594363 477658719 476729363 475740045
3106.2 475740045 474730551 473726034 472656310 471522897 470418274 469344229 468274057 467201710
3122.6 467201710 466091126 464930594 463727355 462508529 461321026 460127890 458880365 457607180
3138.9 457607180 456328690 455032289 453738362 452452540 451121300 449746370 448385030 447021425
3155.2 447021425 445599139 444156617 442724288 441269040 439817071 438376486 436899930 435368121
3171.5 435368121 433797657 432256490 430792719 429316074 427751392 426172972 424625665 423103780
3187.8 423103780 421600252 420046955 418450803 416885257 415332258 413757890 412182629 410618365
3204.1 410618365 409059256 407551616 406096727 404596120 403050035 401508182 399967343 398470461
$$ packed form
3087.9D84194696q76993r21071r14484r03070r78470j006245r35644r29356r89318
3106.2D75740045j009494j004517j069724j133413j104623j074045j070172j072347
3122.6D67201710j110584j160532j203239j218826j187503j193136j247525j273185
3138.9D57607180j278490j296401j293927j285822j331240j374930j361340j363605
3155.2D47021425j422286j442522j432329j455248j451969j440585j476556j531809
3171.5D35368121j570464j541167j463771j476645j564682j578420j547307j521885
3187.8D23103780j503528j553297j596152j565546j552999j574368j575261j564264
3204.1D10618365j559109j507640j454889j500607j546085j541853j540839j496882
$$ plain form
3220.5 398470461 397017539 395534933 394015551 392503083 391036689 389624268 388211489 386747003
3236.8 386747003 385247648 383768439 382359445 381009609 379629672 378176868 376729786 375362277
3253.1 375362277 374025345 372656167 371264935 369852930 368444204 367077678 365738094 364409059
3269.4 364409059 363080084 361763418 360497415 359265178 358016700 356751949 355498195 354265511
3285.7 354265511 353089482 351987034 350887388 349712044 348472238 347225755 346007586 344873637
3302 344873637 343809724 342692375 341472745 340196967 338893205 337578148 336267114 334930331 333557934
3320.4 333557934 332171679 330773234 329344243 327869207 326348901 324789375 323269248 321843654
3336.7 321843654 320408195 318872601 317343324 315955549 314644694 313299984 311932325 310560554
$$ packed form
3220.5C98470461j452922j482606j519382j512468j466394j412421j412779j464486
3236.8C86747003j499355j479209j408994j349836j379937j452804j447082j367509
3253.1C75362277j336932j369178j391232j412005j408726j366526j339584j329035
3269.4C64409059j328975j316666j266003j232237j248478j264751j253754j232684
3285.7C54265511j176029j102448j099646j175344j239806j246483j218169j133949
3302C44873637j063913j117349j219630j275778j303762j315057j311034j336783j372397
3320.4C33557934j386255j398445j428991j475036j520306j559526j520127j425594
3336.7C21843654j435459j535594j529277j387775j310855j344710j367659j371771
$$ plain form
3353 310560554 309203714 307916731 306699932 305484116 304248065 303078622 301965415 300772309 299485683
3371.4 299485683 298238903 297123164 296108067 295128793 294137925 293171048 292294174 291476011 290692985
3389.7 290692985 289927453 289110482 288319379 287698299 287186950 286591232 285876811 285212636 284673870 284197778
3410.1 284197778 283749700 283323348 282873005 282453656 282167971 281933933 281708121 281601131 281606346 281601131
3430.5 281601131 281640649 281789750 281876981 281812310 281793922 281921357 282169282 282616019 283107013 283503205
3450.9 283503205 283932149 284433126 285014600 285661131 286290020 286926121 287668347 288534373 289356738 290044606
3471.3 290044606 290784031 291666597 292598635 293558806 294572145 295577258 296609879 297768205 298959434
3489.7 298959434 300073028 301180273 302374601 303531826 304605901 305913806 307388961 308577389
$$ packed form
3353C10560554j356840j286983j216799j215816j236051j169443j113207j193106j286626
3371.4B99485683j246780j115739j015097r79274r90868r66877q76874q18163p83026
3389.7B90692985p65532q16971p91103o21080n11349n95718p14421o64175n38766m76092
3410.1B84197778m48078m26352m50343m19349k85685k34038k25812j06990N215n215
3430.5B81601131L9518J49101Q7231o4671j8388J27435K47925M46737M90994L96192
3450.9B83503205M28944N00977N81474O46531O28889O36101P42226Q66026Q22365O87868
3471.3B90044606P39425Q82566R32038R60171J013339J005113J032621J158326J191229
3489.7B98959434J113594J107245J194328J157225J074075J307905J475155J188428
$$ plain form
3506 308577389 309729457 311188877 312705398 314085871 315422773 316753328 318052799 319493890 321088821
3524.4 321088821 322742283 324562728 326413453 328079671 329783022 331642538 333330572 334793776
3540.7 334793776 336399198 338507950 340897530 342855006 344615906 346739203 348794729 350583345
3557 350583345 352462649 354283303 355677217 357621104 361333907 364921451 366870910 368549824 370782882
3575.3 370782882 373256981 375742465 377908319 379462242 381592333 385601491 389218926 391003370
3591.7 391003370 393099338 396115065 398934454 401701391 404437244 406279624 407953411 410978615
3608 410978615 414438248 417201191 419436812 421087027 424022019 428448707 430904061 430965483 431622982
3626.3 431622982 436902583 443358123 445630103 447054505 449147791 451180756 453153938 454273731
$$ packed form
3506C08577389J152068J459420J516521J380473J336902J330555J299471J441091J594931
3524.4C21088821J653462J820445J850725J666218J703351J859516J688034J463204
3540.7C34793776J605422K108752K389580J957476J760900K123297K055526J788616
3557C50583345J879304J820654J393914J943887L712803L587544J949459J678914K233058
3575.3C70782882K474099K485484K165854J553923K130091M009158L617435J784444
3591.7C91003370K095968L015727K819389K766937K735853J842380J673787L025204
3608D10978615L459633K762943K235621J650215K934992M426688K455354O1422O57499
3626.3D31622982N279601O455540K271980J424402K093286K032965J973182J119793
$$ plain form
3642.6 454273731 454114407 455157191 460747361 466787487 467709512 467879444 470763445 473012298 473754406
3661 473754406 474428147 474209845 473704934 475937068 478503317 478579760 481784046 486025542 486285239
3679.4 486285239 485526443 484339774 482620448 483289361 487193078 489443719 488821954 487812370 487229645
3697.7 487229645 487569898 489524335 490812749 489765435 488627225 490119159 493943274 495308310
3714 495308310 493724972 492316276 492055476 492423207 493051618 493560195 492461443 490349025 489942938
3732.4 489942938 492416412 495694727 495450109 491330773 489294142 492956221 494185239 492652208
3748.7 492652208 495590627 498639315 497081071 495074600 495622754 496349901 495265245 494462520 494613022
3767.1 494613022 495664537 496988326 496498853 494862139 494233251 495280504 495859563 495338261 495348275
$$ packed form
3642.6D54273731j59324J042784N590170O040126R22025J69932K884001K248853P42108
3661D73754406O73741k18302n04911K232134K566249P6443L204286M241496K59697
3679.4D86285239p58796j186669j719326O68913L903717K250641o21765j009584n82725
3697.7D87229645L40253J954437J288414j047314j138210J491934L824115J365036
3714D95308310j583338j408696k60800L67731O28411N08577j098752k112418m06087
3732.4D89942938K473474L278315k44618m119336k036631L662079J229018j533031
3748.7D92652208K938419L048688j558244k006471N48154P27147j084656q02725J50502
3767.1D94613022J051515J323789m89473j636714o28888J047253N79059n21302J0014
$$ plain form
3785.4 495348275 495446801 495013118 494116813 492963970 492467880 491662532 491333693 493730873 494371414
3803.8 494371414 493865341 495370716 494775236 491538376 489727497 490934849 491117269 491521835 494208127
3822.1 494208127 494043946 492368490 491313547 490262836 489538044 488688648 488973826 491287917 492576301
3840.5 492576301 492469132 492049038 490030885 485937208 482655585 486710906 494242579 493707120 489672810
3858.8 489672810 487280011 487289488 487847924 486807734 486944258 488877147 489352912 488550842 486640900
3877.2 486640900 485729337 486320823 486032009 486711413 486950368 485743672 486497492 487009287 484708339
3895.5 484708339 482568711 482579380 483929306 485964030 487111032 486152768 484739780 483717948 482611179
3913.9 482611179 482332081 483213007 483495533 482808769 482573241 482551426 481756121 481317431 482032746 482433081
$$ packed form
3785.4D95348275R8526m33683q96305j152843m96090q05348l28839K397180O40541
3803.8D94371414n06073J505375n95480l236860j810879J207352J82420M04566K686292
3822.1D94208127j64181j675456j054943j050711p24792q49396K85178K314091J288384
3840.5D92576301j07169m20094k018153m093677l281623M055321P531673n35459m034310
3858.8D89672810k392799R477N58436j040190J36524J932889M75765q02070j909942
3877.2D86640900r11563N91486k88814O79404K38955j206696P53820N11795k300948
3895.5D84708339k139628J0669J349926K034724J147002r58264j412988j021832j106769
3913.9D82611179k79098Q80926K82526o86764k35528k1815p95305m38690P15315M00335
$$ plain form
3934.3 482433081 481813103 480886310 480307549 480490327 480540544 480015695 479961276 480170280 479943722 479541510
3954.7 479541510 479200333 478921205 478826970 478790849 478495091 478104442 477859586 477681935 477532387 477469116
3975.1 477469116 477339536 477005988 476687878 476531446 476356417 476102591 475942582 475852937 475698292 475507081
3995.5 475507081 475275666
3997.5 475275666
$$ packed form
3934.3D82433081o19978r26793n78761J82778N0217n24849n4419K09004k26558m02212
3954.7D79541510l41177k79128r4235l6121k95758l90649k44856j77651j49548o3271
3975.1D77469116j29580l33548l18110j56432j75029k53826j60009q9645j54645j91211
3995.5D75507081k31415
3997.5D75275666
##END=$$ End of the data block
