##TITLE=$$ Begin of the data block
##JCAMP-DX=5.00 $$ ACD/SpecManager v 10.08
##SPECTROMETER/DATA SYSTEM=Alpha
##DATE=11 Jun 2014 08:19:42
##DATA TYPE=INFRARED SPECTRUM
##DATA CLASS=XYDATA
##ORIGIN=
##OWNER=
##NPOINTS=1765
##FIRSTX=399.75695801
##LASTX=3997.56933594
##MAXX=3997.56933594
##MINX=399.75695801
##MAXY=0.64210069
##MINY=0.08021864
##XFACTOR=1.0000000000
##YFACTOR=1.000000000000000e-9
##FIRSTY=0.32932708
##DELTAX=2.03957629
##XUNITS=1/CM
##YUNITS=ARBITRARY UNITS
##XYDATA=(X++(Y..Y))
$$ plain form
399.8 329327077 338489205 346372366 354766697 364355803 373274326 381590664 390174955 397563636
416.1 397563636 404958338 414095730 421657950 427883595 434637517 440918058 446571469 452740788
432.4 452740788 458719611 463753879 469037890 474469453 478877753 483264774 488035470 491557270
448.7 491557270 494660735 498579681 501671851 504192173 507752001 510546863 511871040 513762236
465 513762236 516130030 517758489 519925237 523120403 525822103 528537095 531753957 534243107 536382616
483.4 536382616 539063871 541225731 542836666 545231581 547631741 548995614 550500453 552279174
499.7 552279174 553392470 554706395 556559026 557706535 558474898 559758782 560569942 560592532 561260283
518.1 561260283 562370420 562751234 563046455 563719571 564014196 564331710 565219343 565793872 566159248 567297637
$$ packed form
399.8C29327077R162128P883161Q394331R589106Q918523Q316338Q584291P388681
416.1C97563636P394702R137392P562220O225645O753922O280541N653411O169319
432.4D52740788N978823N034268N284011N431563M408300M387021M770696L521800
448.7D91557270L103465L918946L092170K520322L559828K794862J324177J891196
465E13762236K367794J628459K166748L195166K701700K714992L216862K489150K139509
483.4E36382616K681255K161860J610935K394915K400160J363873J504839J778721
499.7E52279174J113296J313925J852631J147509P68363J283884Q11160K2590O67751
518.1E61260283J110137L80814K95221O73116K94625L17514Q87633N74529L65376J138389
$$ plain form
538.4 567297637 568499446 569035470 569868326 571103692 571762979 572281420 573041081 573204756 573050201
556.8 573050201 573360205 573546112 573467910 573971868 574747801 575099707 575570464 576170087 576120079 576033771
577.2 576033771 576647639 577200651 577622235 578722358 579793513 580110848 580621541 581260860 581168711 581212342
597.6 581212342 581692636 581400752 580654442 580266237 579451323 578319788 578179777 578574777 578618824 579178751
618 579178751 580348313 581147075 582163572 583706081 584526300 584901392 586063862 587360203 588201761
636.3 588201761 589444280 590778530 591365099 592056215 593081415 593319476 593224406 593542039 593253136
654.7 593253136 592361987 592091680 591959834 591302216 590847492 590415001 589524865 589627147 590376973 590543687
675.1 590543687 590411603 590632379 590361118 589429259 588745117 587792039 585909128 583808422 581322789
$$ packed form
538.4E67297637J201809N36024Q32856J235366O59287N18441P59661J63675j54555
556.8E73050201L10004J85907p8202N03958P75933L51906M70757N99623n0008q6308
577.2E76033771O13868N53012M21584J100123J071155L17335N10693O39319r2149M3631
597.6E81212342M80294k91884p46310l88205q14914j131535j40011L95000M4047N59927
618E79178751J169562P98762J016497J542509Q20219L75092J162470J296341Q41558
636.3E88201761J242519J334250N86569O91116J025200K38061r5070L17633k88903
654.7E93253136q91149k70307j31846o57618m54724m32491q90136J02282P49826J66714
675.1E90543687j32084K20776k71261r31859o84142r53078j882911k100706k485633
$$ plain form
693.5 581322789 577495515 572691977 567391515 560978830 553238571 544566691 535217822 526273012
709.8 526273012 519323826 514191568 509687722 506336987 505972803 509820819 518347204 531014860
726.1 531014860 546028793 561633229 576693535 589962065 600639045 609017909 615372658 619744658
742.4 619744658 622878671 625339389 626974881 628076255 629126966 629928887 630390644 630849004 631213844
760.8 631213844 631329119 631501079 631823480 632057667 632305026 632730663 633152783 633506536 633944154 634425342
781.2 634425342 634753287 634934843 635020912 634989321 634868681 634749115 634677708 634598255 634572685 634638727 634611487
803.6 634611487 634394526 634088933 633637309 632968009 632234097 631433845 630332649 629007220 627727151
821.9 627727151 626249909 624338686 622123420 619480133 616259456 612654805 608605683 603764296
$$ packed form
693.5E81322789l827274m803538n300462o412685p740259q671880r348869q944810
709.8E26273012o949186n132258m503846l350735l64184L848016Q526385J2667656
726.1E31014860J5013933J5604436J5060306J3268530J0676980Q378864O354749M372000
742.4F19744658L134013K460718J635492J101374J050711Q01921M61757M58360L64840
760.8F31213844J15275J71960L22401K34187K47359M25637M22120L53753M37618M81188
781.2F34425342L27945J81556Q6069l1591j20640j19566p1407p9453k5570O6042k7240
803.6F34611487k16961l05593m51624o69300p33912q00252j101196j325429j280069
821.9F27727151j477242j911223k215266k643287l220677l604651m049122m841387
$$ plain form
838.3 603764296 597986102 590701163 580483735 568044543 558510780 554685235 551720679 543959379
854.6 543959379 530454636 512277782 489600927 460931301 423100471 372410774 312003285
868.9 312003285 258759201 228678808 220583260 227948606 251045108 289952815 339669794 394421250
885.2 394421250 449290782 498461217 537090898 564640045 584108353 598323941 608824432
899.4 608824432 616893589 623269320 628094912 631793022 634772360 636998177 638646722 640089095
915.8 640089095 641203523 641765177 642027020 642100692 641850531 641467273 641143084 640758216 640365124 640125036
936.2 640125036 639855862 639518380 639335334 639192641 638875246 638459146 637836576 636780500 635418594
954.5 635418594 633806407 631793916 629522085 627189577 624643087 621812046 618860722 615679383
$$ packed form
838.3F03764296n778194p284939j0217428j2439192r533763l825545k964556p761300
854.6E43959379j3504743j8176854k2676855k8669626l7830830n0689697o0407489
868.9C12003285n3244084l0080393q095548P365346K3096502L8907707M9716979N4751456
885.2C94421250N4869532M9170435L8629681K7549147J9468308J4215588J0500491
899.4F08824432Q069157O375731M825592L698110K979338K225817J648545J442373
915.8F40089095J114428N61654K61843P3672k50161l83258l24189l84868l93092k40088
936.2F40125036k69174l37482j83046j42693l17395m16100o22570j056076j361906
954.5F35418594j612187k012491k271831k332508k546490k831041k951324l181339
$$ plain form
970.8 615679383 612031341 607942700 603374839 598204076 592512846 586405754 579980731 573496759
987.1 573496759 567145586 560910940 554892063 549220145 543815553 538582921 533455491 528224289
1003.5 528224289 522731066 517078221 511352003 505565763 499897301 494588435 489768386 485612214
1019.8 485612214 482271165 479702562 477880865 476825416 476431876 476562262 477072924 477613539 477808595
1038.1 477808595 477541119 476836354 475753427 474537820 473544776 473015964 473184705 474239588 476087481
1056.5 476087481 478458613 481063962 483426720 485004187 485433400 484446734 481930315 478239477 474142969
1074.8 474142969 470345378 467284054 465193659 464252800 464617521 466337860 469265878 472967029 476781249
1093.2 476781249 479939103 481853515 482585639 482688785 482623011 482741028 483291060 484180421 485195518
$$ packed form
970.8F15679383l648042m088641m567861n170763n691230o107092o425023o483972
987.1E73496759o351173o234646o018877n671918n404592n232632n127430n231202
1003.5E28224289n493223n652845n726218n786240n668462n308866m820049m156172
1019.8D85612214l341049k568603j821697j055449l93540J30386N10662N40615J95056
1038.1D77808595k67476p04765j082927j215607r93044n28812J68741J054883J847893
1056.5D76087481K371132K605349K362758J577467M29213r86666k516419l690838m096508
1074.8D74142969l797591l061324k090395r40859L64721J720339K928018L701151L814220
1093.2D76781249L157854J914412P32124J03146o5774J18017N50032Q89361J015097
$$ plain form
1111.6 485195518 486323655 487437904 488171369 488445342 488479972 488402367 488236427 488024294 487732947 487231612
1132 487231612 486408561 485129774 483305991 481114805 478822529 476563394 474505872 472814351 471466362
1150.3 471466362 470385671 469634175 469325364 469563037 470455468 471945792 473803401 475782484 477615386
1168.7 477615386 479090869 480241895 481213808 482032984 482640177 482948691 482859910 482311785 481298089
1187 481298089 479846060 478002459 475841701 473474860 471044749 468666434 466389447 464236438 462216198
1205.4 462216198 460247397 458219826 456073582 453713566 451057255 448152333 445118040 441991031
1221.7 441991031 438777685 435533464 432268441 428972453 425721586 422560364 419481039 416484147
1238 416484147 413489878 410423011 407331973 404294252 401240885 398137540 395038724 391882449 388624787
$$ packed form
1111.6D85195518J128137J114249P33465K73973L4630p7605j65940k12133k91347n01335
1132D87231612q23051j278787j823783k191186k292276k259135k057522j691521j347989
1150.3D71466362j080691p51496l08811K37673Q92431J490324J857609J979083J832902
1168.7D77615386J475483J151026R71913Q19176O07193L08514q8781n48125j013696
1187D81298089j452029j843601k160758k366841k430111k378315k276987k153009k020240
1205.4D62216198j968801k027571k146244k360016k656311k904922l034293l127009
1221.7D41991031l213346l244221l265023l295988l250867l161222l079325k996892
1238D16484147k994269l066867l091038l037721l053367l103345l098816l156275l257662
$$ plain form
1256.4 388624787 385346949 382058442 378710777 375398248 372128040 368764758 365304857 361862719
1272.7 361862719 358404458 354856014 351264954 347637385 343939334 340181887 336383492 332479060
1289 332479060 328499526 324492991 320387572 316150695 311856359 307549000 303227067 298948109 294677496
1307.4 294677496 290358722 286040217 281803459 277628154 273452878 269254774 265022427 260710448
1323.7 260710448 256307334 251842380 247297719 242791340 238409385 233976781 229271948 224506244
1340 224506244 220013365 215633065 211153612 206590295 201982379 197369039 192777246 188200668 183701515
1358.3 183701515 179171711 174461305 169891581 165642977 161412746 157226950 153075069 148831978
1374.7 148831978 144783989 140904337 137009338 133207396 129565611 125898883 122295260 118931524
$$ packed form
1256.4C88624787l277838l288507l347665l312529l270208l363282l459901l442138
1272.7C61862719l458261l548444l591060l627569l698051l757447l798395l904432
1289C32479060l979534m006535m105419m236877m294336m307359m321933m278958m270613
1307.4B94677496m318774m318505m236758m175305m175276m198104m232347m311979
1323.7B60710448m403114m464954m544661m506379m381955m432604m704833m765704
1340B24506244m492879m380300m479453m563317m607916m613340m591793m576578m499153
1358.3A83701515m529804m710406m569724m248604m230231m185796m151881m243091
1374.7A48831978m047989l879652l894999l801942l641785l666728l603623l363736
$$ plain form
1391 118931524 115367010 111422330 107558660 103783317 100165993 96803054 93514264 90591356 88092186
1409.3 88092186 85845008 83916746 82359403 81104092 80325589 80218643 80582611 81280306 82202472
1427.7 82202472 83331645 84533416 85619695 86803257 88213764 89382410 90277962 91043957 91735683
1446 91735683 92437349 93108594 93644120 93996599 94421722 95233299 96061774 96714064 97488157 98469347
1466.4 98469347 99381432 100265272 101517670 103131615 104736991 106324874 108008631 109861337 111761056
1484.8 111761056 113826528 116457850 119657293 122689761 125696555 129420400 133457586 137045324
1501.1 137045324 139998302 143215701 148087025 152820289 156577781 160122678 163700745 167445123
1517.4 167445123 171193525 175376296 179614410 183404133 187273070 190777928 194093347 197872281
$$ packed form
1391A18931524l564514l944680l863670l775343l617324l362939l288790k922908k499170
1409.3H8092186k247178j928262j557343j255311p78503j06946L63968O97695R22166
1427.7H2202472J129173J201771J086279J183562J410507J168646Q95552P65995O91726
1446I1735683P01666O71245N35526L52479M25123Q11577Q28475O52290P74093R81190
1466.4I8469347R12085Q83840J252398J613945J605376J587883J683757J852706J899719
1484.8A11761056K065472K631322L199443L032468L006794L723845M037186L587738
1501.1A37045324K952978L217399M871324M733264L757492L544897L578067L744378
1517.4A67445123L748402M182771M238114L789723L868937L504858L315419L778934
$$ plain form
1533.7 197872281 201161295 203774109 207555324 212384537 216654181 220662385 224487349 228491023
1550.1 228491023 232655928 236781210 240640029 246078372 253754795 259159327 263590783 268283844
1566.4 268283844 273204952 278503329 282889843 286688656 291382581 295834392 299448520 302875161
1582.7 302875161 306142956 309198171 312045544 314642012 317007065 319209695 321196169 322987020
1599 322987020 324657053 326185018 327462584 328551561 329540670 330344498 330809891 331153423 331816316
1617.4 331816316 332436711 332768112 333136499 333643913 334221423 334882170 335359275 335777909 336964309
1635.7 336964309 338788182 340423167 341900945 343275189 345153183 347730458 349583477 351689070
1652 351689070 355919212 359497875 361995250 364606887 367891788 371490717 374441832 377505124 381418109
$$ packed form
1533.7A97872281L289014K612814L781215M829213M269644M008204L824964M003674
1550.1B28491023M164905M125282L858819N438343P676423N404532M431456M693061
1566.4B68283844M921108N298377M386514L798813M693925M451811L614128L426641
1582.7C02875161L267795L055215K847373K596468K365053K202630J986474J790851
1599C22987020J670033J527965J277566J088977R89109Q03828M65393L43532O62893
1617.4C31816316O20395L31401L68387N07414N77510O60747M77105M18634J186400
1635.7C36964309J823873J634985J477778J374244J877994K577275J853019K105593
1652C51689070M230142L578663K497375K611637L284901L598929K951115L063292L912985
$$ plain form
1670.4 381418109 385023534 388667524 392791659 396245837 398916572 401881784 406657219 411294132
1686.7 411294132 414789855 418214053 421151996 424176902 427646935 431284428 435873508 439642310
1703 439642310 442676961 446123928 449247003 451782018 453878462 455948740 459074378 462682128 465350270
1721.4 465350270 467639893 469994098 472084165 473867327 475503206 478105098 481312752 483499676
1737.7 483499676 485621125 488019645 490143031 492038190 493886620 496191978 498892516 501028359
1754 501028359 502812386 504656017 506416559 508395553 510202169 511486232 512573183 513677597 515310287
1772.4 515310287 517056704 518028915 518462539 518659472 518490791 517856121 516754448 515049398 512944818
1790.7 512944818 511154473 509758174 508366585 507245123 506864130 507194698 507980168 509195626 510928273
$$ packed form
1670.4C81418109L605425L643990M124135L454178K670735K965212M775435M636913
1686.7D11294132L495723L424198K937943L024906L470033L637493M589080L768802
1703D39642310L034651L446967L123075K535015K096444K070278L125638L607750K668142
1721.4D65350270K289623K354205K090067J783162J635879K601892L207654K186924
1737.7D83499676K121449K398520K123386J895159J848430K305358K700538K135843
1754E01028359J784027J843631J760542J978994J806616J284063J086951J104414J632690
1772.4E15310287J746417R72211M33624J96933j68681o34670j101673j705050k104580
1790.7E12944818j790345j396299j391589j121462l80993L30568P85470J215458J732647
$$ plain form
1809.1 510928273 513290167 516069829 518948436 521972120 525124907 528053939 530780017 533588231
1825.4 533588231 536150038 538716674 541535854 543927312 545892715 547750413 549287796 550446928
1841.7 550446928 551992178 554026365 555719197 557109714 558415055 559651673 560881555 562111855
1858 562111855 563321531 564432025 565276802 565909207 566929221 568470478 569800138 570833862 571824968
1876.4 571824968 572774053 573668420 574540854 575385869 576130331 576954663 577976584 578886628 579711258
1894.7 579711258 580624342 581484795 582263231 583015680 583742261 584441125 585186064 585985959 586620986 587041914
1915.1 587041914 587623179 588462055 589214623 589993596 590814531 591466188 592052579 592659950 593249321 593816519
1935.5 593816519 594373345 594811618 595272660 595964909 596664369 597206175 597711861 598235846 598685265 599082232
$$ packed form
1809.1E10928273K361894K779662K878607L023684L152787K929032K726078K808214
1825.4E33588231K561807K566636K819180K391458J965403J857698J537383J159132
1841.7E50446928J545250K034187J692832J390517J305341J236618J229882J230300
1858E62111855J209676J110494Q44777O32405J020014J541257J329660J033724R91106
1876.4E71824968R49085Q94367Q72434Q45015P44462Q24332J021921R10044Q24630
1894.7E79711258R13084Q60453P78436P52449P26581O98864P44939P99895O35027M20928
1915.1E87041914N81265Q38876P52568P78973Q20935O51657N86391O07371N89371N67198
1935.5E93816519N56826M38273M61042O92249O99460N41806N05686N23985M49419L96967
$$ plain form
1955.9 599082232 599526465 599984705 600369751 600718021 601122439 601622045 602171421 602721095 603244901 603759706
1976.3 603759706 604284644 604724169 605095088 605494142 605876863 606172562 606529474 607045591 607485294 607827425
1996.7 607827425 608253062 608663976 608982563 609336317 609703004 610007703 610331893 610660017 610899091 611191869
2017.1 611191869 611597121 611926615 612193823 612502992 612795651 613056958 613376200 613698661 613932014 614163160
2037.5 614163160 614472747 614795268 615091503 615409434 615701735 615948200 616248548 616562605 616800487 617061079
2057.9 617061079 617370009 617611468 617834091 618134558 618430376 618669093 618942678 619235098 619469106 619711995
2078.3 619711995 620005727 620249152 620449960 620702744 620954573 621180475 621425033 621625841 621771395 621977985
2098.7 621977985 622204840 622361898 622528613 622743428 622937799 623101056 623288572 623468757 623587370 623696983
$$ packed form
1955.9E99082232M44233M58240L85046L48270M04418M99606N49376N49674N23806N14805
1976.3F03759706N24938M39525L70919L99054L82721K95699L56912N16117M39703L42131
1996.7F07827425M25637M10914L18587L53754L66687L04699L24190L28124K39074K92778
2017.1F11191869M05252L29494K67208L09169K92659K61307L19242L22461K33353K31146
2037.5F14163160L09587L22521K96235L17931K92301K46465L00348L14057K37882K60592
2057.9F17061079L08930K41459K22623L00467K95818K38717K73585K92420K34008K42889
2078.3F19711995K93732K43425K00808K52784K51829K25902K44558K00808J45554K06590
2098.7F21977985K26855J57058J66715K14815J94371J63257J87516J80185J18613J09613
$$ plain form
2119.1 623696983 623834848 623951912 624071300 624236166 624373257 624481857 624625027 624781668 624905348 625003755
2139.5 625003755 625108719 625228047 625370383 625549734 625749469 625942647 626141250 626335323 626516044 626742125
2159.9 626742125 627016783 627259076 627472103 627711236 627948642 628173470 628437877 628732562 628991783 629229248
2180.3 629229248 629479945 629707158 629921615 630202234 630508423 630741775 630941570 631151199 631353259 631550968
2200.7 631550968 631753206 631947339 632127464 632318377 632529974 632725775 632883430 633041918 633205593 633344710
2221.1 633344710 633497715 633687973 633852363 633982718 634115279 634220064 634313047 634464204 634643793 634773672
2241.5 634773672 634897351 635067463 635237992 635389984 635538638 635653198 635742724 635882020 636052668 636218011
2261.9 636218011 636406004 636588395 636721432 636853933 637018263 637154400 637261152 637392759 637512326 637575686
$$ packed form
2119.1F23696983J37865J17064J19388J64866J37091J08600J43170J56641J23680R8407
2139.5F25003755J04964J19328J42336J79351J99735J93178J98603J94073J80721K26081
2159.9F26742125K74658K42293K13027K39133K37406K24828K64407K94685K59221K37465
2180.3F29229248K50697K27213K14457K80619L06189K33352J99795K09629K02060J97709
2200.7F31550968K02238J94133J80125J90913K11597J95801J57655J58488J63675J39117
2221.1F33344710J53005J90258J64390J30355J32561J04785R2983J51157J79589J29879
2241.5F34773672J23679J70112J70529J51992J48654J14560Q9526J39296J70648J65343
2261.9F36218011J87993J82391J33037J32501J64330J36137J06752J31607J19567O3360
$$ plain form
2282.3 637575686 637629211 637688637 637737811 637791872 637820184 637809098 637814999 637825429 637763202 637633502 637502313
2304.7 637502313 637388468 637275815 637184739 637124419 637013674 636813283 636597455 636459410 636464059 636491418
2325.1 636491418 636364043 636234462 636316836 636444032 636418521 636377633 636550903 636977792 637747049 638591886
2345.5 638591886 638268411 636750638 635414898 635059536 635214388 635462821 635828316 636302114 636890531
2363.8 636890531 637542188 638122797 638685226 639294565 639827192 640173137 640385211 640545964 640603483 640549123
2384.2 640549123 640496552 640479147 640426576 640365124 640353203 640344203 640296340 640246511 640208304 640133977 640045404 639977992
2408.7 639977992 639889121 639776289 639702559 639653683 639553964 639406145 639240146 639038146 638827384 638658941
2429.1 638658941 638481259 638265610 638050318 637807012 637508273 637191713 636866510 636488378 636073291 635655582
$$ packed form
2282.3F37575686N3525N9426M9174N4061K8312j1086N901J0430o2227j29700j31189
2304.7F37502313j13845j12653r1076o0320j10745k00391k15828j38045M649K7359
2325.1F36491418j27375j29581Q2374J27196k5511m0888J73270M26889P69257Q44837
2345.5F38591886l23475j517773j335740l55362J54852K48433L65495M73798N88417
2363.8F36890531O51657N80609N62429O09339N32627L45945K12074J60753N7519n4360
2384.2F40549123n2571j7405n2571o1452j1921r000m7863m9829l8207p4327q8573o7412
2408.7F39977992q8871j12832p3730m8876r9719j47819j65999k02000k10762j68443
2429.1F38658941j77682k15649k15292k43306k98739l16560l25203l78132m15087m17709
$$ plain form
2449.5 635655582 635164261 634567261 633945584 633301020 632550001 631700695 630819559 629883051 628821909
2467.9 628821909 627613425 626266897 624822915 623298347 621656656 619876981 617988169 616006911
2484.2 616006911 613931775 611820400 609721720 607641697 605623484 603720844 601936460 600245774
2500.5 600245774 598641574 597131908 595698237 594310522 592966318 591650307 590367794 589175463
2516.8 589175463 588125706 587253451 586572289 586083829 585805118 585772157 586002886 586473644 587155163 588025331
2537.2 588025331 589055955 590236425 591547549 592920482 594281256 595601439 596864820 598047197
2553.5 598047197 599135160 600126982 601029932 601821125 602501690 603110969 603647411 604109943 604490757
2571.9 604490757 604762197 604954898 605134308 605297267 605400920 605458975 605488062 605477870 605459452 605440438
$$ packed form
2449.5F35655582m91321n97000o21677o44564p51019q49306q81136r36508j061142
2467.9F28821909j208484j346528j443982j524568j641691j779675j888812j981258
2484.2F16006911k075136k111375k098680k080023k018213j902640j784384j690686
2500.5F00245774j604200j509666j433671j387715j344204j316011j282513j192331
2516.8E89175463j049757q72255o81162m88460k78711l2961K30729M70758O81519Q70168
2537.2E88025331J030624J180470J311124J372933J360774J320183J263381J182377
2553.5E98047197J087963R91822R02950P91193O80565O09279N36442M62532L80814
2571.9F04490757K71440J92701J79410J62959J03653N8055K9087j0192j8418j9014
$$ plain form
2592.3 605440438 605392992 605357051 605365992 605395734 605443716 605510175 605569601 605645359 605798304 606029510 606292844
2614.7 606292844 606558263 606850624 607214987 607646704 608095825 608545363 609005630 609458268 609899223 610343397
2635.1 610343397 610788345 611211956 611614823 612008274 612361431 612656951 612919688 613135695 613285661 613409221
2655.5 613409221 613501668 613497496 613434434 613379478 613260329 613050044 612832129 612638354 612444043 612199903
2675.9 612199903 611886978 611574471 611340761 611133754 610844374 610516131 610254109 609990716 609634876 609249234
2696.3 609249234 608903348 608590543 608270586 607928455 607570231 607207179 606858671 606512427 606158614 605798960
2716.7 605798960 605397940 604933381 604465902 604045510 603666663 603323162 602981806 602596760 602179766 601781189
2737.1 601781189 601409316 601014733 600581646 600143909 599696457 599263549 598880470 598480761 598031640 597578883
$$ packed form
2592.3F05440438m7446l5941Q941K9742M7982O6459N9426P5758J52945K31206K63334
2614.7F06292844K65419K92361L64363M31717M49121M49538M60267M52638M40955M44174
2635.1F10343397M44948M23611M02867L93451L53157K95520K62737K16007J49966J23560
2655.5F13409221R2447m172o3062n4956j19149k10285k17915j93775j94311k44140
2675.9F12199903l12925l12507k33710k07007k89380l28243k62022k63393l55840l85642
2696.3F09249234l45886l12805l19957l42131l58224l63052l48508l46244l53813l59654
2716.7F05798960m01020m64559m67479m20392l78847l43501l41356l85046m16994l98577
2737.1F01781189l71873l94583m33087m37737m47452m32908l83079l99709m49121m52757
$$ plain form
2757.5 597578883 597126544 596663475 596222878 595789135 595292807 594760418 594230473 593658805 593081892 592556179
2777.9 592556179 592024326 591443062 590841591 590205491 589486241 588753641 588087142 587412715 586651742 585878372
2798.3 585878372 585176766 584467471 583663583 582779169 581858933 580969810 580107152 579163849 578139782
2816.6 578139782 577117324 576076508 574976146 573857427 572711349 571449757 570096135 568719447
2832.9 568719447 567265511 565674543 563982725 562130749 559926987 557321668 554543197 552056551
2849.3 552056551 550238848 549051940 548170030 547295749 546363354 545401096 544324934 543084979 541723311
2867.6 541723311 540252745 538770199 537454247 536349595 535366952 534423888 533485293 532556176 531661034
2886 531661034 530762255 529850721 528991699 528161407 527328253 526526809 525769711 525035739 524279118 523456156
$$ packed form
2757.5E97578883m52339m63069m40597m33743m96328n32389n29945n71668n76913n25713
2777.9E92556179n31853n81264o01471o36100p19250p32600o66499o74427p60973p73370
2798.3E85878372p01606p09295q03888q84414r20236q89123q62658r43303j024067
2816.6E78139782j022458j040816j100362j118719j146078j261592j353622j376688
2832.9E68719447j453936j590968j691818j851976k203762k605319k778471k486646
2849.3E52056551j817703j186908q81910q74281r32395r62258j076162j239955j361668
2867.6E41723311j470566j482546j315952j104652r82643r43064r38595r29117q95142
2886E31661034q98779r11534q59022q30292q33154q01444p57098p33972p56621q22962
$$ plain form
2906.4 523456156 522460699 521153927 519537747 517811120 516282976 515146136 514375091 513874292 513593376
2924.7 513593376 513472259 513458550 513591111 513906538 514342487 514819026 515307367 515763164 516157210 516519785
2945.1 516519785 516835749 517013133 517008245 516884625 516676009 516394913 516120434 515943289 515925467 516062617
2965.5 516062617 516289711 516547978 516810119 517122149 517530084 517922938 518254161 518687129 519238412 519708276
2985.9 519708276 520040154 520283043 520435333 520546734 520626545 520667076 520683765 520641565 520584404 520539939 520407617
3008.3 520407617 520183027 519990325 519897580 519861996 519793689 519630134 519328356 518914640 518444717 517901599
3028.7 517901599 517317116 516759515 516234279 515647411 514897466 514083982 513343513 512628198 511846304 511004627
3049.1 511004627 510143638 509289324 508488536 507704973 506836772 505911529 505011499 504150867 503331423 502518058
$$ packed form
2906.4E23456156r95457j306772j616180j726627j528144j136840p71045n00799k80916
2924.7E13593376j21117j3709J32561L15427M35949M76539M88341M55797L94046L62575
2945.1E16519785L15964J77384m888j23620k08616k81096k74479j77145j7822J37150
2965.5E16062617K27094K58267K62141L12030M07935L92854L31223M32968N51283M69864
2985.9E19708276L31878K42889J52290J11401P9811M0531J6689m2200n7161m4465j32322
3008.3E20407617k24590j92702r2745l5584o8307j63555l01778m13716m69923n43118
3028.7E17901599n84483n57601n25236n86868p49945q13484p40469p15315p81894q41677
3049.1E11004627q60989q54314q00788p83563q68201r25243r00030q60632q19444q13365
$$ plain form
3069.5 502518058 501654446 500750303 499822974 498907447 498059124 497221261 496313542 495376617 494454712 493551672
3089.9 493551672 492654502 491740048 490826786 489875615 488865435 487879515 486911267 485900313 484865010
3108.3 484865010 483817846 482714832 481571794 480453223 479346603 478248328 477185637 476095289
3124.6 476095289 474916130 473659366 472384065 471168071 469964266 468691826 467382103 466080397
3140.9 466080397 464777857 463455617 462123901 460760713 459354728 457945734 456528157 455062866
3157.2 455062866 453566760 452097923 450643867 449155629 447654009 446131200 444564909 443007350
3173.5 443007350 441472948 439928383 438340545 436690390 435047537 433486789 431945384 430376977
3189.9 430376977 428796083 427158386 425497651 423911154 422366738 420767009 419124484 417504281
$$ packed form
3069.5E02518058q63612r04143r27329r15527q48323q37863r07719r36925r21905r03040
3089.9D93551672q97170r14454r13262r51171j010180r85920r68248j010954j035303
3108.3D84865010j047164j103014j143038j118571j106620j098275j062691j090348
3124.6D76095289j179159j256764j275301j215994j203805j272440j309723j301706
3140.9D66080397j302540j322240j331716j363188j405985j408994j417577j465291
3157.2D55062866j496106j468837j454056j488238j501620j522809j566291j557559
3173.5D43007350j534402j544565j587838j650155j642853j560748j541405j568407
3189.9D30376977j580894j637697j660735j586497j544416j599729j642525j620203
$$ plain form
3206.2 417504281 415915638 414347023 412780136 411200106 409600168 408037156 406550705 405038983
3222.5 405038983 403444439 401855916 400342494 398865283 397376120 395884573 394406110 392918736
3238.8 392918736 391415119 389938712 388504088 387063801 385600358 384169579 382789344 381379038
3255.1 381379038 379908949 378459513 377044439 375612020 374161392 372733831 371376634 370065540
3271.4 370065540 368750155 367456466 366220742 365001023 363731951 362428129 361131281 359861046
3287.8 359861046 358671278 357544929 356338501 355030179 353756279 352553010 351380616 350219816
3304.1 350219816 349026650 347793937 346528053 345220029 343873769 342452973 340970546 339504451
3320.4 339504451 338054448 336594462 335107237 333554596 331950814 330338597 328788102 327317268
$$ packed form
3206.2D17504281j588643j568615j566887j580030j599938j563012j486451j511722
3222.5D05038983j594544j588523j513422j477211j489163j491547j478463j487374
3238.8C92918736j503617j476407j434624j440287j463443j430779j380235j410306
3255.1C81379038j470089j449436j415074j432419j450628j427561j357197j311094
3271.4C70065540j315385j293689j235724j219719j269072j303822j296848j270235
3287.8C59861046j189768j126349j206428j308322j273900j203269j172394j160800
3304.1C50219816j193166j232713j265884j308024j346260j420796j482427j466095
3320.4C39504451j450003j459986j487225j552641j603782j612217j550495j470834
$$ plain form
3336.7 327317268 325810969 324218154 322629839 321130097 319719374 318336487 316895753 315427184
3353 315427184 314035892 312712699 311395764 310051024 308717877 307479203 306310683 305096656 303787291
3371.4 303787291 302467883 301250249 300159037 299111426 298047334 297042966 296131939 295277417 294496119
3389.7 294496119 293728828 292879701 292044103 291346669 290742069 290098459 289372563 288691282 288149238 287687868
3410.1 287687868 287234277 286785662 286316514 285865039 285540581 285274565 285031587 284941465 284964472 284960836
3430.5 284960836 284981251 285064489 285108060 285079449 285100877 285256058 285564274 286044180 286516458 286893308
3450.9 286893308 287323684 287842691 288425446 289084405 289807558 290568501 291386485 292292386 293163329 293919146
3471.3 293919146 294691354 295546681 296458334 297477722 298596829 299659371 300709993 301924407 303219229
$$ packed form
3336.7C27317268j506299j592815j588315j499742j410723j382887j440734j468569
3353C15427184j391292j323193j316935j344740j333147j238674j168520j214027j309365
3371.4C03787291j319408j217634j091212j047611j064092j004368r11027q54522p81298
3389.7B94496119p67291q49127q35598o97434o04600o43610p25896o81281n42044m61370
3410.1B87687868m53591m48615m69148m51475l24458k66016k42978r0122K3007l636
3430.5B84960836K0415Q3238M3571k8611K1428J55181L08216M79906M72278L76850
3450.9B86893308M30376N19007N82755O58959P23153P60943Q17984R05901Q70943P55817
3471.3B93919146P72208Q55327R11653J019388J119107J062542J050622J214414J294822
$$ plain form
3489.7 303219229 304404199 305530161 306768477 307989419 309103280 310451865 312006593 313324392
3506 313324392 314624459 316189468 317768067 319243789 320702404 322140276 323567927 325163692 326876819
3524.4 326876819 328571975 330415308 332305491 334008396 335782170 337787658 339666307 341298938
3540.7 341298938 343054205 345282584 347709745 349716336 351617336 353885680 356048435 357966483
3557 357966483 360031068 361992508 363421082 365443289 369352669 373167455 375325888 377180785 379523128
3575.3 379523128 382061660 384641320 386942804 388694495 391072869 395261675 398998678 400956333
3591.7 400956333 403236389 406407535 409415931 412403136 415330708 417303860 419101208 422281325
3608 422281325 425924838 428957611 431487918 433309704 436349779 440965652 443656802 443888575 444655299
$$ packed form
3489.7C03219229J184970J125962J238316J220942J113861J348585J554728J317799
3506C13324392J300067J565009J578599J475722J458615J437872J427651J595765J713127
3524.4C26876819J695156J843333J890183J702905J773774K005488J878649J632631
3540.7C41298938J755267K228379K427161K006591J901000K268344K162755J918048
3557C57966483K064585J961440J428574K022207L909380L814786K158433J854897K342343
3575.3C79523128K538532K579660K301484J751691K378374M188806L737003J957655
3591.7D00956333K280056L171146L008396K987205K927572J973152J797348L180117
3608D22281325L643513L032773K530307J821786L040075M615873K691150K31773P66724
$$ plain form
3626.3 444655299 450109452 456819981 459282964 460845679 463095129 465310872 467435896 468622446
3642.6 468622446 468501836 469697237 475597411 481942058 483063579 483401030 486441582 488825768 489673197
3661 489673197 490362376 490101695 489591092 491914034 494634688 494847447 498213023 502608597 502955019
3679.4 502955019 502259433 501115680 499401391 500120521 504189074 506566405 505969703 504942417 504319429
3697.7 504319429 504662097 506693423 508058667 507035911 505898297 507455349 511465371 513010502
3714 513010502 511439919 509926617 509638727 510087430 510760307 511279643 510200799 508024096 507515550
3732.4 507515550 510023236 513420582 513242483 509144306 507119656 510783970 511966169 510383010
3748.7 510383010 513365209 516509473 515026271 513100266 513727188 514487207 513421535 512631655 512740135
$$ packed form
3626.3D44655299N454153O710529K462983J562715K249450K215743K125024J186550
3642.6D68622446j20610J195401N900174O344647J121521L37451L040552K384186Q47429
3661D89673197O89179k60681n10603K322942K720654K12759L365576M395574L46422
3679.4E02955019o95586j143753j714289P19130M068553K377331n96702j027286o22988
3697.7E04319429L42668K031326J365244j022756j137614J557052M010022J545131
3714E13010502j570583j513302k87890M48703O72877N19336j078844k176703n08546
3732.4E07515550K507686L397346j78099m098177k024650L664314J182199j583159
3748.7E10383010K982199L144264j483202j926005O26922P60019j065672p89880J08480
$$ plain form
3767.1 512740135 513793409 515167952 514656723 512963533 512335300 513449907 514047861 513474286 513476193
3785.4 513476193 513673007 513395131 512586236 511396170 510831594 510024846 509779453 512224734 512773395
3803.8 512773395 512261808 513912439 513372838 510053813 508165419 509370863 509543777 509967744 512748003
3822.1 512748003 512665153 511004686 509904563 508854210 508172810 507289886 507545114 509977996 511401832
3840.5 511401832 511321843 510873318 508808136 504627228 501256526 505386353 513083577 512541831 508398950
3858.8 508398950 505943596 506028295 506688476 505647659 505781412 507758737 508307219 507589579 505672216
3877.2 505672216 504699826 505300403 505114973 505933583 506157637 504771650 505431175 506022096 503825366
3895.5 503825366 501727343 501753390 503130376 505205452 506435215 505492747 503978372 502899945 501880109
$$ packed form
3767.1E12740135J053274J374543n11229j693190o28233J114607N97954n73575J907
3785.4E13476193J96814k77876q08895j190066n64576q06748k45393K445281N48661
3803.8E12773395n11587J650631n39601l319025j888394J205444J72914M23967K780259
3822.1E12748003q2850j660467j100123j050353o81400q82924K55228K432882J423836
3840.5E11401832p9989m48525k065182m180908l370702M129827P697224n41746m142881
3858.8E08398950k455354Q4699O60181j040817J33753J977325N48482p17640j917363
3877.2E05672216r72390O00577j85430Q18610K24054j385987O59525N90921k196730
3895.5E03825366k098023K6047J376986K075076J229763r42468j514375j078427j019836
$$ plain form
3913.9 501880109 501729548 502627730 502867818 502168238 501932442 501908183 501076818 500640392 501446545 501896143
3934.3 501896143 501232028 500243783 499654114 499866813 499924541 499372542 499317437 499605805 499464333 499095261
3954.7 499095261 498781979 498514682 498384893 498310894 498006284 497628301 497427791 497307211 497194886 497132003
3975.1 497132003 496990442 496712416 496504962 496432453 496271580 495967299 495765060 495661408 495465040 495274127
3995.5 495274127 495155096
3997.5 495155096
$$ packed form
3913.9E01880109j50561Q98182K40088o99580k35796k4259q31365m36426Q06153M49598
3934.3E01896143o64115r88245n89669K12699N7728n51999n5105K88368j41472l69072
3954.7D99095261l13282k67297j29789p3999l04610l77983k00510j20580j12325o2883
3975.1D97132003j41561k78026k07454p2509j60873l04281k02239j03652j96368j90913
3995.5D95274127j19031
3997.5D95155096
##END=$$ End of the data block
