##TITLE=$$ Begin of the data block
##JCAMP-DX=5.00 $$ ACD/SpecManager v 10.08
##SPECTROMETER/DATA SYSTEM=Alpha
##DATE=11 Jun 2014 08:19:42
##DATA TYPE=INFRARED SPECTRUM
##DATA CLASS=XYDATA
##ORIGIN=
##OWNER=
##NPOINTS=1765
##FIRSTX=399.75695801
##LASTX=3997.56933594
##MAXX=3997.56933594
##MINX=399.75695801
##MAXY=0.65265167
##MINY=0.08040843
##XFACTOR=1.0000000000
##YFACTOR=1.000000000000000e-9
##FIRSTY=0.32738927
##DELTAX=2.03957629
##XUNITS=1/CM
##YUNITS=ARBITRARY UNITS
##XYDATA=(X++(Y..Y))
399.8C27389270R580702Q635252Q829326R242445Q086592P692605Q291424P300824
$$ 327389270 336969972 345605224 354434550 363676995 371763587 379456192 387747616 395048440
416.1C95048440P604151R349019P366836N960345O681949O377220N668193O019026
$$ 395048440 402652591 412001610 419368446 425328791 432010740 438387960 444056153 450075179
432.4D50075179O002456N067796N268514N554944M470945M373163M726618L372699
$$ 450075179 456077635 461145431 466413945 471968889 476439834 480812997 485539615 488912314
448.7D88912314K917648L822267L094703K620518L550768K642810J329958J832664
$$ 488912314 491829962 495652229 498746932 501367450 504918218 507561028 508890986 510723650
465E10723650K188385J775622K475918L187298K452970K538502L243745K578795K146601
$$ 510723650 512912035 514687657 517163575 520350873 522803843 525342345 528586090 531164885 533311486
483.4E33311486K810896K407372J563668K081215K156556J327157J720130K086699
$$ 533311486 536122382 538529754 540093422 542174637 544331193 545658350 547378480 549465179
499.7E49465179J237333J183570J664161J053989P04646J200676Q87931K86460P74502
$$ 549465179 550702512 551886082 553550243 554604232 555308878 556509554 557397485 557683945 558458447
518.1E58458447R67801J89900K22743P95662M65334M03404Q99255N23210L12030J189590
$$ 558458447 559426248 559616148 559838891 560634553 561099887 561503291 562402546 562925756 563237786 564427376
538.4E64427376J388430O87302O87956Q76010L83556M63664Q99971L19659j17838K89440
$$ 564427376 565815806 566503108 567191064 568067074 568450630 568914294 569814265 570133924 570016086 570305526
558.8E70305526J82867n7101N44667P62284K97845N22613P43210K2233j45078M93288
$$ 570305526 570488393 570431292 570975959 571738243 572036088 572558701 573301911 573324144 573179066 573672354
579.2E73672354M78745M60803J141310J069248L41952M69684O04272K6763J15096M55737
$$ 573672354 574151099 574611902 575753212 576822460 577164412 577634096 578238368 578265131 578380227 578835964
599.6E78835964k50280o84619l55839p55251j012921n6267K79069k74599L24130J287401
$$ 578835964 578585684 577901065 577545226 576789975 575777054 575720787 575999856 575725257 576049387 577336788
620E77336788J087308J102209J435459P72118L94404J175702J314402R07003J377464
$$ 577336788 578424096 579526305 580961764 581733882 582128286 583303988 584618390 585525393 586902857
638.4E86902857J411140N49912O38366R82225J80483j79172K96593j35779p03574k47955
$$ 586902857 588313997 588863909 589502275 590484500 590664983 590485811 590782404 590646625 589943051 589695096
658.8E89695096k57432p41363l48806j26601o13689L8803N62667N6327j27077K51412
$$ 589695096 589437664 588696301 588347495 588220894 587607205 587646008 588208675 588265002 588137925 588389337
679.2E88389337k54989q57293n97358r64940j980662k179205k440214l720105m791200
$$ 588389337 588134348 587277055 586679697 585714757 583734095 581554890 579114676 575394571 570603371
697.5E70603371n353034o381929p628619q597613r364247q938193o846667n070746
$$ 570603371 565250337 558868408 551239789 542642176 533277929 524339736 517493069 512422323
713.8E12422323m533052l369153l09765L902614Q487284J2625039J5033603J5667259
$$ 512422323 507889271 504520118 504210353 508112967 516600251 529225290 544258893 559926152
730.2E59926152J5149951J3296962J0641813Q358956O325066M321098L111363K490937
$$ 559926152 575076103 588373065 599014878 607373834 613698900 618019998 621131361 623622298
746.5F23622298J711726J161039J035095P57992M70161N00262M18305J68682J82509
$$ 623622298 625334024 626495063 627530158 628288150 628758311 629258573 629676878 629845560 630028069
764.8F30028069L49879L10898K56181L55124M10259M15027N03898N49614M13835K40207
$$ 630028069 630377948 630688846 630945027 631300151 631710410 632125437 632629335 633178949 633592784 633832991
785.2F33832991Q2135n5909j62542j84357r9480j6451L7730N2452m1723k26915k92480
$$ 633832991 633915126 633859217 633696675 633512318 633412838 633396387 633434117 633486569 633444846 633217931 632925451
807.7F32925451m01020o56426p08044p12931r88364j237810j309812j569033j944541
$$ 632925451 632524431 631868005 631159961 630447030 629458666 628220856 626911044 625342011 623397470
826F23397470k188206k548695l095805l592670m177154m936873n755485p248044j0231852
$$ 623397470 621209264 618660569 615564764 611972094 607794940 602858067 597102582 589854538 579622686
844.4E79622686j2443781r494185l813029l009259p814229j3542950j8201113k2670120
$$ 579622686 567178905 557684720 553871691 550862432 543048203 529505253 511304140 488634020
860.7D88634020k8651863l7823111n0615192o0228467n3058654k9907777p872671P591650
$$ 488634020 459982157 422159046 371543854 311315387 258256733 228348956 220476285 228067935
877B28067935K3255437L8999349M9761564N4775357N4912388M9188286L8583994K7515054
$$ 228067935 251323372 290322721 340084285 394859642 449772030 498960316 537544310 565059364
893.3E65059364J9454956J4211535J0516644Q065700O367565M808485L643155K970576
$$ 565059364 584514320 598725855 609242499 617308199 623675764 628484249 632127404 635097980
909.6F35097980K251745J621306J408159J118064N98431K83718M3988k70664l39389
$$ 635097980 637349725 638971031 640379190 641497254 642095685 642379403 642423391 642152727 641813338
928F41813338k57075l83318m28855k53200k94507l53396j67310j46151l26574m13417
$$ 641813338 641556263 641172945 640744090 640490890 640196383 639842987 639675677 639529526 639202952 638789535
948.4F38789535o31094j084030j409829j631319j990915k268374k363681k608359k885521
$$ 638789535 638158441 637074411 635664582 634033263 632042348 629773974 627410293 624801934 621916413
966.8F21916413k963066l174722l622472m015088m501701n211711n791723o157339
$$ 621916413 618953347 615778625 612156153 608141065 603639364 598427653 592635930 586478591
983.1E86478591o421030o450414o298244o177962o000459n702555n430818n259454
$$ 586478591 580057561 573607147 567308903 561130941 555130482 549427927 543997109 538737655
999.4E38737655n163193n209804n432605n626738n694509n713642n608022n285293
$$ 538737655 533574462 528364658 522932053 517305315 511610806 505897164 500289142 495003849
1015.7D95003849m814714m157841l319383k508193j806617j106679m10408J54406M97550
$$ 495003849 490189135 486031294 482711911 480203718 478397101 477290422 476880014 477034420 477531970
1034.1D77531970M95016J76609k62857o92606j069635j220763j016557n70983J42217
$$ 477531970 478026986 478203595 477940738 477248132 476178497 474957734 473941177 473370194 473512411
1052.4D73512411J092464J903832K371430K577275K355755J561403L98725r89467k504647
$$ 473512411 474604875 476508707 478880137 481457412 483813167 485374570 485773295 484783828 482279181
1070.8D82279181l681957m081995l798663l078073k091319r38445L19451J646817K891034
$$ 482279181 478597224 474515229 470716566 467638493 465547174 464608729 464928180 466574997 469466031
1089.1D69466031L701061L820896L172219J962065P98017J67131N573J69635N62460
$$ 469466031 473167092 476987988 480160207 482122272 482920289 483087420 483092993 483262628 483825088
1107.5D83825088R01758J053632J137048J064717O93411K80172N3793p6115j81824
$$ 483825088 484726846 485780478 486917526 487982243 488675654 488955826 489009619 488933504 488751680
1125.8D88751680k30044k87891m78417q17358j276851j793474k165556k304315k280027
$$ 488751680 488521636 488233745 487755328 486937970 485661119 483867645 481702089 479397774 477117747
1144.2D77117747k041638j663983j356005j092732p34628k78681K58982Q84026J460523
$$ 477117747 475076109 473412126 472056121 470963389 470228761 469950080 470209062 471093088 472553611
1162.6D72553611J825571J953304J841724J481145J105905R30309Q15541O32554L44902
$$ 472553611 474379182 476332486 478174210 479655355 480761260 481691569 482507110 483139664 483484566
1180.9D83484566r7066n93245j013458j420229j822263k136887k362132k452433k412408
$$ 483484566 483387500 482794255 481780797 480360568 478538305 476401418 474039286 471586853 469174445
1199.3D69174445k311290k164811k015769j966625k030194k162218k380997k677203
$$ 469174445 466863155 464698344 462682575 460715950 458685756 456523538 454142541 451465338
1215.6D51465338k929002l036230l114880l214657l259152l270924l275871l215462
$$ 451465338 448536336 445500106 442385226 439170569 435911417 432640493 429364622 426149160
1231.9D26149160l139586l096133l007531k989531l105253l148734l058613l048241
$$ 426149160 423009574 419913441 416905910 413916379 410811126 407662392 404603779 401555538
1248.2D01555538l103077l102213l150314l264070l302664l285229l315955l294319
$$ 401555538 398452461 395350248 392199934 388935864 385633200 382347971 379032016 375737697
1264.5C75737697l263593l358483l476888l478646l504426l593564l603249l627688
$$ 375737697 372474104 369115621 365638733 362160087 358655661 355062097 351458848 347831160
1280.8C47831160l709108l753066l785521l900140l985793m030972m147649m274935
$$ 347831160 344122052 340368986 336583465 332683325 328697532 324666560 320518911 316243976
1297.2C16243976m297465m285037m306853m278421m263998m300624m331320m282743
$$ 316243976 311946511 307661474 303354621 299076200 294812202 290511578 286180258 281897515
1313.5B81897515m212707m188180m179508m197180m288048m394799m468113m572779
$$ 281897515 277684808 273496628 269317120 265119940 260831892 256437093 251968980 247396201
1329.8B47396201m560769m419923m414513m676000m799932m546314m381106m455298
$$ 247396201 242835432 238415509 234000996 229324996 224525064 219978750 215597644 211142346
1346.1B11142346m560813m623413m634485m599571m559696m472598m497767m690870
$$ 211142346 206581533 201958120 197323635 192724064 188164368 183691770 179194003 174503133
1362.4A74503133m575700m252776m234165m220367m207209m270985m016564l812253
$$ 174503133 169927433 165674657 161440492 157220125 153012916 148741931 144725367 140913114
1378.7A40913114l845841l797933l665820l680751l607273l383294l563076l907203
$$ 140913114 137067273 133269340 129603520 125922769 122315496 118932202 115369126 111461923
1395.1A11461923l847085l754937l566362l328204l286682k943389k494536k204389
$$ 111461923 107614838 103859901 100293539 96965335 93678653 90735264 88240728 86036339
1411.4H6036339j916319j588911j266285p59960r6432L91729P31908R22337J118824
$$ 86036339 84120020 82531109 81264824 80504864 80408432 80800161 81532069 82454406 83573230
1429.7H3573230J220114J121543J216032J439773J184560R05775P87675P21618P10041
$$ 83573230 84793344 85914887 87130919 88570692 89755252 90661027 91448702 92170320 92880361
1448.1I2880361O47709N22978L74325M46036P88935Q07158O73436Q37773J047790R37045
$$ 92880361 93528070 94051048 94425373 94871409 95660344 96467502 97140938 97978711 99026501 99963546
1468.5I9963546Q81895J255959J620934J627825J637295J720779J867532J928129K107501
$$ 99963546 100845441 102101400 103722334 105350159 106987454 108708233 110575765 112503894 114611395
1486.8A14611395K655513L229261L067173L015630L728568M060701L628924K988905
$$ 114611395 117266908 120496169 123563342 126578972 130307540 134368241 137997165 140986070
1503.2A40986070L244281M929289M789725L772497L543943L595949L800228L810316
$$ 140986070 144230351 149159640 153949365 157721862 161265805 164861754 168661982 172472298
1519.5A72472298M203499M232212L812612L927558L556013L350303L835574L368258
$$ 172472298 176675797 180908009 184720621 188648179 192204192 195554495 199390069 202758327
1535.8B02758327K673462L784537M799024M287690M076674L894061M027680M163876
$$ 202758327 205431789 209216326 214015350 218303040 222379714 226273775 230301455 234465331
1552.1B34465331M150703L884808N411282P689819N474537M481405M734695M956007
$$ 234465331 238616034 242500842 247912124 255601943 261076480 265557885 270292580 275248587
1568.4B75248587N321592M415363L832370M702181M419595L588557L421545L254891
$$ 275248587 280570179 284985542 288817912 293520093 297939688 301528245 304949790 308204681
1584.7C08204681L032744K843529K602338K342910K159387J938790J722664J581579
$$ 308204681 311237425 314080954 316683292 319026202 321185589 323124379 324847043 326428622
1601.1C26428622J444250J220763J053929R41128P24345L67731K26170N43624N26816
$$ 326428622 327872872 329093635 330147564 331088692 331813037 332180768 332406938 332950562 333477378
1619.4C33477378K35617L04252N02139N76824O57916M75079L97265J187116J892805
$$ 333477378 333712995 334017247 334519386 335096210 335754126 336229205 336626470 337813586 339706391
1637.8C39706391J705319J529306J424044J948864K692729J977742K226322M366756
$$ 339706391 341411710 342941016 344365060 346313924 349006653 350984395 353210717 357577473
1654.1C57577473L731787K658337K735794L372461L713935L071219L165513M019529
$$ 357577473 361309260 363967597 366703391 370075852 373789787 376861006 380026519 384046048
1670.4C84046048L694057L714085M213482L557116K765208L053278M886627M750669
$$ 384046048 387740105 391454190 395667672 399224788 401989996 405043274 409929901 414680570
1686.7D14680570L582955L493070K965778L041536L537148L730119M696279L852666
$$ 414680570 418263525 421756595 424722373 427763909 431301057 435031176 439727455 443580121
1703D43580121L082305L515869L229171K622039K126097K082467L168613L687680K743810
$$ 443580121 446662426 450178295 453407466 456029505 458155602 460238069 463406682 467094362 469838172
1721.4D69838172K327740K375484K123952J835435J673341K609641L248751K256721
$$ 469838172 472165912 474541396 476665348 478500783 480174124 482783765 486032516 488289237
1737.7D88289237K180696K451658K173334J916945J843631K334685K775728K186895
$$ 488289237 490469933 492921591 495094925 497011870 498855501 501190186 503965914 506152809
1754E06152809J805901J864553J775324K014816J873791J330018J094818J074374J612008
$$ 506152809 507958710 509823263 511598587 513613403 515487194 516817212 517912030 518986404 520598412
1772.4E20598412J797616J032889M61876K16246j39713o16372j114190j733183k138734
$$ 520598412 522396028 523428917 523890793 524107039 523967326 523350954 522236764 520503581 518364847
1790.7E18364847j811326j391649j381636j116633l72946L72052Q51571J255632J742184
$$ 518364847 516553521 515161872 513780236 512663603 512290657 512662709 513514280 514769912 516512096
1809.1E16512096K384305K832234K951383L091097L185153K943814K752185K844512
$$ 516512096 518896401 521728635 524680018 527771115 530956268 533900082 536652267 539496779
1825.4E39496779K609253K634704K871752K400339J973987J889050J560032J142561
$$ 539496779 542106032 544740736 547612488 550012827 551986814 553875864 555435896 556578457
1841.7E56578457J529515K101839J808285J457870J308382J237869J240611J229465
$$ 556578457 558107972 560209811 562018096 563475966 564784348 566022217 567262828 568492293
1858E68492293J230538J150906Q69453O46413J034736J555443J348615J067221J035094
$$ 568492293 569722831 570873737 571743190 572389603 573424339 574979782 576328397 577395618 578430712
1876.4E78430712R82523R19163R08256Q78334P44402Q08001J024604R31501Q44479
$$ 578430712 579413235 580332398 581240654 582118988 582863390 583671391 584695995 585627496 586471975
1894.7E86471975R25839Q92460Q22723P74562P14958O67930P48396Q60750P11441M72486
$$ 586471975 587397814 588290274 589112997 589887559 590602517 591270447 592018843 592879593 593591034 594063520
1915.1E94063520O00398Q28862P20382P60376Q33810O81340O15955O11544N93423O05941
$$ 594063520 594663918 595492780 596213162 596973538 597807348 598488688 599104643 599716187 600309610 600915551
1935.5F00915551N80490M05073M32134P32124P68303O04928N44906N00440M13656M19856
$$ 600915551 601496041 601901114 602333248 603065372 603833675 604438603 604983509 605483949 605897605 606317461
1955.9F06317461M91142M83334M10080L80874M26948N18620N70535N71847N22614M81188
$$ 606317461 606808603 607291937 607702017 608082891 608509839 609028459 609598994 610170841 610693455 611174643
1976.3F11174643N09918M64082M12285M49240M31538L29315L64602N13017M63903L81887
$$ 611174643 611684561 612148643 612560928 613010168 613441706 613771021 614135623 614648640 615112543 615494430
1996.7F15494430M38035M01914L32355L96669L99768L07978L12447L35157K73287L23654
$$ 615494430 615932465 616334379 616666734 617063403 617463171 617771149 618083596 618418753 618692040 619015694
2017.1F19015694M21762L30687K68221L44991L35515K75433L28600L38197K50638K51531
$$ 619015694 619437456 619768143 620036364 620381355 620716870 620992303 621320903 621659100 621909738 622161269
2037.5F22161269L10421L05176L14891L72351L25799K63512L20792L18050K30074K73705
$$ 622161269 622471690 622776866 623091757 623464108 623789907 624053419 624374211 624692261 624922335 625196040
2057.9F25196040L46124K66373K37823L30567L32534K66373K74778K94626K80857K97546
$$ 625196040 625542164 625808537 626046360 626376927 626709461 626975834 627250612 627545238 627826095 628123641
2078.3F28123641L05951K48253K25246K82049K94149K54452K52605K55465K20478K14875
$$ 628123641 628429592 628677845 628903091 629185140 629479289 629733741 629986346 630241811 630462289 630677164
2098.7F30677164K14398J87754J99556K24472J95562J57178J77741J84715J50263J56999
$$ 630677164 630891562 631079316 631278872 631503344 631698906 631856084 632033825 632218540 632368803 632525802
2119.1F32525802J79052J47522J58667K33471K08974J22428J18852J53959J40548J40547
$$ 632525802 632704854 632852376 633011043 633244514 633453488 633575916 633694768 633848727 633989275 634129822
2139.5F34129822J69635J65343J58966J80125J92166J95264K25544K29836K05636K41220
$$ 634129822 634299457 634464800 634623766 634803891 634996057 635191321 635416865 635646701 635852337 636093557
2159.9F36093557K89440K65539K34604K51054K75195K85804K85805K87652K85744K83599
$$ 636093557 636382997 636648536 636883140 637134194 637409389 637695193 637980998 638268650 638554394 638837993
2180.3F38837993K81692K63691K50339K75850L04401K78175K39671K35080K34485K30372
$$ 638837993 639119685 639383376 639633715 639909565 640213966 640492141 640731812 640966892 641201377 641431749
2200.7F41431749K43723K13743J66237J78575J99616K00272K08139K21730K02894J85132
$$ 641431749 641675472 641889215 642055452 642234027 642433643 642633915 642842054 643063784 643266678 643451810
2221.1F43451810K10404K05696J53124J51694J78039J45674J18077J55508J96457J81258
$$ 643451810 643662214 643867910 644021034 644172728 644350767 644496441 644614518 644770026 644966483 645147741
2241.5F45147741J62363J58608J54257J75953J92880J67310J47641J74165J76549J58667
$$ 645147741 645310104 645468712 645622969 645798922 645991802 646159112 646306753 646480918 646657467 646816134
2261.9F46816134J87040J99318J56402J57118K01404K04146J85907J61409J17481Q3029
$$ 646816134 647003174 647202492 647358894 647516012 647717416 647921562 648107469 648268878 648386359 648469388
2282.3F48469388R5010R3162M5896L2186M2558M0651N2869M6253k6584r1731r8407
$$ 648469388 648564398 648657560 648703456 648735642 648778200 648818851 648871720 648917973 648891389 648799658 648701251
2304.7F48701251j05739j09315n9962k0922r7513k18749k16484r9242K3544N1678m7684
$$ 648701251 648595512 648486197 648426235 648405313 648307800 648089051 647872567 647773325 647796869 647848547 647800863
2327.1F47800863m6432J21832J39653J4603J193J35958L46422P60972R11236k61664
$$ 647800863 647754431 647876263 648015916 648030519 648031712 648167670 648514092 649275064 650186300 649924636
2347.5F49924636j476646j305997l15368K26796K95043L80158N14507N81801O08027
$$ 649924636 648447990 647141993 646826625 647053421 647348464 647728622 648243129 648824930 649432957
2365.9F49432957O19829N94735N63443N24997M09246K61486J63316P5639O020j7524
$$ 649432957 650052786 650647521 651210964 651735961 652145207 652406693 652570009 652645648 652651668 652634144
2386.3F52634144k6882l7014j8776k503j1206j7524j3232k0504o0081p5996o5089q3923
$$ 652634144 652607262 652570248 652551472 652548969 652537763 652520239 652507007 652486503 652426422 652350426 652285337 652201414
2410.8F52201414j00553o4731l7491o3956j05917j53601j93179j79350j33157j51873
$$ 652201414 652100861 652036130 651998639 651934683 651828766 651675165 651481986 651302636 651169479 651017606
2431.2F51017606k01523k03550k11596k56360l01897l36528l78490m10914m14431m43101
$$ 651017606 650816083 650612533 650400937 650144577 649842680 649506152 649127662 648716748 648302317 647859216
2451.5F47859216n21601n91933o54996p55667q48115q92460r54867j064717j194179
$$ 647859216 647337615 646745682 646090686 645335019 644486904 643594444 642639577 641574860 640380681
2469.9F40380681j334668j443922j538158j661539j794278j909316k001941k074301
$$ 640380681 639046013 637602091 636063933 634402394 632608116 630698800 628696859 626622558
2486.2F26622558k106011k108991k105356k053976j926362j791597j692891j605868
$$ 626622558 624516547 622407556 620302200 618248224 616321862 614530265 612837374 611231506
2502.5F11231506j522660j436830j366913j348079j357257j308977j178325j008928
$$ 611231506 609708846 608272016 606905103 605557024 604199767 602890790 601712465 600703537
2518.9F00703537q43942o87122m96924k60413J4007K86818N08130P16209R29117J114965
$$ 600703537 599859595 599172473 598675549 598415136 598429143 598715961 599224091 599940300 600869417 601984382
2539.2F01984382J250446J312792J353681J404643J412392J346290J236200J119614
$$ 601984382 603234828 604547620 605901301 607305944 608718336 610064626 611300826 612420440
2555.6F12420440J019060R49443Q54075P36117O38962N37455M57704L88980K98858
$$ 612420440 613439500 614388943 615243018 615979135 616618097 617155552 617613256 618002236 618301094
2573.9F18301094K51650K40386J73867R7096Q0108P1228M3571K4497J6392K3245L9578
$$ 618301094 618552744 618793130 618966997 619064093 619144201 619215429 619259000 619283497 619299889 619323134 619362712
2596.4F19362712L3021K0444M0174P4088R6381J31369J74045K09689K60652L18169
$$ 619362712 619395733 619416177 619456351 619530439 619626820 619758189 619932234 620141923 620402575 620720744
2616.8F20720744L83377M41492M40180M11749M43578M87029N01335N21779M92752M41312
$$ 620720744 621104121 621545613 621985793 622397542 622841120 623328149 623829484 624351263 624844015 625285327
2637.1F25285327M51148M82440M53174L74794L30389L10003K40803J55509J06692P5817
$$ 625285327 625736475 626218915 626672089 627046883 627377272 627687275 627928078 628083587 628190279 628266096
2657.5F28266096N0366Q166n0247j13785j56999j64091j80662k06828k27749k56241
$$ 628266096 628316462 628324628 628274381 628160596 628003597 627839506 627658844 627452016 627224267 626968026
2677.9F26968026k67148k45213k32995k69592k99155k59042k56241l22699l31521k91526
$$ 626968026 626700878 626455665 626222670 625953078 625653923 625394881 625138640 624815941 624484420 624192894
2698.3F24192894k78414k95877l24369l78966m06623l57747l28422l49521l60072l73602
$$ 624192894 623914480 623618603 623294234 622915268 622508645 622150898 621822476 621472955 621112883 620739281
2718.7F20739281m12106m24862m05312l83735l52859l48032l84986l92199l53872l34859
$$ 620739281 620327175 619902313 619497001 619113266 618760407 618412375 618027389 617635190 617281318 616946459
2739.1F16946459l75211m22955m26471m19975l97443l65198l86953m37618m37915m18544
$$ 616946459 616571248 616148293 615721822 615301847 614904404 614539206 614152253 613714635 613276720 612858176
2759.5F12858176m40180m48585m41134m72366n00143n13852n58555n63800n37634n62251
$$ 612858176 612417996 611969411 611528277 611055911 610555768 610041916 609483361 608919561 608381927 607819676
2779.9F07819676n79714n60582n89192o96123p49826o96659o86348p55429p60853p15435
$$ 607819676 607239962 606679380 606090188 605394065 604644239 603947580 603261232 602505803 601744950 601029515
2800.3F01029515p31885p72774q29578r21905r44972q90195r11355r82523j002610
$$ 601029515 600297630 599524856 598695278 597773373 596828401 595938206 595026851 594044328 593041718
2818.7E93041718j051188j127898j133681j139879j247048j366913j428307j504600
$$ 593041718 591990530 590862632 589728951 588589072 587342024 585975111 584546804 583042204
2835E83042204j629173j720906j848221k177894k618372k836824k534747j842379j221717
$$ 583042204 581413031 579692125 577843904 575666010 573047638 570210814 567676067 565833688 564611971
2853.3E64611971r32335q93891r36330r96172j100838j247704j376093j476526j494169
$$ 564611971 563679636 562785745 561849415 560853243 559752405 558504701 557128608 555652082 554157913
2871.7E54157913j338423j128673j015782r55642r06884q72612q55267r03488r46343
$$ 554157913 552819490 551690817 550675035 549719393 548812509 547939897 547084630 546181142 545234799
2890.1E45234799q97407q59082q41975p70748p23183p34031p46250q00669r95160j321435
$$ 545234799 544337392 543478310 542636335 541865587 541142404 540408373 539662123 538861454 537866294 536544859
2910.4E36544859j643478j761497j562774j168608p68066m71532k86222j33991K4736
$$ 536544859 534901381 533139884 531577110 530408502 529640436 529168904 528882682 528748691 528773427
2928.8E28773427K01344L73483M70042M93348N09620N20766M82320L86656L05354K23398
$$ 528773427 528974771 529348254 529818296 530311644 530821264 531342030 531824350 532211006 532516360 532739758
2949.2E32739758M9353j21176k14458k72333k58625j49846m291J22368K36809L25382
$$ 532739758 532789111 532667935 532453477 532181144 531922519 531772673 531768382 531890750 532127559 532452941
2969.6E32452941L50237L48091L50416L41832M18783O04748O57559N05209L46124K01344
$$ 532452941 532803178 533151269 533501685 533843517 534262300 534867048 535524607 536029816 536375940 536577284
2990E36577284R8825J23858J11342L7431L696j5378N245N067r7037j85728j65462p6056
$$ 536577284 536676109 536799967 536911309 536948740 536952436 536937058 536942303 536947370 536850333 536664605 536499143 536423087
3014.5E36423087j4961o8187j97173l26812m17530m60089m82976n04076n48721n68986
$$ 536423087 536408126 536339939 536142766 535815954 535398424 534938335 534455359 533951283 533402562 532833576
3034.9E32833576o08086p64788q69810q02219o99937o94931p86424q69512q82089q57473
$$ 532833576 532225490 531460702 530590892 529788673 529088736 528393805 527607381 526737869 525855780 524998307
3055.3E24998307q46743q83997r26375r10998q79645q62300q42691q61347r21785r71377
$$ 524998307 524151564 523267567 522341192 521430194 520550549 519688249 518845558 517984211 517062426 516091049
3075.6E16091049r70185r03666q44002q64923r07659r30310r54389r36985q88229r12130
$$ 516091049 515120864 514217198 513373196 512508273 511600614 510670304 509715915 508778930 507890701 506978571
3096E06978571j037299j097560j015842r96113j079976j118541j092911j093626j121551
$$ 506978571 505941272 504843712 503827870 502831757 501751781 500633240 499540329 498446703 497325152
3114.4D97325152j126468j152158j138866j067400j099288j232028j333058j332343
$$ 497325152 496198684 495046526 493907660 492840260 491740972 490508944 489175886 487843543
3130.7D87843543j259088j248360j303553j314313j303553j339257j399398j428693
$$ 487843543 486584455 485336095 484032542 482718229 481414676 480075419 478676021 477247328
3147D77247328j437247j448632j453280j457363j489282j529992j520276j500666j536190
$$ 477247328 475810081 474361449 472908169 471450806 469961524 468431532 466911256 465410590 463874400
3165.4D63874400j583726j610785j653999j681000j640678j586824j588017j649976
$$ 463874400 462290674 460679889 459025890 457344890 455704212 454117388 452529371 450879395
3181.7D50879395j687258j669854j677037j682251j662344j677454j699894j691044
$$ 450879395 449192137 447522283 445845246 444162995 442500651 440823197 439123303 437432259
3198D37432259j687228j670331j635701j664370j683026j626403j606583j625180j650006
$$ 437432259 435745031 434074700 432438999 430774629 429091603 427465200 425858617 424233437 422583431
3216.4D22583431j662672j647800j663595j658470j601755j561106j540660j544804
$$ 422583431 420920759 419272959 417609364 415950894 414349139 412788033 411247373 409702569
3232.7D09702569j562863j554668j545966j561254j544744j495361j498401j549006
$$ 409702569 408139706 406585038 405039072 403477818 401933074 400437713 398939312 397390306
3249C97390306j544237j469433j446695j503020j540601j506955j433223j393795j404107
$$ 397390306 395846069 394376636 392929941 391426921 389886320 388379365 386946142 385552347 384148240
3267.4C84148240j435220j440764j400858j338541j293689j316786j356930j347601
$$ 384148240 382713020 381272256 379871398 378532857 377239168 375922382 374565452 373217851
3283.7C73217851j322150j294285j228154j198769j273870j334101j322538j298427
$$ 373217851 371895701 370601416 369373262 368174493 366900623 365566522 364243984 362945557
3300C62945557j244456j212180j288771j352579j352429j401812j480579j506090j499653
$$ 362945557 361701101 360488921 359200150 357847571 356495142 355093330 353612751 352106661 350607008
3318.4C50607008j517594j546323j564205j615942j686394j707017j692623j636297
$$ 350607008 349089414 347543091 345978886 344362944 342676550 340969533 339276910 337640613
3334.7C37640613j579016j643568j734943j693695j615346j579732j525014j507610
$$ 337640613 336061597 334418029 332683086 330989391 329374045 327794313 326269299 324761689
3351C24761689j553208j553148j490414j440615j449644j433432j333475j280636j335561
$$ 324761689 323208481 321655333 320164919 318724304 317274660 315841228 314507753 313227117 311891556
3369.3C11891556j408875j383960j261980j159102j108825j116723j117587j054555
$$ 311891556 310482681 309098721 307836741 306677639 305568814 304452091 303334504 302279949
3385.7C02279949r76652q74668q04961q68141r02653p61867o63697p49827q03888o94394
$$ 302279949 301303297 300428629 299623668 298755527 297852874 297091007 296427310 295677483 294873595 294179201
3406.1B94179201n64873n19961m98057m78178n21243m76360l06696k54273k70754j79231
$$ 294179201 293614328 293094367 292596310 292118132 291596889 291120529 290813833 290559560 290288806 290109575
3426.5B90109575o0678j7404M6044J08987N1409k9772N7042J92344K85476N13673N92709
$$ 290109575 290048897 290031493 290077537 290186524 290237933 290208161 290265203 290457547 290743023 291256696 291849405
3448.9B91849405M37825M36724N61803O65963P11501P05778P68751Q89093R49979Q94099
$$ 291849405 292287230 292723954 293285757 293951720 294663221 295368999 296137750 297026843 297976822 298870921
3469.3B98870921Q18610R05603J052261J058966J054078J143754J149743J152426J279474
$$ 298870921 299689531 300595134 301647395 302706361 303760439 304904193 306053936 307206362 308485836
3487.6C08485836J337915J273871J270592J386911J386106J308441J515657J663863
$$ 308485836 309823751 311097622 312368214 313755125 315141231 316449672 317965329 319629192
3504C19629192J386077J352787J662522J748502J646966J590699J572847J562596J699537
$$ 319629192 321015269 322368056 324030578 325779080 327426046 329016745 330589592 332152188 333851725
3522.3C33851725J848578J909763K080947K108514J878053J887828K110631K051145
$$ 333851725 335700303 337610066 339691013 341799527 343677580 345565408 347676039 349727184
3538.6C49727184J853704J944482K402276K621740K147615K033741K530395K472222
$$ 349727184 351580888 353525370 355927646 358549386 360697001 362730742 365261137 367733359
3554.9C67733359K116293K187491K156168J699656K235144M056603M025787K478898
$$ 367733359 369849652 372037143 374193311 375892967 378128111 382184714 386210501 388689399
3571.3C88689399K187997K609134K788245K863735K580106J970321K591163M485309
$$ 388689399 390877396 393486530 396274775 399138510 401718616 403688937 406280100 410765409
3587.6D10765409M023821K169758K546847L510296L318608L272205L240735K304822
$$ 410765409 414789230 416958988 419505835 423016131 426334739 429606944 432847679 435152501
3603.9D35152501K103031L476291L901750L226131K745599K112269L413380N014598
$$ 435152501 437255532 440731823 444633573 447859704 450605303 452717572 456130952 461145550
3620.2D61145550L050655N42492J041740N782485P066637K768100J857936K540350
$$ 461145550 464196205 464738697 465780437 471562922 478629559 481397659 483255595 485795945
3636.5D85795945K497315K395451J460761J31071J354843O018639O569534J414836
$$ 485795945 488293260 490688711 492149472 492280543 493635386 499654025 506223559 507638395
3652.8E07638395O07371L272712K559007J001119R05514m2558l93271K429068K869725
$$ 507638395 508245766 511518478 514077485 515078604 515984118 515941560 515548289 517977357 520847082
3671.2E20847082L25799L488600M575372N17070n77330j074553j688540P26164M150152
$$ 520847082 521172881 524661481 529236853 529753923 529176593 528102040 526413500 527139664 531289816
3689.6E31289816K516746n01096r27448m89473M74214K183974J484632j003503j156748
$$ 531289816 533806562 533305466 532378018 531888545 532362759 534546733 536031365 535027862 533871114
3707.9E33871114J586497M119933J683891j421512j395285k80857M12762P02024N61237
$$ 533871114 535457611 539577544 541261435 539839923 538444638 538163781 538576543 539278567 539839804
3726.3E39839804j065075k116025m45246K503812L455639j05977m106760j980067L793836
$$ 539839804 538774729 536658704 536213458 538717270 542172909 542066932 537960172 535980105 539773941
3744.6E39773941J181185j673639K988637L245711j421153j945436O61969Q87096j031757
$$ 539773941 540955126 539281487 542270124 545515835 544094682 542149246 542811215 543698311 542666554
3763E42666554q37147J29104J160860J476228m79758j687824o04868J164734O73592
$$ 542666554 541829407 541958511 543119371 544595599 544115841 542428017 541823149 542987883 543661475
3781.3E43661475n05507L8386K23517k54989q23915j235366n82695p94529k52665K453566
$$ 543661475 543155968 543194354 543417871 543162882 542338967 541103601 540520906 539726377 539473712 541927278
3801.7E41927278O06835m35710J695693n61595l338933j887858J192629J89900N24938
$$ 541927278 542534113 542098403 543794096 543232501 539893568 538005710 539198339 539388239 539913177
3820.1E39913177K851010j19925j629591r79781r94325p18891r37283K62618K508759
$$ 539913177 542764187 542644262 541014671 540034890 539040565 538321674 537384391 537647009 540155768
3838.4E40155768J458824p6234l79205j982987m197061l452480M205465P897795m87030
$$ 540155768 541614592 541538358 541159153 539176166 534979105 531526625 535732090 543629885 543142855
3856.8E43142855m120886k427578P0929O52552j023054J64807J986980N14686p41958
$$ 543142855 539021969 536594391 536665320 537317872 536294818 536459625 538446605 538961291 538219333
3875.2E38219333j888335q80957O62923j98126Q31187K67148j354992O61909N54622
$$ 538219333 536330998 535450041 536112964 535914838 536746025 537013173 535658181 536320090 536874712
3893.5E36874712k253235k161801K0921J475812K176463J279414q65817j425267j070916
$$ 536874712 534621477 532459676 532480597 533956409 536132872 537412286 536546469 535121202 534050286
3911.9E34050286j084447j84715R55522K88665o90221j68860M4584q13901m26889Q28445
$$ 534050286 532965839 532781124 533736646 534025311 533335090 533166230 533210814 532396913 531970024 532798469
3932.3E32798469M81665o17146r16839n64396J77800N0783m95076K3842L25263j43647
$$ 532798469 533280134 532662988 531746149 531181753 531359553 531410336 530915260 530939102 531264365 531120718
3952.7E31120718l69013k80857k15769j27196q3387k15650k86817k40147j97888r7155
$$ 531120718 530751705 530470848 530255079 530127883 530044496 529828846 529542029 529301882 529103994 529006839
3973.1E29006839K9444n0306k17140j93595j29998k26617k76327j22309l3736r5546
$$ 529006839 529036283 528985977 528768837 528575242 528445244 528218627 527942300 527819991 527786255 527690709
3993.4E27690709j24932j76906
$$ 527690709 527565777 527388871
3997.5E27388871
$$ 527388871
##END=$$ End of the data block
