##TITLE=$$ Begin of the data block
##JCAMP-DX=5.00 $$ ACD/SpecManager v 10.08
##SPECTROMETER/DATA SYSTEM=Alpha
##DATE=11 Jun 2014 19:36:16
##DATA TYPE=INFRARED SPECTRUM
##DATA CLASS=XYDATA
##ORIGIN=
##OWNER=
##NPOINTS=1765
##FIRSTX=399.75695801
##LASTX=3997.56933594
##MAXX=3997.56933594
##MINX=399.75695801
##MAXY=0.79266346
##MINY=0.13817033
##XFACTOR=1.0000000000
##YFACTOR=1.000000000000000e-9
##FIRSTY=0.44928962
##DELTAX=2.03957629
##XUNITS=1/CM
##YUNITS=ARBITRARY UNITS
##XYDATA=(X++(Y..Y))
$$ plain form
399.8 449289620 449439406 449304461 448189318 447004199 446546644 446524352 446100622 444774747 443249851
418.1 443249851 442450434 441707671 440787315 440100819 439099014 437548846 436316788 435842931 435444236
436.5 435444236 434467196 433299124 432618231 432264507 431573093 430421621 429189295 428003311 426456183
454.8 426456183 424415618 422489405 420804262 418658733 416189849 414214849 412751883 411361158
471.1 411361158 410325736 410145015 410436630 410630226 410693437 410894901 411241204 411339730 411160976 411059350
491.5 411059350 411032826 410772800 410173178 409471810 408821195 407916158 406609178 405316561 404151827
509.9 404151827 402677566 400891602 399212956 397625148 395740241 393525213 391486615 390036881
526.2 390036881 388896048 387647599 386630744 386188805 385864228 385480344 385488033 385811627 385793984 385294646
$$ packed form
399.8D49289620J49786j34945j115143j185119m57555k2292m23730j325875j524896
418.1D43249851p99417p42763r20356o86496j001805j550168j232058m73857l98695
436.5D35444236r77040j168072o80893l53724o91414j151472j232326j185984j547128
454.8D26456183k040565j926213j685143k145529k468884j975000j462966j390725
471.1D11361158j035422j80721K91615J93596O3211K01464L46303R8526j78754j01626
491.5D11059350k6524k60026n99622p01368o50615r05037j306980j292617j164734
509.9D04151827j474261j785964j678646j587808j884907k215028k038598j449734
526.2C90036881j140833j248449j016855m41939l24577l83884P689L23594j7643m99338
$$ plain form
546.6 385294646 384801447 384542495 384106100 383217126 382330149 381603688 380538613 378994644 377312511
565 377312511 375425369 372794837 369425476 366183937 363581449 361249208 359113663 357884437 358111501
583.3 358111501 359140098 360024184 360883892 362009436 362636119 362196714 361385345 360734820 359780759
601.7 359780759 358229965 356766462 355998397 355818659 356190741 357684255 360623807 364511579 368672162
620 368672162 373034537 377810001 382513911 386552483 390284985 394339949 398382515 401728213 404630721
638.4 404630721 407753468 410744041 412948221 414733648 416719586 418606907 419833571 420881689
654.7 420881689 422373444 423952639 425027400 425888568 426828742 427271396 427606046 429026872 431039721
673.1 431039721 433203936 435048908 436616093 438490599 440506458 441996753 443124652 444469661
$$ packed form
546.6C85294646m93199k58952m36395q88974q86977p26461j065075j543969j682133
565C77312511j887142k630532l369361l241539k602488k332241k135545j229226K27064
583.3C58111501J028597Q84086Q59708J125544O26683m39405q11369o50525r54061
601.7C59780759j550794j463503p68065j79738L72082J493514K939552L887772M160583
620C68672162M362375M775464M703910M038572L732502M054964M042566L345698K902508
638.4D04630721L122747K990573K204180J785427J985938J887321J226664J048118
654.7D20881689J491755J579195J074761Q61168R40174M42654L34650J420826K012849
673.1D31039721K164215J844972J567185J874506K015859J490295J127899J345009
$$ plain form
689.4 444469661 445787936 446301460 445814192 444895893 444957405 446861535 449424624 451384157 452286959
707.7 452286959 451376438 450056285 452157676 457673430 462822169 466710955 471060067 476174474 481129825
726.1 481129825 485552073 489821315 493935496 497242481 499612331 501710892 503954947 506105483
742.4 506105483 508048952 510052800 512059331 513450801 513869524 513589621 512860179 511414647 508989990
760.8 508989990 506072581 503628194 502503514 503355145 506583333 511713684 517231107 521603048 524470210
779.1 524470210 526391566 527697921 528421044 528709590 528552651 527556002 525448799 522382200 518656254
797.5 518656254 514224589 508733749 502104282 494752765 487329662 480367124 474537879 470950782
813.8 470950782 470688552 474141598 480996132 490829289 503170073 516853511 530026674 541230679
$$ packed form
689.4D44469661J318275N13524m87268r18299O1512J904130K563089J959533R02802
707.7D52286959r10521j320153K101391N515754N148739L888786M349112N114407M955351
726.1D81129825M422248M269242M114181L306985K369850K098561K244055K150536
742.4E06105483J943469K003848K006531J391470M18723k79903p29442j445532k424657
760.8E08989990k917409k444387j124680Q51631L228188N130351N517423M371941K867162
779.1E24470210J921356J306355P23123K88546j56939r96649k107203l066599l725946
797.5E18656254m431665n490840o629467p351517p423103o962538n829245l587097
813.8D70950782k62230L453046O854534R833157J2340784J3683438J3173163J1204005
$$ plain form
830.1 541230679 549948812 556081593 559637725 560899675 560201347 558397532 556807280 555441320 553618908
848.5 553618908 550530910 545542479 541605234 542845547 548065364 552433491 553059220 549896777 543316662
866.8 543316662 533061624 520902693 511756599 509250760 513946176 525314093 540540338 554814994
883.1 554814994 565095782 571201801 574352145 575728118 575893283 575489640 575615704 576855421 578721702
901.5 578721702 580527067 581989467 582713664 581812382 578773499 574364364 569765687 565335453 560968161
919.8 560968161 556856215 553076625 548957825 543753505 537725985 531709909 526108146 521180630
936.2 521180630 517611921 515946746 515932977 516995907 518994689 521842718 524542332 525701940 524875343
954.5 524875343 522486329 518888474 514313757 509299755 504147530 498234361 490635097 481178999
$$ packed form
830.1E41230679Q718133O132781L556132J261950o98328j803815j590252j365960j822412
848.5E53618908l087998m988431l937245J240313N219817M368127O25729l162443o580115
866.8E43316662j0255038j2158931r146094k505839M695416J1367917J5226245J4274656
883.1E54814994J0280788O106019L150344J375973J65165m03643J26064J239717J866281
901.5E78721702J805365J462400P24197r01282l038883m409135m598677m430234m367292
919.8E60968161m111946l779590m118800n204320o027520o016076n601763m927516
936.2E21180630l568709j665175j3769J062930J998782K848029K699614J159608q26597
954.5E24875343k389014l597855m574717n014002n152225n913169p599264r456098
$$ plain form
970.8 481178999 470300168 458167166 444696009 430164427 415150136 399938971 384470701
985.1 384470701 368858665 353413850 338232249 323238999 308580428 294648796 281691670
999.4 281691670 269747406 258904457 249257565 240637153 232606396 224902049 217626140 210775793
1015.7 210775793 204211146 198100716 192893371 188968733 186454311 185377121 185810983 187742606
1032 187742606 190879881 194731236 198899299 203192726 207412213 211224258 214291930 216421798 217588693
1050.4 217588693 217944190 217924029 218104333 218799114 219939679 221257195 222393841 222927257 222446159
1068.7 222446159 220758215 218149871 215383157 213285848 212231681 212404102 214336812 217960626
1085 217960626 222178459 226415813 230915710 235821620 241016418 246430859 252140611 258026242 263776213
$$ packed form
970.8D81178999j0878831j2133002j3471157j4531582j5014291j5211165j5468270
985.1C84470701j5612036j5444815j5181601j4993250j4658571j3931632j2957126
999.4B81691670j1944264j0842949r646892q620412q030757p704347p275909o850347
1015.7B10775793o564647o110430n207345l924638k514422j077190M33862J931623
1032A87742606L137275L851355M168063M293427M219487L812045L067672K129868J166895
1050.4B17588693L55497k0161J80304O94781J140565J317516J136646N33416m81098
1068.7B22446159j687944k608344k766714k097309j054167J72421J932710L623814
1085B17960626M217833M237354M499897M905910N194798N414441N709752N885631N749971
$$ plain form
1103.4 263776213 269204229 274294078 279017121 283317238 287289888 291147232 294983566 298761994
1119.7 298761994 302560031 306597382 310866624 314821512 317686290 318767190 317546368 314037085
1136 314037085 308960646 303436041 298494309 294787556 292575419 291996211 293231636 296280146 300940365
1154.4 300940365 307026744 314274043 322212785 330437362 338927031 347825497 357033193 366346836
1170.7 366346836 375778496 385413706 395056903 404318094 412901938 420599490 427028388 431606889
1187 431606889 434007525 434343547 432694614 428924859 423234582 416332006 408864051 401115477 393352211
1205.4 393352211 385955900 379072905 372523367 366187900 360180616 354603261 349402040 344495386
1221.7 344495386 340014756 336175591 332922518 330063969 327621758 325756073 324413568 323358774
$$ packed form
1103.4B63776213N428016N089849M723043M300117L972650L857344L836334L778428
1119.7B98761994L798037M037351M269242L954888K864778J080900j220822l509283
1136C14037085n076439n524605m941732l706753k212137n79208J235425L048510M660219
1154.4C00940365O086379P247299P938742Q224577Q489669Q898466R207696R313643
1170.7C66346836R431660R635210R643197R261191Q583844P697552O428898M578501
1187D31606889K400636L36022j648933l769755n690277o902576p467955p748574p763266
1205.4C93352211p396311o882995o549538o335467o007284n577355n201221m906654
1221.7C44495386m480630l839165l253073k858549k442211j865685j342505j054794
$$ plain form
1238 323358774 322534710 322049975 321819454 321613550 321437359 321474969 321721494 322033495 322503209 323439777
1258.4 323439777 325023055 327196717 329942733 333417058 337659091 342491090 347795844 353616476
1274.7 353616476 359962761 366651088 373461813 380394220 387471616 394454896 401022643 407132536
1291 407132536 412832737 417919427 422231019 426057249 429795325 433400154 436611772 439472258 442155570
1309.4 442155570 444442987 446023256 446945131 447501689 447914541 448251009 448574662 448966354 449300289
1327.8 449300289 449252218 448805332 448206455 447485507 446455956 445360065 444709301 444393337 444008917
1346.1 444008917 443468362 442867696 441940188 440168351 437404484 433954597 429823130 424820244 419567078
1364.5 419567078 414660692 409920484 405281126 400465101 395479411 391261697 387991786 385295093
$$ packed form
1238C23358774q24064m84735k30521k05904j76191L7610K46525L12001M69714R36568
1258.4C23439777J583278K173662K746016L474325M242033M831999N304754N820632
1274.7C53616476O346285O688327O810725O932407P077396O983280O567747O109893
1291D07132536N700201N086690M311592L826230L738076L604829L211618K860486K683312
1309.4D42155570K287417J580269R21875N56558M12852L36468L23653L91692L33935
1327.8D49300289m8071m46886n98877p20948j029551j095891o50764l15964l84420
1346.1D44008917n40555o00666r27508j771837k763867l449887m131467n002886n253166
1364.5D19567078m906386m740208m639358m816025m985690m217714l269911k696693
$$ plain form
1380.8 385295093 383161128 381605208 380323499 378975719 377334118 374807835 371011496 366333246
1397.1 366333246 361007154 355516255 349886179 343558878 337300122 331655949 326463580 321904480
1413.4 321904480 318135828 314984083 312709630 311900467 312080950 312772423 313633740 314315557 314851791
1431.8 314851791 315329611 315656364 316066146 316574544 316880196 316909671 316663265 316183090 315759391 315451950
1452.2 315451950 315226465 315600425 317689121 320692539 323225409 325350463 327983558 331877500 337630749
1470.5 337630749 346340567 356576383 366018474 374444455 381905705 388348162 393423915 397165537
1486.8 397165537 399849981 401809156 403063208 403314531 402624637 401722521 400893629 399566025 396355808
1505.2 396355808 390652865 386097997 382517636 378330439 373988926 370623291 368720859 367283732
$$ packed form
1380.8C85295093k133965j555920j281709j347780j641601k526283l796339m678250
1397.1C66333246n326092n490899n630076o327301o258756n644173n192369m559100
1413.4C21904480l768652l151745k274453q09163J80483O91473Q61317O81817N36234
1431.8C14851791M77820L26753M09782N08398L05652K9475k46406m80175m23699l07441
1452.2C15451950k25485L73960K088696L003418K532870K125054K633095L893942N753249
1470.5C37630749Q709818J0235816R442091Q425981P461250O442457N075753L741622
1486.8C97165537K684444J959175J254052K51323o89894r02116q28892j327604l210217
1505.2C96355808n702943m554868l580361m187197m341513l365635j902432j437127
$$ plain form
1521.5 367283732 366002113 364802778 363379538 361855030 359683126 356609255 354067028 352161646
1537.8 352161646 350481719 351259887 354750514 359232754 363782972 368519694 373604596 378850967
1554.1 378850967 383726031 389243096 396525919 402312785 406665355 410261184 413036793 415367067
1570.5 415367067 417092323 418068379 419401258 422220647 425662428 428702682 430903494 432032794
1586.8 432032794 431868404 430268437 427480817 423811078 419408917 414160460 407951891 401042432
1603.1 401042432 393573552 385321379 376205683 366932988 357919693 347647160 335568964 325722754
1619.4 325722754 317234248 307490379 298240066 290295571 283320397 277904302 273215353 268205196
1635.7 268205196 264720380 262989253 261777192 260792881 260003716 259942830 260630250 261506140 263419092
$$ packed form
1521.5C67283732j281619j199335j423240j524508k171904l073871k542227j905382
1537.8C52161646j679927P78168L490627M482240M550218M736722N084902N246371
1554.1C78850967M875064N517065P282823N786866M352570L595829K775609K330274
1570.5D15367067J725256R76056J332879K819389L441781L040254K200812J129300
1586.8D32032794j64390j599967k787620l669739m402161n248457o208569o909459
1603.1D01042432p468880q252173r115696r272695r013295j0272533j2078196r846210
1619.4C25722754q488506r743869r250313p944495o975174n416095m688949n010157
1635.7B68205196l484816j731127j212061r84311p89165o0886O87420Q75890J912952
$$ plain form
1654.1 263419092 266578197 270059019 274144739 279410541 285707951 291900218 298676819 306897670
1670.4 306897670 315121144 323818475 333527595 342810243 351519495 361131072 373958528 386891037
1686.7 386891037 398483932 410593867 422232747 435119689 450150371 466357440 485574543
1701 485574543 502307653 516505063 530718684 543008685 553282917 562114596 570043087 578328431
1717.3 578328431 586637437 593579710 599456728 604686677 609103799 612880945 616019607 619124770
1733.6 619124770 622980118 626949251 631269038 636449814 642229140 648308873 654592931 661442637
1749.9 661442637 668734074 675172210 680749118 685903490 690373302 694525719 698456109 701682270
1766.3 701682270 704147041 706139684 708279133 710742712 712601066 713594139 714375496 715392530 716375053
$$ packed form
1654.1B63419092L159105L480822M085720N265802O297410O192267O776601Q220851
1670.4C06897670Q223474Q697331R709120R282648Q709252R611577J2827456J2932509
1686.7C86891037J1592895J2109935J1638880J2886942J5030682J6207069J9217103
1701D85574543J6733110J4197410J4213621J2290001J0274232Q831679P928491Q285344
1717.3E78328431Q309006O942273N877018N229949M417122L777146L138662L105163
1733.6F19124770L855348L969133M319787N180776N779326O079733O284058O849706
1749.9F61442637P291437O438136N576908N154372M469812M152417L930390L226161
1766.3G01682270K464771J992643K139449K463579J858354R93073P81357J017034R82523
$$ plain form
1784.6 716375053 717284262 718296111 719368339 720925093 722982705 724932253 726681828 728599012
1800.9 728599012 730779231 732951939 734921992 736616254 738247454 740047634 741899431 743557334
1817.2 743557334 744988561 746192098 747197628 748210490 749160409 750066519 751511693 753182292 754313886
1835.6 754313886 755139351 756030262 756662130 756986320 757818878 759176850 760434508 761361003 762028933
1854 762028933 762732267 763506293 764177442 764721453 765186369 765430689 765563607 766160846 767160952 768036067
1874.4 768036067 768619359 769028366 769446731 769945383 770376742 770578921 770674944 771088183 771712005 772097766
1894.7 772097766 772420883 772928476 773430645 773716152 773907602 774188042 774521530 774827063 775099576 775313437
1915.1 775313437 775433421 775588632 775790155 776105464 776592016 776893020 776943564 777073562 777328849 777457297
$$ packed form
1784.6G16375053R09209J011849J072228J556754K057612J949548J749575J917184
1800.9G28599012K180219K172708J970053J694262J631200J800180J851797J657903
1817.2G43557334J431227J203537J005530J012862R49919R06110J445174J670599J131594
1835.6G54313886Q25465Q90911O31868L24190Q32558J357972J257658R26495O67930
1854G62028933P03334P74026O71149N44011M64916K44320J32918N97239J000106Q75115
1874.4G68036067N83292M09007M18365M98652M31359K02179R6023M13239O23822L85761
1894.7G72097766L23117N07593N02169K85507J91450K80440L33488L05533K72513K13861
1915.1G75313437J19984J55211K01523L15309M86552L01004N0544J29998K55287J28448
$$ plain form
1935.5 777457297 777396500 777282238 777194977 777220607 777346551 777489781 777655005 777726948 777611136 777522683
1955.9 777522683 777606487 777666926 777567208 777450264 777446985 777542353 777594268 777590692 777690411 777805209 777745008
1978.4 777745008 777615488 777634680 777727902 777664721 777443588 777290523 777328134 777375579 777284145 777206957 777213991
2000.8 777213991 777097285 776836634 776634097 776524842 776324987 775967538 775630414 775447786 775283337 774972498
2021.2 774972498 774683356 774547517 774345875 773969054 773655534 773524821 773398101 773121059 772801399 772659123
2041.6 772659123 772629499 772483766 772284508 772259712 772325099 772260070 772138357 772175670 772308946 772294402 772174418
2064 772174418 772218943 772413313 772468209 772390723 772439420 772622526 772695839 772643983 772718847 772933125 773029149
2086.5 773029149 772966385 773002505 773188889 773283064 773221314 773266494 773497343 773646832 773613274 773607492 773739517
$$ packed form
1935.5G77457297o0797j14262q7261K5630J25944J43230J65224P1943j15812q8453
1955.9G77522683Q3804O0439r9718j16944l279R5368N1915l576R9719J14798o0201
1978.4G77745008j29520J9192R3222o3181k21133j53065L7611M7445r1434p7188P034
2000.8G77213991j16706k60651k02537j09255j99855l57449l37124j82628j64449l10839
2021.2G74972498k89142j35839k01642l76821l13520j30713j26720k77042l19660j42276
2041.6G72659123k9624j45733j99258k4796O5387o5029j21713L7313J33276j4544j19984
2064G72174418M4525J94370N4896p7486M8697J83106P3313n1856P4864K14278R6024
2086.5G73029149o2764L6120J86384R4175o1750M5180K30849J49489l3558n782J32025
$$ plain form
2108.9 773739517 773839116 773814321 773847520 774073184 774300039 774343014 774352908 774523258 774725139 774745822 774721324
2131.3 774721324 774879754 775090039 775117338 775098979 775251806 775461197 775520921 775500119 775624454 775861382
2151.7 775861382 776009262 776093543 776298642 776599586 776808619 776941419 777181327 777533472 777841210 778078139
2172.1 778078139 778361797 778715789 778991580 779146552 779374123 779760659 780105054 780310392 780569673 780957103
2192.5 780957103 781287909 781474710 781673968 782009184 782362044 782591283 782805204 783145249 783512533 783778965
2212.9 783778965 784019709 784339964 784661651 784873188 785054207 785336614 785653591 785867870 785992563 786148906
2233.3 786148906 786368906 786562324 786705017 786861062 787043273 787163496 787197769 787271917 787442267 787582278
2253.7 787582278 787618876 787663460 787791550 787934482 787993610 788005531 788078129 788182735 788244009 788328648 788496673
$$ packed form
2108.9G73739517R9599k4795L3199K25664K26855M2975R894J70350K01881K0683k4498
2131.3G74721324J58430K10285K7299j8359J52827K09391N9724k0802J24335K36928
2151.7G75861382J47880Q4281K05099L00944K09033J32800K39908L52145L07738K36929
2172.1G78078139K83658L53992K75791J54972K27571L86536L44395K05338K59281L87430
2192.5G80957103L30806J86801J99258L35216L52860K29239K13921L40045L67284K66432
2212.9G83778965K40744L20255L21687K11537J81019K82407L16977K14279J24693J56343
2233.3G86148906K20000J93418J42693J56045J82211J20223L4273P4148J70350J40011
2253.7G87582278L6598M4584J28090J42932N9128J1921P2598J04606O1274Q4639J68025
$$ plain form
2276.1 788496673 788628638 788689315 788785219 788905919 788930655 788815796 788657427 788562775 788481295 788301229
2296.5 788301229 788059533 787858069 787705362 787461400 787040830 786582768 786230206 785944104 785598516 785123289
2316.9 785123289 784516215 783850253 783263981 782866836 782583416 782257617 781938732 781786501 781738520 781617820
2337.3 781617820 781376302 781225860 781577408 782628417 783869982 784366131 783662677 782126129 780598879
2355.7 780598879 779565394 779167831 779311121 779787958 780639589 781948924 783444405 784797013 786049247
2374 786049247 787401497 788802922 790040076 791040242 791846633 792415500 792663455 792650342 792559028 792483151
2394.4 792483151 792366385 792168438 792011142 791971266 791872799 791616023 791354001 791176438 790993512 790748060
2414.8 790748060 790503919 790310562 790067792 789702475 789334118 789051533 788794994 788483560 788149059 787874281
$$ packed form
2276.1G88496673J31965O0677R5904J20700K4736j14859j58369r4652q1480j80066
2296.5G88301229k41696k01464j52707k43962m20570m58062l52562k86102l45588m75227
2316.9G85123289o07074o65962n86272l97145k83420l25799l18885j52231m7981j20700
2337.3G81617820k41518j50442L51548J051009J241565M96149p03454j536548j527250
2355.7G80598879j033485l97563J43290M76837Q51631J309335J495481J352608J252234
2374G86049247J352250J401425J237154J000166Q06391N68867K47955j3113r1314p5877
2394.4G92483151j16766j97947j57296l9876r8467k56776k62022j77563j82926k45452
2414.8G90748060k44141j93357k42770l65317l68357k82585k56539l11434l34501k74778
$$ plain form
2435.2 787874281 787608325 787223399 786755085 786362052 786039948 785645723 785178065 784751236 784360230 783889949
2455.6 783889949 783319890 782784700 782321453 781788528 781163931 780569553 780005336 779335618 778537095 777730107
2476 777730107 776953280 776137590 775294125 774495900 773737788 772963405 772145212 771327913 770596445 769958615
2496.4 769958615 769354105 768789768 768298090 767855346 767429233 766976655 766438007 765777528 765006721 764215827
2516.8 764215827 763565183 763116539 762778640 762517631 762384832 762353718 762338400 762339592 762403727 762476802 762415826
2539.2 762415826 762150347 761787713 761479080 761256397 761089027 760978580 760900080 760770977 760552824 760295272
2559.6 760295272 760049880 759808064 759540498 759239078 758942783 758663058 758314133 757878065 757445991 757022202
2580 757022202 756527185 755988777 755505800 755086243 754669130 754191220 753653526 753121734 752591550 752009451
$$ packed form
2435.2G87874281k65956l84926m68314l93033l22104l94225m67658m26829l91006m70281
2455.6G83889949n70059n35190m63247n32925o24597n94378n64217o69718p98523q06988
2476G77730107p76827q15690q43465p98225p58112p74383q18193q17299p31468o37830
2496.4G69958615o04510n64337m91678m42744m26113m52578n38648o60479p70807p90894
2516.8G64215827o50644m48644l37899k61009j32799l1114j5318J192O4135P3075o0976
2539.2G62415826k65479l62634l08633k22683j67370j10447p8500j29103k18153k57552
2559.6G60295272k45392k41816k67566l01420k96295k79725l48925m36068m32074m23789
2580G57022202m95017n38408m82977m19557m17113m77910n37694n31792n30184n82099
$$ plain form
2600.4 752009451 751399040 750795245 750166714 749499738 748823941 748174369 747525394 746800780 746017873 745243967
2620.8 745243967 744467378 743662238 742865801 742103219 741334021 740521193 739693344 738919795 738198936 737441897
2641.2 737441897 736636817 735865295 735148489 734424710 733656824 732913375 732233584 731517673 730731905 730011940
2661.6 730011940 729405999 728764594 728028476 727307975 726667345 726046920 725383520 724709809 724086821 723493516
2682 723493516 722852230 722201884 721635699 721079588 720414460 719673455 718924224 718151152 717327476 716473341
2702.4 716473341 715629935 714781880 713847995 712819159 711799204 710814357 709773779 708669543 707594514
2720.8 707594514 706569552 705532610 704488099 703517437 702639997 701781869 700911283 700088441 699330509
2739.1 699330509 698550284 697710156 696873486 696058512 695235431 694379866 693489015 692621768 691761315 690797865
$$ packed form
2600.4G52009451o10411o03795o28531o66976o75797o49572o48975p24614p82907p73906
2620.8G45243967p76589q05140p96437p62582p69198q12828q27849p73549p20859p57039
2641.2G37441897q05080p71522p16806p23779p67886p43449o79791p15911p85768p19965
2661.6G30011940o05941o41405p36118p20501o40630o20425o63400o73711o22988n93305
2682G23493516o41286o50346n66185n56111o65128p41005p49231p73072q23676q54135
2702.4G16473341q43406q48055r33885j028836j019955r84847j040578j104236j075029
2720.8G07594514j024962j036942j044511r70662q77440q58128q70586q22842p57932
2739.1F99330509p80225q40128q36670q14974q23081q55565q90851q67247q60453r63450
$$ plain form
2759.5 690797865 689769030 688778281 687791467 686751306 685700119 684673190 683626115 682511747 681306362
2777.9 681306362 680050015 678794086 677489638 676085889 674629450 673161328 671618700 669943213
2794.2 669943213 668202996 666451156 664619088 662681520 660686970 658614576 656412423 654103935
2810.5 654103935 651710868 649218678 646588326 643732727 640672743 637485147 634104013 630433619
2826.8 630433619 626477003 622199893 617373645 611658394 604715407 596092939 585055590 570824981
2843.1 570824981 553355098 534628332 519162714 511245966 511184692 515769482 521596551 526678801
2859.5 526678801 530102134 531438768 530624866 528028071 524396300 520691097 517651021 515377581
2875.8 515377581 513482988 511566281 509355247 506682396 503578782 500206769 496682853 493023336
$$ packed form
2759.5F90797865j028835r90749r86814j040161j051187j026929j047075j114368j205385
2777.9F81306362j256347j255929j304448j403749j456439j468122j542628j675487
2794.2F69943213j740217j751840j832068j937568j994550k072394k202153k308488
2810.5F54103935k393067k492190k630352k855599l059984l187596l381134l670394
2826.8F30433619l956616m277110m826248n715251o942987q622468j1037349j4230609
2843.1E70824981j7469883j8726766j5465618p916748o1274M584790N827069N082250
2859.5E26678801L423333J336634q13902k596795l631771l705203l040076k273440
2875.8E15377581j894593j916707k211034k672851l103614l372013l523916l659517
$$ plain form
2892.1 493023336 489260733 485488743 481691927 477703869 473313808 468246818 462051570 454102695
2908.4 454102695 443807721 431078881 417096406 404336661 395105273 390172958 388975322 390549839
2924.7 390549839 394027919 398737133 404315203 410619259 417525917 424909383 432533294 439988166
2941 439988166 446837366 452673882 457158506 460123330 461694241 462448806 463281095 464936882 467741489
2959.4 467741489 471710503 476751000 482722014 489367157 496321648 503279150 510078788 516602874
2975.7 516602874 522746384 528478026 533792436 538660347 543002427 546746016 549932241 552632749
2992 552632749 554806530 556316018 557132125 557371557 557084084 556296647 555197716 554018438 552900016
3010.4 552900016 551953197 551222622 550626040 550015092 549205959 548026025 546448708 544578612 542525530
$$ packed form
2892.1D93023336l762603l771990l796816l988058m390061n066990o195248p948875
2908.4D54102695j0294974j2728840j3982475j2759745r231388m932315j197636J574517
2924.7C90549839L478080M709214N578070O304056O906658P383466P623911P454872
2941D39988166O849200N836516M484624K964824J570911P54565Q32289J655787K804607
2959.4D67741489L969014N040497N971014O645143O954491O957502O799638O524086
2975.7E16602874O143510N731642N314410M867911M342080L743589L186225K700508
2992E52632749K173781J509488Q16107K39432k87473p87437j098931j179278j118422
3010.4E52900016r46819p30575n96582o10948q09133j179934j577317j870096k053082
$$ plain form
3028.7 542525530 540394306 538258970 536087811 533802032 531384349 528870463 526284277 523639083
3045.1 523639083 520937443 518193603 515458226 512719393 509926081 507139027 504436910 501797020
3061.4 501797020 499181658 496605456 494162828 491881460 489629090 487358987 485126704 482900918
3077.7 482900918 480613500 478262097 475906253 473604500 471357733 469142765 466918886 464599520
3094 464599520 462174088 459739298 457307458 454780549 452138394 449448854 446726859 443949848 441119641
3112.4 441119641 438234091 435292006 432289183 429179043 425951928 422682732 419398069 416076899
3128.7 416076899 412712038 409264803 405751079 402229160 398698002 395145118 391572207 387957036
3145 387957036 384288758 380619109 376958042 373247683 369497538 365768939 362055153 358324111 354569227
$$ packed form
3028.7E42525530k131224k135336k171159k285779k417683k513886k586186k645194
3045.1E23639083k701640k743840k735377k738833k793312k787054k702117k639890
3061.4E01797020k615362k576202k442628k281368k252370k270103k232283k225786
3077.7D82900918k287418k351403k355844k301753k246767k214968k223879k319366
3094D64599520k425432k434790k431840k526909k642155k689540k721995k777011k830207
3112.4D41119641k885550k942085l002823l110140l227115l269196l284663l321170
3128.7D16076899l364861l447235l513724l521919l531158l552884l572911l615171
3145C87957036l668278l669649l661067l710359l750145l728599l713786l731042l754884
$$ plain form
3163.4 354569227 350811929 347082466 343380213 339697748 336032987 332398176 328792423 325202733
3179.7 325202733 321632117 318107039 314637572 311225146 307877898 304539114 301193446 297906548
3196 297906548 294676036 291477472 288345456 285280079 282250941 279228926 276242077 273348480 270520031
3214.3 270520031 267727166 264951736 262198508 259482145 256773114 254085958 251471728 248936892
3230.7 248936892 246431991 243898362 241363004 238895804 236492351 234111622 231750503 229439199
3247 229439199 227190211 225002080 222832903 220639020 218482837 216409251 214355767 212296724 210280910
3265.3 210280910 208372474 206583023 204818323 203055620 201371893 199753851 198156506 196610376
3281.6 196610376 195142582 193752065 192441210 191167399 189888760 188649222 187463596 186298132
$$ packed form
3163.4C54569227l757298l729463l702253l682465l664761l634811l605753l589690
3179.7C25202733l570616l525078l469467l412426l347248l338784l345668l286898
3196B97906548l230512l198564l132016l065377l029138l022015k986849k893597k828449
3214.3B70520031k792865k775430k753228k716363k709031k687156k614230k534836
3230.7B48936892k504901k533629k535358k467200k403453k380729k361119k311304
3247B29439199k248988k188131k169177k193883k156183k073586k053484k059043k015814
3265.3B10280910j908436j789451j764700j762703j683727j618042j597345j546130
3281.6A96610376j467794j390517j310855j273811j278639j239538j185626j165464
$$ plain form
3298 186298132 185183987 184118435 183057725 181986675 180874914 179729745 178601235 177503407 176422179
3316.3 176422179 175348431 174283564 173223674 172142252 171019688 169890583 168802828 167741209
3332.6 167741209 166680962 165616602 164540887 163423046 162274525 161149040 160025716 158910975
3348.9 158910975 157812506 156680420 155516207 154392257 153361157 152369514 151365280 150385827 149416253
3367.3 149416253 148374051 147269905 146228835 145348907 144580632 143820718 143040597 142310426 141714931
3385.7 141714931 141292334 140972868 140569717 140031233 139547870 139297709 139199406 138975739 138571396 138278365
3406.1 138278365 138196066 138177931 138170332 138190523 138262838 138369888 138469845 138637021 139009565 139560252 140133038
3428.5 140133038 140665039 141322449 142120376 142776877 143241003 143766865 144482553 145323873 146214381 147124916
$$ packed form
3298A86298132j114145j065552j060710j071050j111761j145169j128510j097828j081228
3316.3A76422179j073748j064867j059890j081422j122564j129105j087755j061619
3332.6A67741209j060247j064360j075715j117841j148521j125485j123324j114741
3348.9A58910975j098469j132086j164213j123950j031100r91643j004234r79453r69574
3367.3A49416253j042202j104146j041070q79928p68275p59914p80121p30171n95495
3385.7A41714931m22597l19466m03151n38484m83363k50161r8303k23667m04343k93031
3406.1A38278365q2299j8135p599K0191P2315J07050R9957J67176L72544N50687N72786
3428.5A40133038N32001O57410P97927O56501M64126N25862P15688Q41320Q90508R10535
$$ plain form
3448.9 147124916 148149878 149284154 150426015 151618958 152906790 154133424 155314982 156726450
3465.2 156726450 158303112 159682930 160823613 162075356 163627654 165435821 167279124 168945014
3481.5 168945014 170595914 172436193 174307704 176095322 177982315 180008531 182059243 184064835
3497.8 184064835 186118126 188258424 190319806 192336783 194532216 196954072 199573129 202262476
3514.2 202262476 204821005 207315356 209944129 212771311 215554029 218171999 220889926 223896623
3530.5 223896623 227143303 230561838 233975783 237264588 240730435 244498610 248295233 251922578
3546.8 251922578 255575895 259417504 263444453 267635137 271930248 276355445 280832946 285190701
3563.1 285190701 289577633 294519514 299921244 305238664 310450196 315765738 321238220 326894760
$$ packed form
3448.9A47124916J024962J134276J141861J192943J287832J226634J181558J411468
3465.2A56726450J576662J379818J140683J251743J552298J808167J843303J665890
3481.5A68945014J650900J840279J871511J787618J886993K026216K050712K005592
3497.8A84064835K053291K140298K061382K016977K195433K421856K619057K689347
3514.2B02262476K558529K494351K628773K827182K782718K617970K717927L006697
3530.5B23896623L246680L418535L413945L288805L465847L768175L796623L627345
3546.8B51922578L653317L841609M026949M190684M295111M425197M477501M357755
3563.1B85190701M386932M941881N401730N317420N211532N315542N472482N656540
$$ plain form
3579.4 326894760 332696110 338446379 344123483 350018620 356344610 362709671 369013339 375514716
3595.7 375514716 382243425 389058858 395918429 402708024 409338444 416153312 423211336 430255473
3612.1 430255473 437220186 443980813 450792462 458237886 465931684 473207086 480144799 487639070
3628.4 487639070 495997280 504065812 511717916 519125521 526292264 533250153 539869010 545928538
3644.7 545928538 551576853 557773709 564845920 571609318 577807248 584018648 590161324 595832825
3661 595832825 600949466 605565608 609659612 613472998 617550492 621596336 625373960 629508197 633834600
3679.4 633834600 637701333 640960991 643635094 645640016 647150040 649072170 651565671 654024541
3695.7 654024541 656243265 658437371 660931706 663761914 666461408 668561459 670231700 672147691
$$ packed form
3579.4C26894760N801350N750269N677104N895137O325990O365061O303668O501377
3595.7C75514716O728709O815433O859571O789595O630420O814868P058024P044137
3612.1D30255473O964713O760627O811649P445424P693798P275402O937713P494271
3628.4D87639070Q358210Q068532P652104P407605P166743O957889O618857O059528
3644.7E45928538N648315O196856P072211O763398O197930O211400O142676N671501
3661E95832825N116641M616142M094004L813386M077494M045844L777624M134237M326403
3679.4F33834600L866733L259658K674103K004922J510024J922130K493501K458870
3695.7F54024541K218724K194106K494335K830208K699494K100051J670241J915991
$$ plain form
3712 672147691 674589455 676925004 678649604 679860890 680824995 681746185 682833970 684226871 685409963
3730.3 685409963 685905039 686259270 687327087 688942730 690370023 690977395 690955520 691718280 692798674
3748.7 692798674 693355381 694437206 696105599 697349191 698114753 699057281 700138628 700821877 701246083
3767.1 701246083 701757014 702532411 703519583 704315901 704794765 705076337 705488324 706061006 706595719 707237065
3787.5 707237065 707903802 708312333 708406329 708268940 708231568 708297074 708293080 708885729 709650576 710081637
3807.8 710081637 710835814 711691201 711860061 711267114 710930288 710901856 711065054 711942971 712838352 713374496
3828.2 713374496 713611424 713550448 713552296 713440001 713057101 713232219 714022577 714882672 715597272 715886891
3848.6 715886891 715424180 714054167 713416159 714608908 715865076 716232240 716017962 715920568 716147542
$$ packed form
3712F72147691K441764K335549J724600J211286R64105R21190J087785J392901J183092
3730.3F85409963M95076L54231J067817J615643J427293O07372k1875P62760J080394
3748.7F92798674N56707J081825J668393J243592P65562R42528J081347O83249M24206
3767.1G01246083N10931P75397R87172P96318M78864K81572M11987N72682N34713O41346
3787.5G07237065O66737M08531R3996j37389l7372O5506l994N92649P64847M31061
3807.8G10081637P54177Q55387J68860n92947l36826k8432J63198Q77917Q95381N36144
3828.2G13374496K36928o0976J848j12295l82900J75118P90358Q60095P14600K89619
3848.6G15886891m62711j370013o38008J192749J256168L67164k14278r7394K26974
$$ plain form
3867 716147542 716135204 715990782 716283917 716818929 717351735 717392445 717108488 717235267 717397451 717587888
3887.4 717587888 717854559 717793405 717903554 718292832 718163908 717434108 716882110 716892004 717417359 718221784
3907.8 718221784 718787551 718934000 718856633 718606830 718346834 718361139 718484402 718465805 718467236 718563735 718548775
3930.2 718548775 718533933 718748748 718996942 719051778 718948066 718807220 718803883 718877733 718850911 718882382 719066918
3952.7 719066918 719207168 719203889 719183207 719226360 719306827 719413340 719526350 719611287 719630897 719588399 719567358
3975.1 719567358 719659030 719791114 719882548 719985247 720105410 720175147 720187485 720208108 720257223 720346630 720491409
3997.5 720491409
$$ packed form
3867G16147542j2338j44422K93135N35012N32806M0710k83957J26779J62184J90437
3887.4G17587888K66671o1154J10149L89278j28924p29800n51998R894N25355Q04425
3907.8G18221784N65767J46449p7367k49803k59996J4305J23263j8597J431R6499j4960
3930.2G18548775j4842K14815K48194N4836j03712j40846l337P3850k6822L1471J84536
3952.7G19066918J40250l279k0682M3153Q0467J06513J13010Q4937J9610m2498k1041
3975.1G19567358R1672J32084R1434J02699J20163O9737J2338K0623M9115Q9407J44779
3997.5G20491409
##END=$$ End of the data block
