##TITLE=$$ Begin of the data block
##JCAMP-DX=5.00 $$ ACD/SpecManager v 10.08
##SPECTROMETER/DATA SYSTEM=Alpha
##DATE=11 Jun 2014 19:36:16
##DATA TYPE=INFRARED SPECTRUM
##DATA CLASS=XYDATA
##ORIGIN=
##OWNER=
##NPOINTS=1765
##FIRSTX=399.75695801
##LASTX=3997.56933594
##MAXX=3997.56933594
##MINX=399.75695801
##MAXY=0.79326046
##MINY=0.13800162
##XFACTOR=1.0000000000
##YFACTOR=1.000000000000000e-9
##FIRSTY=0.44934118
##DELTAX=2.03957629
##XUNITS=1/CM
##YUNITS=ARBITRARY UNITS
##XYDATA=(X++(Y..Y))
399.8D49341178N22286L41266q10862j389741j001567m56959m42892r28700j213611
$$ 449341178 449863464 450204730 449393868 448004127 447002560 446545601 446102709 445174009 443960398
418.1D43960398q86738r68248j346945j187504r41842j127005j094013l92288j35363
$$ 443960398 443073660 442105412 440758467 439570963 438629121 437502116 436408103 436015815 435880452
436.5D35880452r16183j501739j121699n39393o62386r58443q44598j077950j928210
$$ 435880452 434964269 433462530 432340831 431801438 431139052 430180609 429336011 428258061 426329851
454.8D26329851k342433j786589j341820j808971k214611j978755j707434j656890
$$ 426329851 423987418 422200829 420859009 419050038 416835427 414856672 413149238 411492348
471.1D11492348j271844l25769K96115K26260M7564K05785M20720K22385m977J26808
$$ 411492348 410220504 409894735 410190850 410417110 410464674 410670459 411091179 411313564 411308587 411435395
491.5D11435395Q1689m67688q61824p39395o00756q72492j348138j455069j300037
$$ 411435395 411517084 411049396 410187572 409448177 408847421 407974929 406626791 405171722 403871685
509.9D03871685j451581j737774j606941j341552j663297k129495j963139j436770
$$ 403871685 402420104 400682330 399075389 397733837 396070540 393941045 391977906 390541136
526.2C90541136j245707j268983r45985n06014m62860n45114k13087J77324j251l16233
$$ 390541136 389295429 388026446 387080461 386574447 386111587 385566473 385353386 385530710 385529459 385213226
546.6C85213226k11745j43320m64827q67068r84729q11696r51558j553148j865149
$$ 385213226 385001481 384858161 384393334 383526266 382541537 381729841 380778283 379225135 377359986
565C77359986j963764k566606l265202l166407k628178k434164k207935j198232J91331
$$ 377359986 375396222 372829616 369564414 366398007 363769829 361335665 359127730 357929498 358120829
583.3C58120829Q54641Q79169J062482J260877O15150m57734p90328p07775j050920
$$ 358120829 358975470 359854639 360917121 362177998 362793148 362335414 361545086 360837311 359786391
601.7C59786391j587927j502752p65443n6207M54008J430392K884537L925205M181772
$$ 359786391 358198464 356695712 355930269 355874062 356328070 357758462 360642999 364568204 368749976
620C68749976M326046M792660M800171M124880L783434M062116L992528L323436K951115
$$ 368749976 373076022 377868682 382668853 386793733 390577167 394639283 398631811 401955247 404906362
638.4D04906362L148049K975345K175629J740754J938760J894534J340866J162380
$$ 404906362 408054411 411029756 413205385 414946139 416884899 418779433 420120299 421282679
654.7D21282679J553148J652360J151800Q17716P64907L18557L04549J417637K060801
$$ 421282679 422835827 424488187 425639987 426457703 427222610 427541167 427845716 429263353 431324154
673.1D31324154K220094J869858J558482J858205K000779J459330J111537J350642
$$ 431324154 433544248 435414106 436972588 438830793 440831572 442290902 443402439 444753081
689.4D44753081J327335N12183n25564r54658R1166J963466K598256J985043R17286
$$ 444753081 446080416 446592599 446067035 445112377 445203543 447167009 449765265 451750308 452667594
707.7D52667594r12815j343280K049297N474537N147636L933191M390508N092442M952163
$$ 452667594 451754779 450411499 452460796 457935333 463082969 467016160 471406668 476499110 481451273
726.1D81451273M503548M283577L960401L150940K351523K125620K241373K185584
$$ 481451273 485954821 490238398 494198799 497349739 499701262 501826882 504068255 506253839
742.4E06253839K026915K097249K072990J372874L71218k88487p77900j552582k485335
$$ 506253839 508280754 510378003 512450993 513823867 514195085 513906598 513128698 511576116 509090781
760.8E09090781k902984k436519j118362R70483L379285N119324N401313M312217K832115
$$ 509090781 506187797 503751278 502632916 503603399 506982684 512102008 517503321 521815538 524647653
779.1E24647653J865327J297296P11917K14518j74463r10759k067507l126382l767848
$$ 524647653 526512980 527810276 528522193 528736711 528562248 527651489 525583982 522457600 518689752
797.5E18689752m366517n388856o637037p418722p401258o880730n799264l611118
$$ 518689752 514323235 508934379 502297342 494878620 487477362 480596632 474797368 471186250
813.8D71186250l02672L408998O874919R905160J2346089J3638913J3191402J1268854
$$ 471186250 470883578 474292576 481167495 491072655 503418744 517057657 530249059 541517913
830.1E41517913Q712709O073416L559291J302481p10726j902402j724541j394331j714409
$$ 541517913 550230622 556304038 559863329 561165810 560455084 558552682 556828141 555433810 553719401
848.5E53719401k954244m903317l930032J157045N106807M316509O65188l102243o585539
$$ 553719401 550765157 545861840 541931808 543088853 548195660 552512169 553177357 550075114 543489575
866.8E43489575j0279536j2121677r093106k546072M582465J1320591J5278041J4308274
$$ 543489575 533210039 521088362 511995256 509449184 514031649 525352240 540630281 554938555
883.1E54938555J0230481O042421L153980J460850K47538m01377J12652J292587J906931
$$ 554938555 565169036 571211457 574365437 575826287 576073825 575672448 575785100 577077687 578984618
901.5E78984618J758099J393556O54102r75073l060639m367291m536212m383802m345060
$$ 578984618 580742717 582136273 582790375 581815302 578754663 574387372 569851160 565467358 561122298
919.8E61122298m123509l828346m157126n188585n985498o014466n647481m935801
$$ 561122298 556998789 553170443 549013317 543824732 537839234 531824768 526177287 521241486
936.2E21241486l524840j634240k3186J019955J955628K812207K679169J143038q46267
$$ 521241486 517716646 516082406 516059220 517079175 519034803 521847010 524526179 525669217 524822950
954.5E24822950k367735l561377m588962n080938n198717n909890p585645r431094
$$ 524822950 522455215 518893838 514304876 509223938 504025221 498115331 490529686 481098592
970.8D81098592j0845422j2125314j3488710j4541566j5030295j5259295j5499741
$$ 481098592 470253170 458127856 444639146 430097580 415067285 399807990 384308249
985.1C84308249j5578777j5381336j5141994j4997750j4704496j3981223j2955815
$$ 384308249 368729472 353348136 338206142 323208392 308503896 294522673 281566858
999.4B81566858j1904508j0799229r603530q614659q041308p698208p291138o852060
$$ 281566858 269662350 258863121 249259591 240644932 232603624 224905416 217614278 210762218
1015.7B10762218o524533o083981n219116l941864k495185j028955M55275J918719
$$ 210762218 204237685 198153704 192934588 188992724 186497539 185468584 185923859 187842578
1032A87842578L121763L827393M147485M295409M205525L774881L069803K172247J185983
$$ 187842578 190964341 194791734 198939219 203234628 207440153 211215034 214284837 216457084 217643067
1050.4B17643067L47600l3111J57312O88880J169220J345322J141309N38409m48435
$$ 217643067 217990667 217957556 218114868 218803748 219972968 221318290 222459599 222998008 222549573
1068.7B22549573j665369k634570k799586k093210j060516J11803J900077L680870
$$ 222549573 220884204 218249634 215450048 213356838 212296322 212408125 214308202 217989072
1085B17989072M280523M231885M467010M896492N229235N472421N734370N863815N709797
$$ 217989072 222269595 226501480 230968490 235864982 241094217 246566638 252301008 258164823 263874620
1103.4B63874620N398154N075843M712343M272580L941357L865182L875793L794819
$$ 263874620 269272774 274348617 279060960 283333540 287274897 291140079 295015872 298810691
1119.7B98810691L776461M024893M266262L950178K867222J075119j214057l478110
$$ 298810691 302587152 306612045 310878307 314828485 317695707 318770826 317556769 314078659
1136C14078659n039931n486220m892856l673851k223402n88239J241953L043234M640698
$$ 314078659 309038728 303552508 298659652 294985801 292762399 292174160 293416113 296459347 301100045
1154.4C01100045O047070P194639P913112Q249373Q499354Q878022R221107R336024
$$ 301100045 307147115 314341754 322254866 330504239 339003593 347881615 357102722 366438746
1170.7C66438746R424717R630680R666621R289206Q583247P679045O405980M549235
$$ 366438746 375863463 385494143 395160764 404449970 413033217 420712262 427118242 431667477
1187D31667477K391308L57479j638978l788203n722344o923735p434965p694840p758260
$$ 431667477 434058785 434416264 432777286 428989083 423266739 416343004 408908039 401213199 393454939
1205.4C93454939p406205o871491o558151o370186o007076n553096n230457m938990
$$ 393454939 386048734 379177243 372619092 366248906 360241830 354688734 349458277 344519287
1221.7C44519287m443675l797024l258706k872645k419889j839102j358926j082271
$$ 344519287 340075612 336278588 333019882 330147237 327727348 325888246 324529320 323447049
1238C23447049q21352m70817k23995k10851j84953M7922K47359K82705M58836R83745
$$ 323447049 322625697 322154880 321930885 321720034 321535081 321583003 321830362 322113067 322571903 323555648
1258.4C23555648J650721K193421K730578L472776M255324M820168N252511N779177
$$ 323555648 325206369 327399790 330130368 333603144 337858468 342678636 347931147 353710324
1274.7C53710324O345272O681054O788373O939888P083089O947547O547600O136685
$$ 353710324 360055596 366736650 373525023 380464911 387548000 394495547 401043147 407179832
1291D07179832N710155N057603M297138L834307L738195L612786L245592K892763K713888
$$ 407179832 412889987 417947590 422244728 426079035 429817230 433430016 436675608 439568371 442282259
1309.4D42282259K319724J570284Q83848N54382M31538L23445L03626M10646L68535
$$ 442282259 444601983 446172267 447056115 447610497 448042035 448365480 448669106 449079752 449448287
1327.8D49448287m1902m54694n80012o76036j018733j157582p12663l15577l49432
$$ 449448287 449406385 448951691 448371679 447695643 446676910 445519328 444806665 444491088 444141656
1346.1D44141656n20170o08563r40442j791835k808988l462821m066080m941613n263626
$$ 444141656 443621486 443012923 442072481 440280646 437471658 434008837 429942757 425001144 419737518
1364.5D19737518m929006m734010m634082m823357m990488m225850l281683k698153
$$ 419737518 414808512 410074502 405440420 400617063 395626575 391400725 388119042 385420889
1380.8C85420889k124369j540900j273274j340449j629293k547264l839403m665703
$$ 385420889 383296520 381755620 380482346 379141897 377512604 374965340 371125937 366460234
1397.1C66460234n284458n502582n665213o334186o256639n648822n198926m550606
$$ 366460234 361175776 355673194 350007981 343673795 337417156 331768334 326569408 322018802
1413.4C22018802l721386l096372k281934q70824J10954O38515Q65698P31826N64843
$$ 322018802 318297416 315201044 312919110 312048286 312159240 312797755 313663453 314395279 314960122
1431.8C14960122M73023L23534M06861N15789L20881J8329k59906m76897m24892k96145
$$ 314960122 315433145 315756679 316163540 316679329 317000210 317018539 316758633 316281736 315856844 315560699
1452.2C15560699j98544L77626K050846K984614K565831K175808K647787L911406N813747
$$ 315560699 315362155 315739781 317790627 320775241 323341072 325516880 328164667 332076073 337889820
1470.5C37889820Q726180J0166466R409189Q430303P447898O420106N068034L754139
$$ 337889820 346616000 356782466 366191655 374621958 382069856 388489962 393557996 397312135
1486.8C97312135K687931J928001J236648K63154p04110r57727q63940j299470l102988
$$ 397312135 400000066 401928067 403164715 403427869 402723759 401766032 400902092 399602622 396499634
1505.2C96499634n592942m571349l626257m183352m314423l375649j932889j434684
$$ 396499634 390906692 386335343 382709086 378525734 374211311 370835662 368902773 367468089
1521.5C67468089j288682j224816j412809j488000k139181l054679k526849j845926
$$ 367468089 366179407 364954591 363541782 362053782 359914601 356859922 354333073 352487147
1537.8C52487147j574844P83682L434121M485429M562825M719376N086452N282312
$$ 352487147 350912303 351695985 355130106 359615535 364178360 368897736 373984188 379266500
1554.1C79266500M931629N573452P223040N687981M315257L611506K807736K311319
$$ 379266500 384198129 389771581 396994621 402682602 406997859 410609365 413417101 415728420
1570.5D15728420J692295J018256J379013K772004L379017L003031K188533J136452
$$ 415728420 417420715 418438971 419817984 422589988 425969005 428972036 431160569 432297021
1586.8D32297021j79797j646698k805292l651083m400849n254358o202281o927877
$$ 432297021 432117224 430470526 427665234 424014151 419613302 414358944 408156663 401228786
1603.1D01228786p510305q269399r111643r282857r019792j0239304j2063592r894729
$$ 401228786 393718481 385449082 376337439 367054582 358034790 347795486 335731894 325837165
1619.4C25837165q506954r696811r198725p931680p003605n448669m689724n000531
$$ 325837165 317330211 307633400 298434675 290502995 283499390 278050721 273360997 268360466
1635.7B68360466l477186j725555j244038j030624p87795n036P56889R38535J917452
$$ 268360466 264883280 263157725 261913687 260883063 260095268 260090232 260847121 261785656 263703108
1654.1B63703108L113925L437162M059791N284608O330102O213189O827712Q265137
$$ 263703108 266817033 270254195 274313986 279598594 285928696 292141885 298969597 307234734
1670.4C07234734Q212149Q696437R716451R259552Q693815R634256J2838542J2899131
$$ 307234734 315446883 324143320 333859771 343119323 351813138 361447394 374285936 387185067
1686.7C87185067J1590421J2133420J1647522J2932748J5155077J6302168J9167811
$$ 387185067 398775488 410908908 422556430 435489178 450644255 466946423 486114234
1701D86114234J6624540J4131486J4179468J2288809J0308564Q894741Q019329Q354723
$$ 486114234 502738774 516870260 531049728 543338537 553647101 562541842 570561171 578915894
1717.3E78915894Q279920O872594N826354N203247M418552L803790L194391L155291
$$ 578915894 587195814 594068408 599894762 605098009 609516561 613320351 616514742 619670033
1733.6F19670033L847301L962994M333854N178511N757332O076693O318927O879509
$$ 619670033 623517334 627480328 631814182 636992693 642750025 648826718 655145645 662025154
1749.9F62025154P272958O394446N549491N160451M495382M159391L918469L244400
$$ 662025154 669298112 675692558 681242049 686402500 690897882 695057273 698975742 702220142
1766.3G02220142K509475K005458K115666K430022J821339R92239Q15570J025796R72092
$$ 702220142 704729617 706735075 708850741 711280763 713102102 714094341 714909911 715935707 716907799
1784.6G16907799R20117J046300J113772J558841K003491J904249J754761J944661
$$ 716907799 717827916 718874216 719987988 721546829 723550320 725454569 727209330 729153991
1800.9G29153991K181291K154827J976967J726926J643240J782775J836479J648187
$$ 729153991 731335282 733490109 735467076 737194002 738837242 740620017 742456496 744104683
1817.2G44104683J412213J193762J028299J022160R39310R45926J489520J650095J097560
$$ 744104683 745516896 746710658 747738957 748761117 749700427 750646353 752135873 753785968 754883528
1835.6G54883528Q18550R05931O62804L32832P89345J330971J255453R02951O56008
$$ 754883528 755702078 756608009 757270813 757603645 758392990 759723961 760979414 761882365 762538373
1854G62538373P23005P81953O46114N13793M75823K94805J58608N72860R92239Q91566
$$ 762538373 763261378 764043331 764689445 765203238 765679061 765973866 766132474 766705334 767697573 768589139
1874.4G68589139N76973L76880M06623N34654M52101J71006P8380M38869O33895L60787
$$ 768589139 769166112 769542992 769949615 770484269 770936370 771107376 771185756 771624625 772258520 772619307
1894.7G72619307L10957N15044M98593K72453J86145K90096L48628L08632K73467K40266
$$ 772619307 772930264 773445308 773943901 774216354 774402499 774692595 775041223 775349855 775623322 775863588
1915.1G75863588J42455J26719J67489L08455M90248L19063O7175J34229K60771J36137
$$ 775863588 776006043 776132762 776300251 776608706 777098954 777418017 777485192 777619421 777880192 778016329
1935.5G78016329n3048j05560r4235j7524R3579J67907J99973O9678j31070q0407J14798
$$ 778016329 777963281 777857721 777763486 777745962 777839541 778007448 778207421 778277099 778146029 778065622 778180420
1958G78180420Q5175j06155j31429N901J02580K7001l4988R2208J20640n5850j19507
$$ 778180420 778265595 778159440 778028011 778033912 778136492 778163493 778128505 778220713 778341353 778285503 778165996
1980.4G78165996L9220Q9347r6440k19762j27197K5392J5557r4116n4777J6988j21594
$$ 778165996 778205216 778294563 778198123 777978361 777851164 777876556 777892113 777797997 777743220 777760208 777638614
2002.8G77638614k65598k15352j31249k00033l23117l13997j99259j94251l07799k58922
$$ 777638614 777373016 777157664 777026415 776826382 776503265 776189268 775990009 775795758 775487959 775229037
2023.2G75229037j25706k13862m03523l32773j08898j19149l21329l34740j02281j9491
$$ 775229037 775103331 774889469 774485946 774153173 774044275 773925126 773603797 773269057 773166776 773147285
2043.6G73147285j82331k11537J2577J11759m4823j29938J1146J12712k3961j26361
$$ 773147285 772964954 772753417 772765994 772877753 772832930 772702992 772714138 772826850 772802889 772676528
2064G72676528O6637K40565P0810r8526L4511J94251Q6129m8995O9141K05458J16586
$$ 772676528 772743165 772983730 773054540 772956014 772990525 773184776 773270905 773221910 773291051 773496509 773613095
2086.5G73613095l1233L2247J78933J18017l9578K8491K00928J36316m9055j0669J56760
$$ 773613095 773581862 773614109 773793042 773911059 773871481 773899972 774100900 774237216 774188161 774177492 774334252
2108.9G74334252J05142m7981K1279K27749K33650N9366L6478J82927J79350j4960
$$ 774334252 774439394 774391413 774412692 774640441 774874091 774933457 774969935 775152862 775332212 775317252
2129.3G75317252m4048J51813K13325N1916R298J58310J89125L4273q225J52885K48254
$$ 775317252 775273204 775425017 775638342 775690258 775699556 775857866 776046991 776081264 776073039 776225924 776474178
2151.7G76474178J62065R0539K04802L04043J89483J06931K54393L84509L07203K26557
$$ 776474178 776636243 776726782 776931584 777235627 777425110 777532041 777786434 778170943 778478146 778704703
2172.1G78704703K89321L42488K42889J52349K55585L91424L35991K08676K61307L86596
$$ 778704703 778994024 779336512 779579401 779731750 779987335 780378759 780714750 780923426 781184733 781571329
2192.5G81571329L28540J88411K05338L24845L30985K25126K27869L59237L81768K60711
$$ 781571329 781899869 782088280 782293618 782618463 782949448 783174574 783402443 783761680 784143448 784404159
2212.9G84404159K23279L19838L28601J93774J50442K66493L27170K36153J37150J64748
$$ 784404159 784627438 784947276 785275877 785469651 785620093 785886586 786213756 786449909 786587059 786751807
2233.3G86751807K20597J85430J40845J49250J76192J42991P7546R4175J39296Q7917
$$ 786751807 786972404 787157834 787298679 787447929 787624121 787767112 787844658 787938833 788078129 788166046
2253.7G88166046J3948P2300J56283J21654L7908L0100J16587J55032Q6665Q1897J49011
$$ 788166046 788179994 788252294 788408577 788530231 788568139 788598239 788714826 788869858 788956523 789038420 789187431
2276.1G89187431J12176N2750P8619J02103L4451r2089j51932j06573p7367j51694
$$ 789187431 789299607 789352357 789430976 789533079 789567530 789475441 789323509 789216936 789139569 788987875
2296.5G88987875k26975j99019j44780k51234m28021m26173l04341k62559l39686m44174
$$ 788987875 788760900 788561881 788417101 788165867 787737846 787311673 787007332 786744773 786405087 785960913
2316.9G85960913n64814o56724n78225l70800k74003l34024l31402j86682p1287o9678
$$ 785960913 785396099 784739375 784161150 783790350 783516347 783182323 782850921 782664239 782592952 782523274
2337.3G82523274j33931p7665L17454R59873J181782M88639o38247j401067j436412
$$ 782523274 782389343 782311678 782629132 783589005 784770787 785259426 784621179 783220112 781783700
2355.7G81783700j048982m61042J05560N16474Q62062J184881J346886J314640J265883
$$ 781783700 780734718 780273676 780379236 780895710 781757772 782942653 784289539 785604179 786870062
2374G86870062J318992J361608J240671R98854P61748N10215J98305m6193q9646l8802
$$ 786870062 788189054 789550662 790791333 791790187 792551935 793062150 793260455 793214262 793124616 793085814
2394.4G93085814o4970j53780j65998j18733j66118k49803k38180j76251j63496k13623
$$ 793085814 793020844 792867064 792701066 792582333 792416215 792166412 791928232 791751981 791588485 791374862
2414.8G91374862k28822j98305k66850l85821l70860k60889k47538l42131l53455k69354
$$ 791374862 791146040 790947735 790680885 790295064 789924204 789663315 789415777 789073646 788720191 788450837
2435.2G88450837k39313l31401m36783m08948l45289m00842m91261m63486l97444m51088
$$ 788450837 788211524 787880123 787443340 787034392 786689103 786288261 785797000 785333514 784936070 784484982
2455.6G84484982n40673n07593m63188n62191o59466o13570n48720o26326p64966q01385
$$ 784484982 783944309 783436716 782973528 782411337 781751871 781138301 780589581 779963255 779198289 778396904
2476G78396904p92503q32260q39412p89881p69495q15928q56638p89941o81877o43074
$$ 778396904 777604401 776772141 775932729 775142848 774373353 773557425 772700787 771910846 771228969 770585895
2496.4G70585895o49691o03616m85063m06563m30286m94897n58019o50406p48754p43746
$$ 770585895 769936204 769332588 768847525 768440962 768010676 767515779 766957760 766307354 765558600 764814854
2516.8G64814854o10888m67897l82721k76327j34945m7624j4782L0398Q7500O9081
$$ 764814854 764203966 763736069 763353348 763077021 762942076 762894452 762879670 762910068 762997568 763066649
2537.2G63066649p8797k68698l59833k99394k01225j59800j11580o9082j09613j99676
$$ 763066649 762987852 762719154 762359321 762059927 761858702 761698902 761587322 761518240 761408627 761208951
2557.6G61208951k68280k83241k70725k86102k98440k60771k61426l74853m98474n05030
$$ 761208951 760940671 760657430 760386705 760100603 759802163 759541392 759279966 758905113 758406639 757901609
2578G57901609m42147m33088m66346m59135m18186m20869m83095n31018n24342n21064
$$ 757901609 757459462 757026374 756560028 756100893 755682707 755261838 754778743 754247725 753723383 753202319
2598.4G53202319n73516o20544o06537o26802o98924p09832o69837o65128p20859p61807
$$ 753202319 752628803 752008259 751401722 750774920 750075996 749366164 748696327 748031199 747310340 746548533
2618.8G46548533p37786p33495p77185p98642p95782q11875q32379q13305p58409p18594
$$ 746548533 745810747 745077252 744300067 743501425 742705643 741893768 741061389 740248084 739489675 738771081
2639.2G38771081p41839q05617p93159p24554p37131p77959p47621o90043o90103p40290
$$ 738771081 738029242 737223625 736430466 735705912 734968781 734190822 733443201 732753158 732063055 731322765
2659.6G31322765o96659o12676o80208p70867p06911n78821n82695o94334p00176o18696
$$ 731322765 730626106 730013430 729333222 728562355 727855444 727276623 726693928 725999594 725299418 724680722
2680G24680722n99325o41286o50108n98312n81681o58751p32601p32600p50840q36551
$$ 724680722 724081397 723440111 722790003 722191691 721610010 720951259 720218658 719486058 718735218 717898667
2700.4G17898667q87275q37445q30174r64522j066029j001239r29475r98079j087785
$$ 717898667 717011392 716173947 715343773 714379251 713313222 712311983 711382508 710384429 709296644
2718.7G09296644j083315j036644j032471j039684r66489q89123q89063q77678q13663
$$ 709296644 708213329 707176685 706144214 705104530 704138041 703248918 702359855 701482177 700668514
2737.1G00668514p54774p69198q45492q67247q26061q04067q33749q77679q77321q92162
$$ 700668514 699913740 699144542 698299050 697431803 696605742 695801675 694967926 694090247 693212926 692320764
2757.5F92320764r80377j026213r72927r64463j045644j073241j023889j035988j132846
$$ 692320764 691340387 690314174 689341247 688376784 687331140 686257899 685234010 684198022 683065176
2775.8F83065176j212060j247883j265943j307607j392007j438796j467109j579285
$$ 683065176 681853116 680605233 679339290 678031683 676639676 675200880 673733771 672154486
2792.2F72154486j694739j712382j728832j832009j947522k004921k074957k216578
$$ 672154486 670459747 668747365 667018533 665186524 663239002 661234081 659159124 656942546
2808.5F56942546k344012k418578k493679k611399k819538l046870l202260l378093
$$ 656942546 654598534 652179956 649686277 647074878 644255340 641208470 638006210 634628117
2824.8F34628117l646910l951788m317522m885197n738377o927550q631408j1072636
$$ 634628117 630981207 627029419 622711897 617826700 612088323 605160773 596529365 585456729
2841.1E85456729j4213681j7411530j8707633j5483260p936419q8274M546702N797744
$$ 585456729 571243048 553831518 535123885 519640625 511704206 511615932 516162634 521960378
2857.4E21960378N078494L434420J348078q19206k613366l639340l694117l009260
$$ 521960378 527038872 530473292 531821370 531002164 528388798 524749458 521055341 518046081
2873.7E18046081k254724j873613j904368k262175k698362l044188l333569l541410
$$ 518046081 515791357 513917744 512013376 509751201 507052839 504008651 500675082 497133672
2890.1D97133672l658741l742546l786981l836275m015207m408598n085021o194115
$$ 497133672 493474931 489732385 485945404 482109129 478093922 473685324 468600303 462406188
2906.4D62406188p919669j0277122j2733787j3975412j2751401r253352m973412j222193
$$ 462406188 454486519 444209397 431475610 417500198 404748797 395495445 390522033 389299840
2922.7C89299840J560479L454238M692525N573124O313383O944835P426620P645011
$$ 389299840 390860319 394314557 399007082 404580206 410893589 417838424 425265044 432910055
2939D32910055P451713O839097N853176M497140K947480J579732P88182Q45909J660585
$$ 432910055 440361768 447200865 453054041 457551181 460498661 462078393 462866575 463712484 465373069
2957.4D65373069K808183L964842N046457N973458O621689O954878O999344O821096
$$ 465373069 468181252 472146094 477192551 483166009 489787698 496742576 503741920 510563016
2973.7E10563016O516337O137967N729020N322814M895389M382253L785133L198922
$$ 510563016 517079353 523217320 528946340 534269154 539164543 543546796 547331929 550530851
2990E50530851K661884K130985J531780Q64446K38299l10361p85053j087844j166761
$$ 550530851 553192735 555323720 556855500 557719946 557958245 557647884 556862831 555774987 554608226
3008.3E54608226j099765r47953p60019o28948o29425q13961j176417j588106j867592
$$ 554608226 553508461 552560508 551800489 551171541 550542116 549728155 548551738 546963632 545096040
3026.7E45096040j993597k060890k100289k172351k316713k455473k528191k553403
$$ 545096040 543102443 541041553 538941264 536768913 534452200 531996727 529468536 526915133
3043E26915133k602816k729237k815902k750695k698064k765774k795637k722442k640724
$$ 526915133 524312317 521583080 518767178 516016483 513318419 510552645 507757008 505034566 502393842
3061.4E02393842k597600k559156k441048k291531k254486k276361k279937k298683
$$ 502393842 499796242 497237086 494796038 492504507 490250021 487973660 485693723 483395040
3077.7D83395040k321154k318114k286702k255440k241164k223284k242058k321541
$$ 483395040 481073886 478755772 476469070 474213630 471972466 469749182 467507124 465185583
3094D65185583k376169k381742k439648k568424k665848k697020k726138k803892k877951
$$ 465185583 462809414 460427672 457988024 455419600 452753752 450056732 447330594 444526702 441648751
3112.4D41648751k921909k966433l009081l090263l192842l245681l295511l363967
$$ 441648751 438726842 435760409 432751328 429661065 426468223 423222542 419927031 416563064
3128.7D16563064l411651l442198l469109l509730l530920l553778l612518l654510
$$ 416563064 413151413 409709215 406240106 402730376 399199456 395645678 392033160 388378650
3145C88378650l666490l658146l654152l677964l739357l778547l759534l744870l742695
$$ 388378650 384712160 381054014 377399862 373721898 369982541 366203994 362444460 358699590 354956895
3163.4C54956895l734410l718346l696442l682643l662914l638595l643781l612846
$$ 354956895 351222485 347504139 343807697 340125054 336462140 332823545 329179764 325566918
3179.7C25566918l537625l509164l496349l438443l368884l328324l301203l291607
$$ 325566918 322029293 318520129 315023780 311585337 308216453 304888129 301586926 298295319
3196B98295319l272861l194660l128767l120721l065973k975047k929330k905756k891630
$$ 298295319 295022458 291827798 288699031 285578310 282512337 279537290 276607960 273702204 270810574
3214.3B70810574k855003k792149k743811k712577k692879k667129k621740k576872
$$ 270810574 267955571 265163422 262419611 259707034 257014155 254347026 251725286 249148414
3230.7B49148414k535671k529860k541140k484962k403900k344981k315521k328009
$$ 249148414 246612743 244082883 241541743 239056781 236652881 234307900 231992379 229664370
3247B29664370k324223k269045k184599k100468k078816k112225k117515k063944j999051
$$ 229664370 227340147 225071102 222886503 220786035 218707219 216594994 214477479 212413535 210414484
3265.3B10414484j944899j838178j731813j719907j723632j656800j563609j509547
$$ 210414484 208469585 206631407 204899594 203179687 201456055 199799255 198235646 196726099
3281.6A96726099j481161j418725j341864j298860j260325j212537j186863j184642
$$ 196726099 195244938 193826213 192484349 191185489 189925164 188712627 187525764 186341122
3298A86341122j147047j072809j028165j046032j087978j098231j101509j124516j121759
$$ 186341122 185194075 184121266 183093101 182047069 180959091 179860860 178759351 177634835 176513076
3316.3A76513076j093090j104712j098708j047551j078785j139283j123950j102090
$$ 176513076 175419986 174315274 173216566 172169015 171090230 169950947 168826997 167724907
3332.6A67724907j081585j068846j115546j172974j164988j112029j070753j048609
$$ 167724907 166643322 165574476 164458930 163285956 162120968 161008939 159938186 158889577
3348.9A58889577j068205j121878j156971j139865j091122j072929j056864r68680
$$ 158889577 157821372 156699494 155542523 154402658 153311536 152238607 151181743 150213063
3365.3A50213063r05067r66668j077131j069217r07049p81208p65294p81909p28130
$$ 150213063 149307996 148341328 147264197 146194980 145287931 144506723 143741429 142959520 142231390
3383.6A42231390n79178m09916l23520m13656n70446n15044k17646m5613k20820m26024
$$ 142231390 141652212 141242296 140918776 140505120 139934674 139419630 139201984 139156371 138935551 138509527
3404A38509527l29018j37210m1678J2487K4766K9564J04725J95846K18704L00959N01186
$$ 138509527 138180509 138043299 138001621 138014108 138038874 138068438 138173163 138369009 138587713 138888672 139389858
3426.5A39389858O66573O29336N92485P08744O58661M37304M57943P19204R01685R61035
$$ 139389858 140056431 140685767 141278252 141986996 142645657 143082961 143540904 144260108 145161793 146122828
3446.8A46122828R65729R97708J059472J135424J253933J308754J180380J164556J455456
$$ 146122828 147088557 148086265 149145737 150281161 151535094 152843848 154024228 155188784 156644240
3465.2A56644240J597688J352355J104205J229078J541898J818999J891792J709640
$$ 156644240 158241928 159594283 160698488 161927566 163469464 165288463 167180255 168889895
3481.5A68889895J679450J881943J897394J781210J860440J991555K045378K025947
$$ 168889895 170569345 172451288 174348682 176129892 177990332 179981887 182027265 184053212
3497.8A84053212K056688K127409K039269K024099K268866K504125K627403K628624
$$ 184053212 186109900 188237309 190276578 192300677 194569543 197073668 199701071 202329695
3514.2B02329695K523363K529964K673089K828926K766281K641589K783880L043666
$$ 202329695 204853058 207383022 210056111 212885037 215651318 218292907 221076787 224120453
3530.5B24120453L213927L359959L399089L336683L502816L728181L767788L662691
$$ 224120453 227334380 230694339 234093428 237430111 240932927 244661108 248428896 252091587
3546.8B52091587L688067L901273M081011M189610M329771M464209M434198M339963
$$ 252091587 255779654 259680927 263761938 267951548 272281319 276745528 281179726 285519689
3563.1B85519689M432142M957318N416036N337685N205810N335004N556345N765915
$$ 285519689 289951831 294909149 300325185 305662870 310868680 316203684 321760029 327525944
3579.4C27525944N878746N768657N662918N888343O316095O373465O355882O560892
$$ 327525944 333404690 339173347 344836265 350724608 357040703 363414168 369770050 376330942
3595.7C76330942O773829O846756O858587O798387O673425O827951P067680P112444
$$ 376330942 383104771 389951527 396810114 403608501 410281926 417109877 424177557 431290001
3612.1D31290001P047891O836951O924391P564276P726044P212162O845027P437736
$$ 431290001 438337892 445174843 452099234 459663510 467389554 474601716 481446743 488884479
3628.4D88884479Q324325Q050352P666648P399261P116794O945074O662488O158590
$$ 488884479 497208804 505259156 512925804 520325065 527441859 534386933 541049421 547208011
3644.7E47208011N814612O315529P049621O702184O173849O202460O115257N634726
$$ 547208011 553022623 559338152 566387773 573089957 579263806 585466266 591581523 597216249
3661E97216249N094945M626810M152179L880263M074394M022777L757954M077137M277885
$$ 597216249 602311194 606938004 611090183 614970446 619044840 623067617 626825571 630902708 635180593
3679.4F35180593L873109L315032K752542K094984J550734J866043K409339K417326
$$ 635180593 639053702 642368734 645121276 647216260 648766994 650633037 653042376 655459702
3695.7F55459702K227604K184093K409518K788603K800405K247394J711428J831651
$$ 655459702 657687306 659871399 662280917 665069520 667869925 670117319 671828747 673660398
3712F73660398K384305K335727J738906J239299J024664R92477J072943J306474J119316
$$ 673660398 676044703 678380430 680119336 681358635 682383299 683375776 684448719 685755193 686874509
3730.3F86874509M75108M07517J175881J660943J401484N83827n006P93516J119375
$$ 686874509 687349617 687757134 688933015 690593958 691995442 692579269 692574263 693367779 694487154
3748.7F94487154N77271J032472J600444J204610P42972Q78751J012862O80387M53890
$$ 694487154 695064425 696096897 697697341 698901951 699644923 700523674 701536536 702216923 702670813
3767.1G02670813M98592O95289R16183P81059N20646L81053M83155N58555M86017O28173
$$ 702670813 703169405 703864694 704780877 705561936 706082582 706463635 706946790 707505345 707991362 708619535
3787.5G08619535P18594M98354J53899j35124k8431O0737p6294N57959P83861M23253
$$ 708619535 709338129 709836483 709990382 709855258 709826827 709887564 709811270 710369229 711153090 711576343
3807.8G11576343O92367P47502J06573m87387j39654P5698J25349Q11338Q28207M29809
$$ 711576343 712268710 713016212 713122785 712635398 712495744 712571442 712696791 713508129 714336336 714766145
3828.2G14766145J90615J371J19508K1875l01004J45674O97851P70748O35385K82288
$$ 714766145 714956760 714958131 715077639 715099514 714798510 714944184 715642035 716412783 717048168 717330456
3848.6G17330456l44873j172304n49316J060843J080036L00885j74046o3896K04027
$$ 717330456 716985583 715813279 715263963 716324806 717404842 717705727 717531681 717467785 717671812
3867G17671812j7286q0347L02494M38332M53830L2187k61128J38402J72257K05576
$$ 717671812 717654526 717574179 717876673 718315005 718768835 718801022 718539894 718678296 718850553 719056129
3887.4G19056129J95265k15590L8028M35472j9134n81026n14984j17898M52757Q46684
$$ 719056129 719251394 719035804 719073832 719509304 719490170 718909144 718394160 718276262 718729019 719575703
3907.8G19575703O18041J63972j22249l18289k42174J01924J78039j728l338Q0943
$$ 719575703 720193744 720357716 720235467 719917178 719675004 719776928 719954967 719953239 719949901 720030844
3928.2G20030844j5676l934K25783K40028L6180j28687j99318p5400O6638M2916P8082
$$ 720030844 720015168 720011234 720237017 720477045 720513225 720384538 720185220 720109820 720176458 720219374 720297456
3950.6G20297456J76251J39415K8312J073K7776O7830J02937P5877L1113J2458K801
$$ 720297456 720473707 720613122 720641434 720642507 720670283 720738113 720841050 720916927 720948040 720960498 720963299
3973.1G20963299R895O1154J03295J06454J18375J02818L5464J6868O0022P6115R8229
$$ 720963299 720973194 721034348 721137643 721244097 721362472 721465290 721500754 721517622 721577644 721653759 721751988
3995.5G21751988J36971
$$ 721751988 721888959
3997.5G21888959
$$ 721888959
##END=$$ End of the data block
