##TITLE=$$ Begin of the data block
##JCAMP-DX=5.00 $$ ACD/SpecManager v 10.08
##SPECTROMETER/DATA SYSTEM=Alpha
##DATE=11 Jun 2014 19:36:16
##DATA TYPE=INFRARED SPECTRUM
##DATA CLASS=XYDATA
##ORIGIN=
##OWNER=
##NPOINTS=1765
##FIRSTX=399.75695801
##LASTX=3997.56933594
##MAXX=3997.56933594
##MINX=399.75695801
##MAXY=0.79406995
##MINY=0.13787147
##XFACTOR=1.0000000000
##YFACTOR=1.000000000000000e-9
##FIRSTY=0.44824076
##DELTAX=2.03957629
##XUNITS=1/CM
##YUNITS=ARBITRARY UNITS
##XYDATA=(X++(Y..Y))
399.8D48240757O08176J39713j228720j313716l07351N1200p24047j423151j248836
$$ 448240757 448848933 448988646 447759926 446446210 446138859 446190059 445466012 444042861 442794025
418.1D42794025n92411q02338j224279p57307n03302j139134j373291o87867l78192
$$ 442794025 442201614 441399276 440174997 439417690 438914388 437775254 436401963 435714096 435335904
436.5D35335904q49217j147449j011610p34091p54535j052171j126081j128047j562536
$$ 435335904 434486687 433339238 432327628 431593537 430839002 429786831 428660750 427532703 425970167
454.8D25970167k020508j835615j657784k036422k252072k054513j907587j728236
$$ 425970167 423949659 422114044 420456260 418419838 416167766 414113253 412205666 410477430
471.1D10477430j032889q1063L73573J83761o3837J57595M62711L11911P897l3050
$$ 410477430 409444541 409363478 409737051 409920812 409856975 410014570 410477281 410789192 410797089 410764039
491.5D10764039j42038n84215p65175l98040k74956q68350j460463j416832j180560
$$ 410764039 410622001 410037786 409272611 408874571 408599615 407731265 406270802 404853970 403673410
509.9D03673410j466602j808166j616359j550585j991838k156466j694590j216799
$$ 403673410 402206808 400398642 398782283 397231698 395239860 393083394 391388804 390172005
526.2C90172005j271785j495808j090050k97665j41889l92676j58190J54465j35064
$$ 390172005 388900220 387404412 386314362 386016697 385874808 385482132 385323942 385478407 385343343
544.6C85343343m65363l40551j87636m87983r99570r54837n79118q58218j625150j972318
$$ 385343343 384877980 384537429 384349793 383861810 382862240 381907403 381328285 380470067 378844917 376872599
565C76872599k061754k537072l141403l088057k573580k376348k150982j249701M9502
$$ 376872599 374810845 372273773 369132370 366044313 363470733 361094385 358943403 357693702 357743204
583.3C57743204Q11576Q84563J000792J220882P48724k58446p33048o79284r66966
$$ 357743204 358554780 359439343 360440135 361661017 362409741 362151295 361418247 360738963 359771997
601.7C59771997j607269j527489o48856k7477L17245J335144K851785L909379M230827
$$ 359771997 358164728 356637239 355988383 355960906 356278151 357613295 360465080 364374459 368605286
620C68605286M418880M811287M708528M054099L799856M117519M023343L323406K970994
$$ 368605286 373024166 377835453 382543981 386598080 390397936 394515455 398538798 401862204 404833198
638.4D04833198L140539K950787K207756J780093K011388J953841J259267J080662
$$ 404833198 407973737 410924524 413132280 414912373 416923761 418877602 420136869 421217531
654.7D21217531J528054J578004J140296R79990R21935L25232K95371J419276J977891
$$ 421217531 422745585 424323589 425463885 426443875 427365810 427691042 427986413 429405689 431383580
673.1D31383580K187341J955927J597047J839876K087265J518369J004457J301080
$$ 431383580 433570921 435526848 437123895 438963771 441051036 442569405 443573862 444874942
689.4D44874942J361758M77254n45293r01550J86771K009869K523839J920522R46670
$$ 444874942 446236700 446713954 446168661 445267111 445453882 447463751 449987590 451908112 452854782
707.7D52854782q80658j383275K004862N472153N095631L828526M358172N165666N009026
$$ 452854782 451974124 450590849 452595711 458067864 463163495 466992021 471350193 476515859 481524885
726.1D81524885M451751M226953M052282L326416K402275K070427K245605K204717
$$ 481524885 485976636 490203589 494255871 497582287 499984562 502054989 504300594 506505311
742.4E06505311J982629K011835J995564J385629M14908l15964q25048j574397k485752
$$ 506505311 508487940 510499775 512495339 513880968 514295876 513979912 513154864 511580467 509094715
760.8E09094715k861142k346337j056790R25720L300845N139828N458951M243076K743661
$$ 509094715 506233573 503887236 502830446 503756166 507057011 512196839 517655790 521898866 524642527
779.1E24642527J918197J374900P25627K24412j68086r53078k112984l112555l755510
$$ 524642527 526560724 527935624 528661251 528885663 528717577 527764499 525651515 522538960 518783450
797.5E18783450m434824n487978o623507p294714p334054o863355n727113l530025
$$ 518783450 514348626 508860648 502237141 494942427 487608373 480745018 475017905 471487880
813.8D71487880k54005L441423O871164R862899J2296558J3588130J3153911J1266589
$$ 471487880 471233875 474675298 481546462 491409361 503705919 517294049 530447960 541714549
830.1E41714549Q778691O167710L556550J228630q01384j982033j710833j382827j817346
$$ 541714549 550493240 556660950 560217500 561446130 560644746 558662713 556951880 555569053 553751707
848.5E53751707l048956m904747l920794J169324N148649M307807N73396l164708o524503
$$ 553751707 550702751 545798004 541877210 543046534 548195183 552502990 553076386 549911678 543387175
866.8E43387175j0191977j2133003r149313k518832M654348J1315941J5232385J4284968
$$ 543387175 533195198 521062195 511912882 509394050 514048398 525364339 540596724 554881692
883.1E54881692J0246515O112516L216684J421690J44839m23968J61589J283288J847207
$$ 554881692 565128207 571240723 574457407 575879097 576023936 575599968 575761557 577044845 578892052
901.5E78892052J731634J421333P20739r06765l039539m387319m567981m456759m425406
$$ 578892052 580623686 582045019 582765758 581858993 578819454 574432135 569864154 565407395 560981989
919.8E60981989m104138l761768m166663n224049n970955n988657n640805m930079
$$ 560981989 556877851 553116083 548949420 543725371 537754416 531765759 526124954 521194875
936.2E21194875l501594j623213m6551J012325J965284K778948K619207J149117p99059
$$ 521194875 517693281 516070068 516023517 517035842 519001126 521780074 524399281 525548398 524749339
954.5E24749339k380431l595829m571974n051375n245507o007045p648587r467900
$$ 524749339 522368908 518773079 514201105 509149730 503904223 497897178 490248591 480780691
970.8D80780691j0865629j2113780j3469517j4529675j5012890j5256733j5527844
$$ 480780691 469915062 457801282 444331765 429802090 414789200 399532467 384004623
985.1C84004623j5584618j5321553j5079111j4993459j4706403j3951540j2923270
$$ 384004623 368420005 353098452 338019341 323025882 308319479 294367939 281444669
999.4B81444669j1896670j0819763r593383q543357p996589p700950p293418o865650
$$ 281444669 269547999 258728236 249134853 240591496 232594907 224893957 217600539 210734889
1015.7B10734889o519422o047353n206868l945247k488493j043901M33549J905709
$$ 210734889 204215467 198168114 192961246 189015999 186527506 185483605 185917154 187822863
1032A87822863L073171L782377M175678M354372M216895L750116L052353K147124J154631
$$ 187822863 190896034 194678411 198854089 203208461 207425356 211175472 214227825 216374949 217529580
1050.4B17529580L43606m500J99511P10726J153454J316160J134351N51686m56408
$$ 217529580 217873186 217868686 218068197 218778923 219932377 221248537 222382888 222934574 222478166
1068.7B22478166j688525k608731k737135k084821j084000J32397J911595L619075
$$ 222478166 220789641 218180910 215443775 213358954 212274954 212407351 214318946 217938021
1085B17938021M207656M247486M548565M946291N228996N465836N742982N874723N703419
$$ 217938021 222145677 226393163 230941728 235888019 241117015 246582851 252325833 258200556 263903975
1103.4B63903975N391747N095572M741370M300773L947080L834664L842891L777086
$$ 263903975 269295722 274391294 279132664 283433437 287380517 291215181 295058072 298835158
1119.7B98835158L769637M010230M250020L946453K869159J083463j203477l455043
$$ 298835158 302604795 306615025 310865045 314811498 317680657 318764120 317560643 314105600
1136C14105600n012393n484164m919320l701091k209902n48124J263023L050923M668116
$$ 314105600 309093207 303609043 298689723 294988632 292778730 292230606 293493629 296544552 301212668
1154.4C01212668O078244P199168P915020Q264720Q516133Q870602R180695R293526
$$ 301212668 307290912 314490080 322405100 330669820 339185953 348056555 357237250 366530776
1170.7C66530776R388655R601295R643585R268463Q595764P715315O419808M556328
$$ 366530776 375919431 385520726 395164311 404432774 413028538 420743853 427163661 431719989
1187D31719989K395749L10599j711219l799915n684913o913691p461667p704378p730066
$$ 431719989 434115738 434426337 432715118 428915203 423230290 416316599 408854932 401150554 393420488
1205.4C93420488p389784o874681o542921o350249o010175n548924n187213m905462
$$ 393420488 386030704 379156023 372613102 366262853 360252678 354703754 349516541 344611079
1221.7C44611079m459113l814727l241182k870440k457679j851379j328141j061529
$$ 344611079 340151966 336337239 333096057 330225617 327767938 325916559 324588418 323526889
1238C23526889q29965m86940k22802j76549j60664K9981K40803L11166M77463R55015
$$ 323526889 322696924 322209984 321987182 321810633 321649969 321679950 321920753 322231919 322709382 323664397
1258.4C23664397J607180K199828K771110L476411M233718M824042N248368N748868
$$ 323664397 325271577 327471405 330242515 333718926 337952644 342776686 348025054 353773922
1274.7C53773922O326288O690800O820410O952554P055939O921768O541759O125271
$$ 353773922 360100210 366791010 373611420 380563974 387619913 394541681 401083440 407208711
1291D07208711N701065N078077M307419L815502L754288L637016L231376K892167K729058
$$ 407208711 412909776 417987853 422295272 426110774 429865062 433502078 436733454 439625621 442354679
1309.4D42354679K335191J612872R31203N49257L81470K93284L16918M37111L60340
$$ 442354679 444689870 446302742 447233945 447783202 448164672 448457956 448774874 449211985 449572325
1327.8D49572325q1867m71026n58466o37173r68844j119763p13467l49432l97802n46008
$$ 449572325 449490458 449019432 448460966 447823793 446854949 445735186 445021719 444672287 444274485 443728477
1348.1D43728477o01202r25720j783103k800763l461390m079670m949063n259097m924834
$$ 443728477 443127275 442201555 440418452 437617689 434156299 430076629 425127566 419868469 414943635
1366.5D14943635m737705m628777m799396m988760m247754l292054k698481k131552
$$ 414943635 410205930 405577153 400777757 395788997 391541243 388249189 385550708 383419156
1382.8C83419156j560867j290798j346469j620173k522946l833443m679173n286544
$$ 383419156 381858289 380567491 379221022 377600849 375077903 371244460 366565287 361278743
1399.1C61278743n512298n685597o336808o236345n636066n212635m556060l693730
$$ 361278743 355766445 350080848 343744040 337507695 331871629 326658994 322102934 318409204
1415.5C18409204l064692k274572q77053J21445O57379Q56996P02470N49138M86553
$$ 318409204 315344512 313069940 312192887 312314332 312971711 313828707 314531177 315080315 315566868
1433.8C15566868L50445M11302N04315L22908L5673k42352m68403m29332l13998k01910
$$ 315566868 315917313 316328615 316832930 317155838 317191511 316949159 316480756 316051424 315737426 315535516
1454.2C15535516M13000K060205K953857K554476K183408K647817L900886N820006
$$ 315535516 315948516 318008721 320962578 323517054 325700462 328348279 332249165 338069171
1470.5C38069171Q756399J0201633R419322Q403212P421821O413460N060434L755301
$$ 338069171 346825570 357027203 366446525 374849737 382271558 388685018 393745452 397500753
1486.8C97500753K708793J917094J194656K62678o56069r31620q87692j329005l092796
$$ 397500753 400209546 402126640 403321296 403583974 402927905 401996285 401108593 399779588 396686792
1505.2C96686792n580604m614740l670872m197001m284471l317029j872330j398027
$$ 396686792 391106188 386491448 382820576 378623575 374339104 371022075 369149745 367751718
1521.5C67751718j299113j251191j443923j493990k085924k997756k517730j862139
$$ 367751718 366452605 365201414 363757491 362263501 360177577 357179821 354662091 352799952
1537.8C52799952j583159Q42959L465354M437208M537553M738867N100072N298465
$$ 352799952 351216793 352059752 355525106 359962314 364499867 369238734 374338806 379637271
1554.1C79637271M981280N653232P230162N638928M297465L586918K752870K282858
$$ 379637271 384618551 390271783 397501945 403140873 407438338 411025256 413778126 416060984
1570.5D16060984J694173J025975J390904K756267L359914L016085K193331J107812
$$ 416060984 417755157 418781132 420172036 422928303 426288217 429304302 431497633 432605445
1586.8D32605445k15023j679004k828121l661901m404455n248606o202191o946355
$$ 432605445 432390422 430711418 427883297 424221396 419816941 414568335 408366144 401419789
1603.1D01419789p519573q260489r107381r291321r039670j0252029j2041897r856462
$$ 401419789 393900216 385639727 376532346 367241025 358201355 347949326 335907429 326050967
1619.4C26050967q483768r704470r238601p969916p003188n416363m663468n026370
$$ 326050967 317567199 307862729 298624128 290654212 283651024 278234661 273571193 268544823
1635.7B68544823l548950j764566j209825r51469p40886j3351P64131R98676J963973
$$ 268544823 264995873 263231307 262021482 261070013 260329127 260315776 261079907 262078583 264042556
1654.1B64042556L090203L423452M072607N283892O315083O214797O820530Q248180
$$ 264042556 267132759 270556211 274628818 279912710 286227793 292442590 299263120 307511300
1670.4C07511300Q220136Q685023R685754R280384Q759171R695172J2837738J2862831
$$ 307511300 315731436 324416459 334102213 343382597 352141768 361836940 374674678 387537509
1686.7C87537509J1579454J2125969J1648506J2929708J5095591J6255468J9202859
$$ 387537509 399116963 411242932 422891438 435821146 450916737 467172205 486375064
1701D86375064J6702622J4208555J4213860J2290359J0319829Q934915Q076727Q370400
$$ 486375064 503077686 517286241 531500101 543790460 554110289 563045204 571121931 579492331
1717.3E79492331Q235037O823778N803406N214155M456520L860235L264487L197253
$$ 579492331 587727368 594551146 600354552 605568707 610025227 613885462 617149949 620347202
1733.6F20347202L822982L943265M350066N181849N720973O045401O340325O923973
$$ 620347202 624170184 628113449 632463515 637645364 643366337 649411738 655752063 662676036
1749.9F62676036P262707O358862N549908N165457M476727M139006L920793L271282
$$ 662676036 669938743 676297605 681847513 687012970 691489697 695628703 699549496 702820778
1766.3G02820778K547085K060890K154947K401709J790405R81509P74265R64224R49562
$$ 702820778 705367863 707428753 709583700 711985409 713775814 714757323 715531588 716495812 717445374
1784.6G17445374R44435J097620J172304J577198J994551J915276J757681J909077
$$ 717445374 718389809 719487429 720659733 722236931 724231482 726146758 727904439 729813516
1800.9G29813516K137005K142609J982033J712501J623273J781583J836478J647950
$$ 729813516 731950521 734093130 736075163 737787664 739410937 741192520 743028998 744676948
1817.2G44676948J430451J228393J061141J044929R66668R57549J446903J583278J055956
$$ 744676948 746107399 747335792 748396933 749441862 750408530 751366079 752812982 754396260 755452216
1835.6G55452216Q26597R41753P08163L81589P93695J285077J206755Q86083O53565
$$ 755452216 756278813 757220566 757928729 758310318 759104013 760389090 761595845 762481928 763135493
1854G63135493P16805Q04365O87301N28038M76837L19660J79588N27203R22382Q77619
$$ 763135493 763852298 764656663 765343964 765872002 766348839 766668499 766848087 767375290 768297672 769175291
1874.4G69175291O04689M03583M09246N04315M36544K11179J30832M15504N59390L41952
$$ 769175291 769779980 770183563 770592809 771097124 771533668 771744847 771875679 772291183 772850573 773192525
1894.7G73192525L43561N40435N02587K67803K08617L17156L32296K85149K80559K56359
$$ 773192525 773536086 774076521 774579108 774846911 775055528 775372684 775704980 775990129 776270688 776527047
1915.1G76527047J49965J15157J51932L24845N12362L10480M7624J14978K31683J05917
$$ 776527047 776677012 776792169 776944101 777268946 777781308 778091788 778139412 778254390 778486073 778591990
1935.5G78591990n3703o1989l6061J2815P9095J27972J74164P0751j17063p5579Q8870
$$ 778591990 778538287 778476298 778440237 778453052 778532147 778660119 778834283 778905034 778787971 778712392 778801262
1958G78801262M9949j09494j04248K0683Q0526P629k4021J06693J29938l5465j09434
$$ 778801262 778851211 778741717 778637469 778658152 778738678 778746307 778722286 778828979 778958917 778923452 778814018
1980.4G78814018K0265P8738q5771k07543j08779K8193l457j02043n2691J6392j22369
$$ 778814018 778834283 778913021 778827250 778619707 778510928 778539121 778535664 778433621 778380930 778397322 778274953
2002.8G78274953k73287k21372j04844j65403l17872l16143j96993k00629l16918k66552
$$ 778274953 778001666 777780294 777675450 777510047 777192175 776876032 776679039 776478410 776161492 775894940
2023.2G75894940j28925j92761l67225l26693j48713j66774l25739l10421j08421l2962
$$ 775894940 775766015 775573254 775206029 774879336 774730623 774563849 774238110 773927689 773819268 773786306
2043.6G73786306j50144j67250R536O4195o4493r4294M3452J05261m7504j35541O6995
$$ 773786306 773636162 773468912 773478448 773542643 773478150 773383856 773427308 773532569 773485065 773349524 773416519
2066.1G73416519K32995O9320o8486O5983J73628M2260o0022R0658K27154J02996n9425
$$ 773416519 773649514 773718834 773650348 773716331 773889959 773932219 773872197 773962855 774190009 774293005 774233580
2088.5G74233580L0934J82212J18613j7345M9055J92523J19030n3167p510J71780J40667
$$ 774233580 774264514 774446726 774565339 774547994 774597049 774789572 774908602 774855435 774847925 775019705 775160372
2110.9G75160372k7358J4007K21491K21848L3260K0682J79768J73151j5378l9756J43588
$$ 775160372 775133014 775147021 775368512 775590360 775623620 775644302 775824070 775997221 775981843 775942087 776085675
2133.4G76085675K05517P4565M4167J76072K00331L3379k9504J32978K40087J49012
$$ 776085675 776291192 776365757 776409924 776585996 776786327 776819706 776790202 776923180 777163267 777312279
2153.8G77312279N7697J82927L38196K54393J44899K53379L69191K96057K08437K81573
$$ 777312279 777369976 777552903 777891099 778145492 778290391 778543770 778912961 779209018 779417455 779699028
2174.2G79699028L68893K67923J58488K65122M00901L21388J74045K22862L62396L42608
$$ 779699028 780067921 780335844 780494332 780759454 781160355 781481743 781655788 781878650 782241046 782583654
2194.6G82583654K22683K27511L40342L49939K35200K11060L18766L53396K66492K38538
$$ 782583654 782806337 783033848 783374190 783724129 783959329 784170389 784489155 784842551 785109043 785347581
2215G85347581L31700L50833K22802J57475K51294L10659K16961J27673J86086K64167
$$ 785347581 785679281 786030114 786252916 786410391 786661685 786972344 787189305 787316978 787503064 787767231
2235.4G87767231K11120J23978J16825J52171J19924N5432J05262J91689J36614K7120
$$ 787767231 787978351 788102329 788219154 788371325 788491249 788546681 788651943 788843632 788980246 789007366
2255.8G89007366N0187J24395J00434K7537M9293J45972J34825M3333O7592J63316
$$ 789007366 789057553 789181948 789282382 789309919 789359212 789505184 789640009 789683342 789750934 789914250
2276.1G89914250J35541O0797Q3387J02758J7703r1434j19209p3969o2347j48415k29478
$$ 789914250 790049791 790110588 790193975 790296733 790314436 790223002 790103793 790029824 789967477 789819062 789589584
2298.6G89589584k13504j66714k26915l56436l92079l27587k84672l28422m23789n53846
$$ 789589584 789376080 789209366 788982451 788626015 788233936 787906349 787621677 787293255 786869466 786315620
2319G86315620o42180n33820l11136k76387l60787k86817r6560j0848q7499k29359
$$ 786315620 785673440 785139620 784828484 784552097 784191310 783904493 783807933 783797085 783709586 783480227
2339.4G83480227j69873L23474J007259J192808N04911n89192j361966j460910j085281
$$ 783480227 783310354 783633828 784641087 785833895 786338806 785749614 784387648 782926738 781841457
2357.7G81841457m22537J64508M64023P78675J232385J441181J308858J164317J205862
$$ 781841457 781418920 781583428 782047451 782826126 784058511 785499692 786808550 787972867 789178729
2376.1G89178729J282096J193345R68337P44581N07355J95503m0353n5670j2279r5963
$$ 789178729 790460825 791654170 792622507 793367088 793874443 794069946 794029593 793973923 793961644 793865681
2396.5G93865681k15531j88052q1718j16647k42889k61426j85310j84894k52187k22743
$$ 793865681 793650150 793462098 793380380 793263733 793020844 792759418 792574108 792389214 792137027 791914284
2416.9G91914284j63376k52783l83497l72827k74360k43485l20375l56078k76983k57671
$$ 791914284 791750908 791498125 791114628 790741801 790467441 790223956 789903581 789547503 789270520 789012849
2437.3G89012849l94940m79341l85344l12924l95536m85599m39883l74734m55141n76854
$$ 789012849 788617909 788138568 787753224 787440300 787044764 786559165 786119282 785744548 785289407 784712553
2457.7G84712553n64516n06579n54204o27101o05404n57900o31153p72894q01086p53880
$$ 784712553 784148037 783641458 783087254 782460153 781854749 781296849 780665696 779892802 779091716 778337836
2478.1G78337836p91132q54254q26657p55965p60198q28147q12888p08640o41942o42776
$$ 778337836 777546704 776692450 775865793 775109828 774349630 773521483 772708595 771999955 771358013 770715237
2498.5G70715237o06239m91858m11272m27723m88341n48839o42598p59065p90238o65009
$$ 770715237 770108998 769617140 769205868 768778145 768289804 767740965 767098367 766339302 765549064 764884055
2518.9G64884055m62771l38316k66611j41263l4154j9371J5676R8705Q6606p4685k75016
$$ 764884055 764421284 764082968 763816357 763675094 763640940 763621569 763637245 763735950 763822556 763747871 763472855
2541.3G63472855l58462k90573k01821j71185j25646p5162j25706k19226k51114k46227
$$ 763472855 763114393 762823820 762621999 762450814 762325168 762250006 762124300 761905074 761653960 761407733
2561.7G61407733k43604k63393k99215l13879l27110l76105m28915m30882m15087m52936
$$ 761407733 761164129 760900736 760601521 760287642 759960532 759584427 759155512 758724630 758309543 757856607
2582.1G57856607n04612m88222m47095m48703m89116n32329n31554n27799n80013o06597
$$ 757856607 757351995 756863773 756416678 755967975 755478859 754946530 754414976 753887177 753307164 752700567
2602.5G52700567n81562o21915o92368o98030o78003o86466p27594p43687p32422p60377
$$ 752700567 752119005 751497090 750804722 750106692 749428689 748742223 748014629 747270942 746538520 745778143
2622.9G45778143q15212q19683p74146p59661p95185q12948p60078p14362p68840q30055
$$ 745778143 744962931 744143248 743369102 742609441 741814256 741001308 740241230 739526868 738758028 737927973
2643.3G37927973p83682p23719p65383q13485p38024o35147o69837p64966p36773o30618
$$ 737927973 737144291 736420572 735655189 734841704 734103680 733468533 732798696 732033730 731296957 730666339
2663.7G30666339o39557p36058p30336o31630o21021o77943o56784n85437n91218o68168
$$ 730666339 730026782 729290724 728560388 727928758 727307737 726629794 725973010 725387573 724796355 724128187
2684.1G24128187o68586o11782o10828o52552p06553p24971p35045q13425q68499q35597
$$ 724128187 723459601 722847819 722236991 721584439 720877886 720152915 719417870 718604445 717735946 716900349
2704.5G16900349q48949r66192j050293j006901r60350j029909j103580j066506j015365
$$ 716900349 716051400 715085208 714034915 713028014 712067664 711037755 709934175 708867669 707852304
2722.8G07852304j038671j044333r68933q91983q88705q98302q34405p54834p57694
$$ 707852304 706813633 705769300 704800367 703908384 703019679 702121377 701286972 700532138 699774444
2741.2F99774444q16286q34584q07464q07762q60870r09626q96395q86500r64343j018584
$$ 699774444 698958158 698123574 697316110 696508348 695647478 694737852 693841457 692954957 691990614 690972030
2761.6F90972030r73284r77516j058102j064241j020849j055717j146197j210332j219929
$$ 690972030 689998746 689021230 687963128 686898887 685878038 684822321 683676124 682465792 681245863
2779.9F81245863j220047j280069j396597j487672j503229j548350j665235j715481
$$ 681245863 680025816 678745747 677349150 675861478 674358249 672809899 671144664 669429183
2796.2F69429183j714885j803100j937271k014279k087951k226710k340913k406954
$$ 669429183 667714298 665911198 663973927 661959648 659871697 657644987 655304074 652897120
2812.5F52897120k502859k638519k830863l029644l202320l419816l689349l969908
$$ 652897120 650394261 647755742 644924879 641895235 638692915 635273099 631583750 627613842
2828.9F27613842m312932m872203n734146o948292q670568j1087775j4224172j7456710
$$ 627613842 623300910 618428707 612694561 605746269 597075701 585987926 571763754 554307044
2845.2E54307044j8721045j5433907p923007j38402M513621N783379N064607L441334
$$ 554307044 535585999 520152092 512229085 512090683 516604304 522387683 527452290 530893624
2861.5E30893624J348316q22186k596915l616214l690481l028810k253055j862347
$$ 530893624 532241940 531419754 528822839 525206625 521516144 518487334 516234279 514371932
2877.8E14371932j911402k256632k698720l101468l404915l552586l620505l695607
$$ 514371932 512460530 510203898 507505178 504403710 500998795 497446209 493825704 490130097
2894.1D90130097l760040l843069m031331m413634n102873o226391p923901j0239929
$$ 490130097 486370057 482526988 478495657 474082023 468979150 462752759 454828858 444588929
2910.4D44588929j2693435j3982534j2781322r253621m969180j224994J565635L436386
$$ 444588929 431895494 417912960 405131638 395878017 390908837 389683843 391249478 394685864
2926.8C94685864M658282N546421O283343O932437P443518P655561P451653O852478
$$ 394685864 399344146 404890567 411173910 418106347 425549865 433205426 440657079 447509557
2943.1D47509557N902022M596800L014087J549334P59810Q63492J642675K762168L979445
$$ 447509557 453411579 458008379 461022466 462571800 463331610 464195102 465837777 468599945 472579390
2961.4D72579390N086094N971610O620259O963521P003784O839752O533981O144046
$$ 472579390 477665484 483637094 490257353 497220874 504224658 511064410 517598391 523742437
2977.8E23742437N754710N370855M917860M363179L781438L259182K727091K123654
$$ 523742437 529497147 534868002 539785862 544149041 547930479 551189661 553916752 556040406
2994.1E56040406J478851Q31842K38061l16679p86364j057387j154601j111269r41038
$$ 556040406 557519257 558351099 558589160 558272481 557486117 556428730 555274129 554162860 553221822
3012.4E53221822p26998n65231n84900q46207j237154j608611j868248k008199k063632
$$ 553221822 552494824 551929593 551344693 550498486 549261332 547652721 545784473 543776274 541712642
3030.8E41712642k098620k190590k302468k396464k503634k595901k662957k739191
$$ 541712642 539614022 537423432 535120964 532724500 530220866 527624965 524962008 522222817
3047.1E22222817k780557k733648k691328k744436k792657k738237k645970k594590
$$ 522222817 519442260 516708612 514017284 511272848 508480191 505741954 503095984 500501394
3063.4E00501394k551645k441108k322197k283364k256185k233565k282590k336502
$$ 500501394 497949749 495508641 493186444 490903080 488646895 486413330 484130740 481794238
3079.7D81794238k334118k312094k288431k257198k238512k252608k292246k355605
$$ 481794238 479460120 477148026 474859595 472602397 470363885 468111277 465819031 463463426
3096D63463426k423704k480388k550721k642631k706916k718120k770096k879560k947599
$$ 463463426 461039722 458559334 456008613 453365982 450659066 447940946 445170850 442291290 439343691
3114.4D39343691k959252k991974l109872l233612l259182l263443l334255l437340
$$ 439343691 436384439 433392465 430282593 427048981 423789799 420526356 417192101 413754761
3130.7D13754761l506928l502518l477872l488809l541678l603250l655553l708571
$$ 413754761 410247833 406745315 403267443 399778634 396236956 392633706 388978153 385269582
3147C85269582l704697l647118l634125l709287l773928l762185l739834l767043l785879
$$ 385269582 381564885 377917767 374283642 370574355 366800427 363038242 359298408 355531365 351745486
3165.4C51745486l756970l719807l667682l637254l650397l654003l583998l517121
$$ 351745486 347988516 344268709 340601027 336963773 333313376 329659373 326075375 322558254
3181.7C22558254l535330l543049l480524l374189l327370l350526l327429l253997
$$ 322558254 319022924 315479875 311999351 308625162 305297792 301947266 298619837 295365840
3198B95365840l184110l130376l088296l042727l013134k976060k912432k854765k794236
$$ 295365840 292181730 289051354 285963058 282920331 279907197 276931137 274018705 271163940 268369704
3216.4B68369704k786189k821535k793848k709478k638311k600312k558142k517774
$$ 268369704 265583515 262761980 259968132 257258654 254620343 252020031 249461889 246944115
3232.7B46944115k560944k627045k569809k435431k341688k314210k296239k253428
$$ 246944115 244383171 241756126 239186317 236750886 234409198 232094988 229798749 227545321
3249B27545321k195314k165377k174154k169534k153084k128541k059624j946688j860544
$$ 227545321 225350007 223184630 221010476 218840942 216687858 214559317 212499693 210553005 208692461
3267.4B08692461j817867j775652j739293j708076j649886j577333j533940j485467
$$ 208692461 206874594 205098942 203359649 201651573 200001687 198424354 196890414 195404947
3283.7A95404947j399607j332998j310587j287505j234308j189902j164273j127138
$$ 195404947 194005340 192672342 191361755 190074250 188839942 187650040 186485767 185358629
3300A85358629j107455j070007j044065j103610j133561j112148j111120j113072j126021
$$ 185358629 184251174 183181167 182137102 181033492 179899931 178787783 177676663 176563591 175437570
3318.4A75437570j125574j077250j036108j080632j150876j117602j066923j091168
$$ 175437570 174311996 173234746 172198638 171118006 169967130 168849528 167782605 166691437
3334.7A66691437j109421j107097j137450j174897j177266j139820j083970j074716
$$ 166691437 165582016 164474919 163337469 162162572 160985306 159845486 158761516 157686800
3351A57686800j121402j155987j124546j069472j048669j015693r62198r76577j033366
$$ 157686800 156565398 155409411 154284865 153215393 152166724 151151031 150188833 149212256 148178890
3369.3A48178890j081139j059263r05037p74354p54714p66069p09116n90921m39018
$$ 148178890 147097751 146038488 145133451 144359097 143604383 142838314 142129198 141538277 141099259
3387.7A41099259l03164l79756n74067n46545k79561q9407k22429m40166l23593o9097
$$ 141099259 140796095 140416339 139842272 139295727 139016166 138926759 138704330 138264164 137940571 137871474
3408.1A37871474J6242J5334j1117K265J02669J65507J97724L48225N29617O12080
$$ 137871474 137887716 137903050 137891933 137894198 137996867 138162374 138360098 138708323 139237940 139850020
3428.5A39850020O08579O76885P61494O22526M27902M67151O75827Q63090R50769R74581
$$ 139850020 140458599 141135484 141896978 142519504 142947406 143414557 144090384 144953474 145904243 146878824
3448.9A46878824J022815J056165J114875J243591J317233J219079J204818J473546
$$ 146878824 147901639 148957804 150072679 151316270 152633503 153852582 155057400 156530946
3465.2A56530946J608640J365424J103669J226276J559153J817823J873404J736879
$$ 156530946 158139586 159505010 160608679 161834955 163394108 165211931 167085335 168822214
3481.5A68822214J726985J876220J872778J793653J862973J979276K069086K066553
$$ 168822214 170549199 172425419 174298197 176091850 177954823 179934099 182003185 184069738
3497.8A84069738K068355K134368K083898K014145K180457K473906K679422K697722
$$ 184069738 186138093 188272461 190356359 192370504 194550961 197024867 199704289 202402011
3514.2B02402011K559885K497464K650157K896562K838567K648443K784833L075958
$$ 202402011 204961896 207459360 210109517 213006079 215844646 218493089 221277922 224353880
3530.5B24353880L264919L399446L395215L284410L448054L743916L812865L675967
$$ 224353880 227618799 231018245 234413460 237697870 241145924 244889840 248702705 252378672
3546.8B52378672L711641L916502M057527M154265M293740M490226M565358M460544
$$ 252378672 256090313 260006815 264064342 268218607 272512347 277002573 281567931 286028475
3563.1B86028475M465580M957467N418032N339682N209953N371720N589753N726904
$$ 286028475 290494055 295451522 300869554 306209236 311419189 316790909 322380662 328107566
3579.4C28107566N856514N856901N771905N903244O285787O365925O355494O589502
$$ 328107566 333964080 339820981 345592886 351496130 357781917 364147842 370503336 377092838
3595.7C77092838O869853O975174O956041O828874O647468O792336P051617P131070
$$ 377092838 383962691 390937865 397893906 404722780 411370248 418162584 425214201 432345271
3612.1D32345271P095039O880939O967813P592439P738740P267952O930917P532120
$$ 432345271 439440310 446321249 453289062 460881501 468620241 475888193 482819110 490351230
3628.4D90351230Q378446P988364P617890P482827P247269O988764O597400O059885
$$ 490351230 498729676 506718040 514335930 521818757 529066026 536054790 542652190 548712075
3644.7E48712075N781471O403208P136703O712496O166577O208957O135225N632579
$$ 548712075 554493546 560896754 568033457 574745953 580912530 587121487 593256712 598889291
3661E98889291N088210M644037M151642L879964M114211M023731L725528M094899M299283
$$ 598889291 603977501 608621538 612773180 616653144 620767355 624791086 628516614 632611513 636910796
3679.4F36910796L840029L256083K737522K137959J598835J899839K418696K387941
$$ 636910796 640750825 644006908 646744430 648882389 650481224 652381063 654799759 657187700
3695.7F57187700K208293K223253K476513K795697K739727K211273J754105J878798
$$ 657187700 659395993 661619246 664095759 666891456 669631183 671842456 673596561 675475359
3712F75475359K343357K270996J727939J262843J021028R70006J098752J359761J177430
$$ 675475359 677818716 680089712 681817651 683080494 684101522 685071528 686170280 687530041 688707471
3730.3F88707471N61774M17292J036942J554429J424790O39736j7583P31528J110315
$$ 688707471 689269245 689686537 690723479 692277908 693702698 694342434 694324851 695056379 696166694
3748.7F96166694O41763J033962J539171J185298P57456R05990J048088O81460M48764
$$ 696166694 696808457 697842419 699381590 700566888 701324344 702230334 703278422 703959882 704408646
3767.1G04408646N58197P38561Q95143P84337N32985L25024M15743N32627M71532O17206
$$ 704408646 704966843 705705404 706600547 707384884 707917869 708242893 708658636 709191263 709662795 710280001
3787.5G10280001O84679M39405J53899l0338P8797J16050m8816N21958P12514L63886
$$ 710280001 710964680 711404085 711557984 711527646 711606443 711722493 711673677 712195635 712908149 713272035
3807.8G13272035O50406P30157J52945m00066r4712P9334P3969O83487P48455N10753
$$ 713272035 713922441 714652598 714805543 714405477 714310765 714390099 714464068 715147555 715896010 716406763
3828.2G16406763L19838N4956Q9526j20342m78029J22726P93099Q49486O76870L03924
$$ 716406763 716726601 716781557 716871083 716750741 716272712 716395438 717188537 718038023 718714893 719018817
3848.6G19018817l42548j236558o16074J121164J175940L33905j98662j02282J60456
$$ 719018817 718676269 717439711 716823637 717944801 719120741 719454646 719255984 719153702 719314158
3867G19314158n5790j19507L14176N05149N03898N9902k70903J20521J75178J86205
$$ 719314158 719258368 719138861 719453037 719958186 720462084 720521986 720251083 720371604 720546782 720732987
3887.4G20732987K21193j28448P1048M00186r2804o31571m31657J2517M29213O85394
$$ 720732987 720954180 720825732 720896780 721296966 721204162 720572591 720140934 720153451 720582664 721268058
3907.8G21268058M74453J55210O557j92940k42055J6511J04308l4809M530J08003J311
$$ 721268058 721742511 721897721 721904278 721711338 721469283 721485794 721590102 721555293 721559823 721667826 721669137
3930.2G21669137r834K05755K36154L397j86443j71423K1398J03712K265K7001J65403
$$ 721669137 721659303 721865058 722101212 722104609 721918166 721746743 721768141 721871853 721874118 721901119 722066522
3952.7G22066522J88946Q6010J9431J4484L0458N6147N6088N8651M8399J5378J5557
$$ 722066522 722255468 722341478 722360909 722375393 722405851 722461998 722518086 722576737 722625136 722640514 722656071
3975.1G22656071O7055Q0228Q4698J42336J30713M3273o497Q166O8665J27375J27137
$$ 722656071 722723126 722803354 722888052 723030388 723161101 723204374 723197877 723206043 723274708 723402083 723529220
3997.5G23529220
$$ 723529220
##END=$$ End of the data block
