##TITLE=$$ Begin of the data block
##JCAMP-DX=5.00 $$ ACD/SpecManager v 10.08
##SPECTROMETER/DATA SYSTEM=Alpha
##DATE=11 Jun 2014 19:36:16
##DATA TYPE=INFRARED SPECTRUM
##DATA CLASS=XYDATA
##ORIGIN=
##OWNER=
##NPOINTS=1765
##FIRSTX=399.75695801
##LASTX=3997.56933594
##MAXX=3997.56933594
##MINX=399.75695801
##MAXY=0.79511863
##MINY=0.13772692
##XFACTOR=1.0000000000
##YFACTOR=1.000000000000000e-9
##FIRSTY=0.44893202
##DELTAX=2.03957629
##XUNITS=1/CM
##YUNITS=ARBITRARY UNITS
##XYDATA=(X++(Y..Y))
399.8D48932022N13345J34587j234233j469523k26647L88176n93067j684367j718045
418.1D43042248j067459j111478j213371n11766k57283j058668j349539o87986o32167
436.5D35152531j148224j095742m85778j84476q09700j265198r13232r45151j827061
454.8D26477969k477736k087652j637548j915783k043784j652241j461595j713782
471.1D11487848j397580l01898K93881J16706q2553J65612M89831K93821n0277n6386
491.5D10959005r0718m30941p31737o40929m47124p42704j305520j420945j358211
509.9D03790176j716882j926959j487553j187265j678496k222896k001077j380324
526.2C90188724j250327j365423q89838l11166l67939n24134k15411J49310k1428m35025
$$ plain form
399.8 448932022 449445367 449579954 448345721 446876198 446649551 447037727 446444660 444760293 443042248
418.1 443042248 441974789 440863311 439649940 439138174 438880891 437822223 436472684 435784698 435152531
436.5 435152531 434004307 432908565 432422787 432238311 431428611 430163413 429250181 428305030 426477969
454.8 426477969 424000233 421912581 420275033 418359250 416315466 414663225 413201630 411487848
471.1 411487848 410090268 409788370 410082251 410198957 410116404 410282016 410771847 411065668 411015391 410959005
491.5 410959005 410868287 410437346 409705609 409064680 408617556 407874852 406569332 405148387 403790176
509.9 403790176 402073294 400146335 398658782 397471517 395793021 393570125 391569048 390188724
526.2 390188724 388938397 387572974 386683136 386371970 386004031 385479897 385264486 385413796 385392368 384957343
546.6C84957343l97324j36733l65854q49127q67576o83337r31710j517505j860588
565C77347589j969427k520204l272027l256261k728194k453595k106876j098096K61426
583.3C58204335R22590Q74460J009762J202822O22303m18097q35687p47889j025588
601.7C59809011j549601j429499o72251q2075L48002J399457K872139L889382M228503
620C68813068M484176M851640M634797L964514L793329M170537M099160L415495L042013
638.4D05268729L253013L097534K182811J617849J874268J894146J312763J157612
654.7D21658725J526981J524836J108944R93491R53018L92646L60638J432568K001792
673.1D31953639K129018J853854J685917J958340J968325J383572J080662J388044
$$ plain form
546.6 384957343 384560019 384423286 384057432 383208305 382340729 381657392 380725682 379208177 377347589
565 377347589 375378162 372857958 369585931 366329670 363601476 361147881 359041005 357942909 358204335
583.3 358204335 359126925 360001385 361011147 362213969 362836272 362418175 361582488 360834599 359809011
601.7 359809011 358259410 356829911 356157660 356075585 356423587 357823044 360695183 364584565 368813068
620 368813068 373297244 378148884 382783681 386748195 390541524 394712061 398811221 402226716 405268729
638.4 405268729 408521742 411619276 413802087 415419936 417294204 419188350 420501113 421658725
654.7 421658725 423185706 424710542 425819486 426812977 427765995 428158641 428519279 429951847 431953639
673.1 431953639 434082657 435936511 437622428 439580768 441549093 442932665 444013327 445401371
689.4D45401371J358896N20736m71979q71718Q8274J840145K501726J980364R23127
707.7D53270942q95262j296997K088636N488873N134791L905684M361838N101174M981965
726.1D82141644M461199M228324L983765L201038K378672K159417K296448K171993
742.4E07022500J939893J986921J970887J351774L90708k57134p39694j565933k516687
760.8E09583235k881289k353847j095772Q52347L294825N182386N451679M272103K801001
779.1E25106668J844287J262784P15733K10524k33412r21309j993537l106535l836274
797.5E19048929m416764n429744o643772p302165p270188o847828n769253l487974
813.8D71881241j64181L428310O808936R904474J2397170J3642073J3135851J1156022
$$ plain form
689.4 445401371 446760267 447281003 446809024 445937306 446025580 447865725 450367451 452347815 453270942
707.7 453270942 452375680 451078683 453167319 458656192 463790983 467696667 472058505 477159679 482141644
726.1 482141644 486602843 490831167 494814932 498015970 500394642 502554059 504850507 507022500
742.4 507022500 508962393 510949314 512920201 514271975 514662683 514405549 513665855 512099922 509583235
760.8 509583235 506701946 504348099 503252327 504104674 507399499 512581885 518033564 522305667 525106668
779.1 525106668 526950955 528213739 528929472 529139996 528906584 527985275 525991738 522885203 519048929
797.5 519048929 514632165 509202421 502558649 495256484 487986296 481138468 475369215 471881241
813.8 471881241 471717060 475145370 481954306 491858780 504255950 517898023 531033874 542189896
830.1E42189896Q610726O049454L539502J262665p15673j886070j703560j392305j788556
848.5E54166079l093422n025148l957928J232923N195617M291833N20348l214001o537140
866.8E43579161j0150730j2075305r152651k591729M606127J1337579J5260517J4297366
883.1E55110335J0240674O035328L097713J382590K01463l81887J47999J289367J900077
901.5E79023659J780927J415790O73770r28282l042043m429400m616558m426420m362285
919.8E61089158m102349l786028m167497n234897o004274o000757n623341m911899
936.2E21258116l486216j592279j9312R96530J932383K774417K619267J115382q35658
954.5E24762630k399683l635048m619182n061149n226612o010056p692992r509773
$$ plain form
830.1 542189896 550800622 556850076 560389578 561652243 560936570 559050500 557346940 555954635 554166079
848.5 554166079 551072657 546047509 542089581 543322504 548518121 552809954 553330302 550116301 543579161
866.8 543579161 533428431 521353126 512200475 509608746 514214873 525552452 540812969 555110335
883.1 555110335 565351009 571386337 574484050 575866640 576068103 575686216 575834215 577123582 579023659
901.5 579023659 580804586 582220376 582894146 581965864 578923821 574494421 569877863 565451443 561089158
919.8 561089158 556986809 553200781 549033284 543798387 537794113 531793356 526170015 521258116
936.2 521258116 517771900 516179621 516160309 517156839 519089222 521863639 524482906 525598288 524762630
954.5 524762630 522362947 518727899 514108717 509047568 503820956 497810900 490117908 480608135
970.8D80608135j0869145j2109071j3496101j4568239j4999897j5179634j5472203
985.1C83913845j5611947j5376657j5079290j4948964j4675826j3938099j2921989
999.4B81361073j1904239j0803879r570539q547842p992760p662966p222206o780550
1015.7B10876092o506771o095245n224526l965139k510786r94236M94227J894444L038779
1034.1A91006839L759623M141763M328027M226476L752723L023401K140105J156196
1050.4B17535153L24354o795K04339P10354J169413J339599J145214N34773m79743
1068.7B22476661j655891k543345k723113k088502j066700J22741J880467L615245
1085B18017563M248828M288152M547119M941896N232468N447149N719394N836039N642653
$$ plain form
970.8 480608135 469738990 457629919 444133818 429565579 414565682 399386048 383913845
985.1 383913845 368301898 352925241 337845951 322896987 308221161 294283062 281361073
999.4 281361073 269456834 258652955 249082416 240534574 232541814 224878848 217656642 210876092
1015.7 210876092 204369321 198274076 193049550 189084411 186573625 185579389 186073616 187968060 191006839
1034.1 191006839 194766462 198908225 203236252 207462728 211215451 214238852 216378957 217535153
1050.4 217535153 217859507 217852712 218057051 218767405 219936818 221276417 222421631 222956404 222476661
1068.7 222476661 220820770 218277425 215554312 213465810 212399110 212521851 214402318 218017563
1085 218017563 222266391 226554543 231101662 236043558 241276026 246723175 252442569 258278608 263921261
1103.4B63921261N372107N099296M715592M289985L985196L875137L841400L764927
1119.7B98864901L797710M059196M252404L898531K849310J136661j134425l438384
1136C14285904n016237n456895m873455l671109k199888n43714J246721L014147M634917
1154.4C01420391O072640P225126P916063Q221835Q500010Q902669R197771R286225
1170.7C66742730R381592R584368R626209R256274Q582294P694721O378770M502237
1187D31749195K359360L21329j671433l786088n686581o888300p439941p714570p746517
1205.4C93496454p397145o886274o557643o341011n984902n550504n208581m885614
1221.7C44684780m399866l799051l272891k874047k422631j819819j330614j070827
$$ plain form
1103.4 263921261 269293368 274392664 279108256 283398241 287383437 291258574 295099974 298864901
1119.7 298864901 302662611 306721807 310974211 314872742 317722052 318858713 317724288 314285904
1136 314285904 309269667 303812772 298939317 295268208 293068320 292524606 293771327 296785474 301420391
1154.4 301420391 307493031 314718157 322634220 330856055 339356065 348258734 357456505 366742730
1170.7 366742730 376124322 385708690 395334899 404591173 413173467 420868188 427246958 431749195
1187 431749195 434108555 434429884 432758451 428972363 423285782 416397482 408957541 401242971 393496454
1205.4 393496454 386099309 379213035 372655392 366314381 360329479 354778975 349570394 344684780
1221.7 344684780 340284914 336485863 333212972 330338925 327916294 326096475 324765861 323695034
1238C23695034q14378m67569k10792j70529j44780N6208K49594L09497M77463R34899
1258.4C23914647J576036K189905K775252L480196M209131M787355N260140N776465
1274.7C53969127O301612O612867O733387O910891P081359O966442O551713O107003
1291D07234401N694836N098104M354120L867298L750205L607750L238589K923309K757222
1309.4D42525834K329230J581073R16123N71370M21018L22759L35157M40597L62129
1327.8D49805290p1049m71562n72533o60807r92149j122474p19280l63916l92735n27531
1348.1D43911254n88655r32545j790642k785147l456443m106462m976839n264997m909367
1366.5D15100157m713416m620701m797101m975051m244446l300637k703607k121330
$$ plain form
1238 323695034 322880656 322413087 322202295 322031766 321886986 321943194 322192788 322502285 322979748 323914647
1258.4 323914647 325490683 327680588 330455840 333936036 338145167 342932522 348192662 353969127
1274.7 353969127 360270739 366883606 373616993 380527884 387609243 394575685 401127398 407234401
1291 407234401 412929237 418027341 422381461 426248759 429998964 433606714 436845303 439768612 442525834
1309.4 442525834 444855064 446436137 447352260 447923630 448344648 448667407 449002564 449443161 449805290
1327.8 449805290 449734241 449262679 448690146 448029339 447037190 445914716 445195436 444831520 444438785 443911254
1348.1 443911254 443322599 442390054 440599412 437814265 434357822 430251360 425274521 420009524 415100157
1366.5 415100157 410386741 405766040 400968939 395993888 391749442 388448805 385745198 383623868
1382.8C83623868j522451j264900j374156j646310k527892l855765m713237n322099
1399.1C61397058n517036n636066o304950o251245n634219n194872m567415l714383
1415.5C18576872l064006k276689q89540J02848O54101Q99792P38502N49376M90784
1433.8C15782040L57718L96460M68612K96145L7581k22951m48704m18723l05712j78784
1454.2C15763682M53085K065092K911687K528042K195179K669096L906727N823821
1470.5C38316411Q757889J0174632R402871Q428723P420093O367892N042672L762364
1486.8C97673547K694458J890481J183927K58147o73830r50337q91149j307785l045380
1505.2C96832079n563885m640430l683210m187763m247129l291100j872778j362055
$$ plain form
1382.8 383623868 382101417 380836517 379462361 377816051 375288159 371432394 366719157 361397058
1399.1 361397058 355880022 350243956 343939006 337687761 332053542 326858670 322291255 318576872
1415.5 318576872 315512866 313236177 312346637 312449485 313103586 314003378 314741880 315291256 315782040
1433.8 315782040 316139758 316536218 317004830 317300975 317338556 317115605 316666901 316248178 315942466 315763682
1454.2 315763682 316216767 318281859 321193546 323721588 325916767 328585863 332492590 338316411
1470.5 338316411 347074300 357248932 366651803 375080526 382500619 388868511 393911183 397673547
1486.8 397673547 400368005 402258486 403442413 403700560 403026730 402076393 401185244 399877459 396832079
1505.2 396832079 391268194 386627764 382944554 378756791 374509662 371218562 369345784 367983729
1521.5C67983729j233548j203329j431554j510233k095401k990693k491146j782894
1537.8C53244931j474560Q64059L435105M413128M513264M717528N104095N324841
1554.1C80142391N001425N649686P206887N620540M272073L589511K806157K301812
1570.5D16590482J679212J051336J406044K717108L308385K948791K123058J058847
1586.8D32883263k31296j670510k822190l663868m433721n305708o225765o930708
1603.1D01599497p503808q237630r081394r277761r030491j0242611j2058258r892881
1619.4C26274663q494824r695828r242207q000791p038355n405217m620940n012989
1635.7B68763512l565609j761675j184255r10133o82294J2129P47174J000673J980603
$$ plain form
1521.5 367983729 366750181 365546852 364115298 362605065 360509664 357518971 355027825 353244931
1537.8 353244931 351770371 352634430 356069535 360482663 364995927 369713455 374817550 380142391
1554.1 380142391 385143816 390793502 398000389 403620929 407893002 411482513 414288670 416590482
1570.5 416590482 418269694 419321030 420727074 423444182 426752567 429701358 431824416 432883263
1586.8 432883263 432651967 430981457 428159267 424495399 420061678 414755970 408530205 401599497
1603.1 401599497 394095689 385858059 376776665 367498904 358468413 348225802 336167544 326274663
1619.4 326274663 317779839 308084011 298841804 290841013 283802658 278397441 273776501 268763512
1635.7 268763512 265197903 263436228 262251973 261341840 260659546 260671675 261418849 262419522 264400125
1654.1B64400125L079205L402502M060357N282253O305665O208688O840974Q286894
1670.4C07866663Q254587Q719087R695470R250760Q743585R729772J2864709J2819976
1686.7C87944609J1527091J2108803J1672467J2983382J5170067J6321361J9183249
1701D86911029J6646593J4212311J4232218J2292087J0340333Q968771Q116483Q416057
1717.3E80135882Q253515O854236N855739N218863M419148L847659L286064L207564
1733.6F21078670L806949L942132M354894N194425N774260O107748O359696O898522
1749.9F63517296P243753O383538N577028N161583M470706M137934L905534L269732
1766.3G03667104K575159K075970K120138K355933J769602R73106P96318J014113R73821
$$ plain form
1654.1 264400125 267479330 270881832 274942189 280224442 286530107 292738795 299579769 307866663
1670.4 307866663 316121250 324840337 334535807 343786567 352530152 362259924 375124633 387944609
1686.7 387944609 399471700 411580503 423252970 436236352 451406419 467727780 486911029
1701 486911029 503557622 517769933 532002151 544294238 554634571 563603342 571719825 580135882
1717.3 580135882 588389397 595243633 601099372 606318235 610737383 614585042 617871106 621078670
1733.6 621078670 624885619 628827751 633182645 638377070 644151330 650259078 656618774 663517296
1749.9 663517296 670761049 677144587 682721615 687883198 692353904 696491838 700397372 703667104
1766.3 703667104 706242263 708318233 710438371 712794304 714563906 715537012 716333330 717347443 718321264
1784.6G18321264R35554J095355J183331J571953J977921J911819J758098J900256
1800.9G30655551K135575K149045J983106J730681J646519J774072J810074J614273
1817.2G45498896J398086J230359J100481J073539R69529R40085J412272J586914J096785
1835.6G56306946Q36790R28700P04646L54052P56919J306891J260043R16421O67393
1854G64038801P16984P68722O49869N35190N01573L28183J74582N25117R37283Q94249
1874.4G70070553N94914L64005L72529M93586M50254K47359J57833M20749N60761L23236
1894.7G74055779L26216N55814N17308K59936J91569L29018L69728K85864K51233K59102
1915.1G77401567J77502J14620J36256L04282M73976K83897N1975J42217K58148J10387
$$ plain form
1784.6 718321264 719256818 720352173 721535504 723107457 725085378 726997197 728755295 730655551
1800.9 730655551 732791126 734940171 736923277 738653958 740300477 742074549 743884623 745498896
1817.2 745498896 746896982 748127341 749227822 750301361 751270890 752210975 753623247 755210161 756306946
1835.6 756306946 757143736 758072436 758777082 759131134 759888053 761194944 762454987 763371408 764038801
1854 764038801 764755785 765524507 766174376 766709566 767211139 767539322 767713904 768239021 769176304 770070553
1874.4 770070553 770665467 771029472 771402001 771895587 772345841 772593200 772751033 773171782 773732543 774055779
1894.7 774055779 774381995 774937809 775455117 775715053 775906622 776235640 776605368 776891232 777142465 777401567
1915.1 777401567 777579069 777693689 777829945 778134227 778608203 778892100 778944075 779086292 779344440 779454827
1935.5G79454827o1631p9334p0512j4067P5639J30832J89960J14143p1347o0558P9512
1958G79687464M4346j05560j04964K0028R1135J5676k1636J16050J21117p5877j23739
1980.4G79664040L9517Q3387q6188j97291j08183K0683m768j07885o6876J7881j04725
2002.8G79149592k64406k13445r4652j85847l53992l26872k04682k19047l21985k49624
2023.2G76715040j02222j86682l80516l27289j28030j33098k99334k96950r6918l8802
2043.6G74725199j69218j79708q941M6969o4731p3969N7161Q3208m8638r8705P4208
2066.1G74342835K17318O0857r6083L9160J87934P1525m0948R6738K14815R0361m8399
2088.5G75136113O4373K15471J11937o1035K3663K06411J55747j4782N663J39057R2686
$$ plain form
1935.5 779454827 779393196 779313862 779243350 779229283 779304922 779435754 779625714 779739857 779668510 779607952 779687464
1958 779687464 779731810 779626250 779521286 779541314 779632449 779648125 779626489 779742539 779863656 779787779 779664040
1980.4 779664040 779703557 779786944 779700756 779503465 779395282 779415965 779411197 779303312 779236436 779254317 779149592
2002.8 779149592 778885186 778671741 778577089 778391242 778037250 777710378 777505696 777286649 776964664 776715040
2023.2 776715040 776612818 776426136 776045620 775718331 775590301 775457203 775157869 774860919 774764001 774725199
2043.6 774725199 774555981 774376273 774367332 774414301 774349570 774275601 774332762 774415970 774367332 774268627 774342835
2066.1 774342835 774560153 774621010 774524927 774564087 774752021 774823546 774782598 774879336 775094151 775184512 775136113
2088.5 775136113 775200486 775415957 775527894 775466859 775490522 775696933 775852680 775837898 775843561 775982618 776075304
2110.9G76075304k7895L6060K06829K06410N5552M1485J81436J85371K2351J789J52945
2133.4G77137637J90020N1260L4153J85371J81317j431k2351J77204K75374J55389
2153.8G78363943N8413J77443L07500K18988J33633K58207L62933K81751K15054L07023
2174.2G80684888L87669K83718J64449K29895L54827L18706K10702K73466L91782L19719
2194.6G83619821J84298K31266L54290L13997J91688K28823L69310L84927K81155K44081
2215G86403656L11136L05414J87695J73390L12746L52740K16067J12534J60157K24054
2235.4G88759589J75178J25766J62780J86980J16587M9412J02282J83343J25707m77
2255.8G89987147L1173J59502J61409O1632M4465J12653J23560O1095P0572J58608
$$ plain form
2110.9 776075304 776047409 776083469 776290298 776496708 776552260 776593745 776775181 776960552 776982903 776984692 777137637
2133.4 777137637 777327657 777378917 777413070 777598441 777779758 777778327 777755976 777933180 778208554 778363943
2153.8 778363943 778422356 778599799 778907299 779126287 779259920 779518127 779881060 780162811 780377865 780684888
2174.2 780684888 781072557 781356275 781520724 781750619 782105446 782424152 782634854 782908320 783300102 783619821
2194.6 783619821 783804119 784035385 784389675 784703672 784895360 785124183 785493493 785878420 786159575 786403656
2215 786403656 786714792 787020206 787207901 787381291 787694037 788046777 788262844 788375378 788535535 788759589
2235.4 788759589 788934767 789060533 789223313 789410293 789526880 789576292 789678574 789861917 789987624 789987147
2255.8 789987147 790018320 790177822 790339231 790400863 790445328 790557981 790681541 790742636 790813208 790971816
2276.1G90971816J35123N7817Q2552J15335L5823j05083j60993p9452l6061j33097
2296.5G90883780k03848j68562j36435k44975l98815l99590k96414k49803l20136m29750
2316.9G88035452n38051n90086m89771l03865k25961l11732l34978j43707J1504m9591
2337.3G85059214k00272j70827K32697R21428J187920N24521n67615j337707j363516
2355.7G84285843r42766m11392Q7321M72009Q23141J164555J295269J204312J180410
2374G89158702J252532J242638J115918R20474P28250N05507J94609n1797r0003m5657
2394.4G94931173p5519j62482j74463r5367j14084k35438k48194j74403j94013k62797
2414.8G93194413k41756j96517k80261l88562l48986k50160k48015l40104l67225k79486
$$ plain form
2276.1 790971816 791106939 791164756 791247308 791362643 791398466 791293383 791132390 791052938 791016877 790883780
2296.5 790883780 790679932 790511370 790374935 790129960 789731145 789331555 789035141 788785338 788465202 788035452
2316.9 788035452 787497401 786907315 786417544 786113679 785887718 785575986 785241008 785097301 785108805 785059214
2337.3 785059214 784858942 784688115 784920812 785842240 787030160 787554681 786987066 785649359 784285843
2355.7 784285843 783343077 782931685 783019006 783491015 784314156 785478711 786773980 787978292 789158702
2374 789158702 790411234 791653872 792769790 793690264 794418514 794924021 795118630 795066833 794976830 794931173
2394.4 794931173 794855654 794693172 794518709 794423342 794309258 794073820 793825626 793651223 793457210 793194413
2414.8 793194413 792952657 792756140 792475879 792087317 791738331 791488171 791240156 790900052 790532827 790253341
2435.2G90253341k52425l74198m52161l84927l46661m14788m69447m30822l88563m43935
2455.6G86295414n17666n17428n27203o00040o26326n60582n50508o71029p72655p66158
2476G80185819p62105q56996r11772q26180p46608p68185q20994q04663p31766o79672
2496.4G72276878o48975n69999m49300l92199m31835m93527n39601o36935p66814p81118
2516.8G66566575o42777m72248l74853k94864j45078j9670l57K2828R7990Q5652r4354
2539.2G64728844k90096l48985k90096k10523j70887j30951p7367j01089k18571k82049
2559.6G62608230k37584k23100k83539l17276l04580l15368l63588m13716m27246m21643
2580G59300590m51684n01931n04732m49419m09842m55022n27203n43237n52833n92172
$$ plain form
2435.2 790253341 790000916 789626718 789174557 788789630 788442969 788028181 787558734 787127912 786739349 786295414
2455.6 786295414 785777748 785260320 784733117 784133077 783506751 782946169 782395661 781724632 780951977 780185819
2476 780185819 779423714 778566718 777654946 776828766 776082158 775313973 774492979 773688316 772956550 772276878
2496.4 772276878 771627903 771057904 770608604 770216405 769784570 769291043 768751442 768114507 767347693 766566575
2516.8 766566575 765923798 765451550 765076697 764781833 764636755 764617085 764616728 764639556 764737546 764823198 764728844
2539.2 764728844 764438748 764089763 763799667 763589144 763418257 763287306 763209939 763108850 762890279 762608230
2559.6 762608230 762370646 762147546 761864007 761546731 761242151 760926783 760563195 760149479 759722233 759300590
2580 759300590 758848906 758346975 757842243 757392824 756982982 756527960 756000757 755457520 754904687 754312515
2600.4G54312515o18040o18339o43492p01964p02083o37233o37293p26938p69556p36951
2620.8G47520626p37369p91848q21054p86960p57158p99239q34226p72655p15971p51317
2641.2G39752829q02219p88092p42853p54893q06808p71046o53684o55473p62045p27534
2661.6G32288182o11484o60658p81953p34389n88298n80609o72936o81222o19829o02841
2682G25753963o42657o36161n75184n87583o75738p27415p18534p35641q20338q80778
2702.4G18753934q64089q63909r36151j008332j013159j008153j041532j067340j060725
2720.8G09890544j044452j043319j051605j026869r30786q25823q01265q14438q06749
2739.1G01545238q04603q29815q52406q47340q38816q49843q63135q65102q83818r45508
$$ plain form
2600.4 754312515 753694475 753076136 752432644 751730680 751028597 750391364 749754071 749027133 748257577 747520626
2620.8 747520626 746783257 745991409 745170355 744383395 743626237 742826998 741992772 741220117 740504146 739752829
2641.2 739752829 738950610 738162518 737419665 736664772 735857964 735086918 734433234 733777761 733015716 732288182
2661.6 732288182 731676698 731016040 730234087 729499698 728911400 728330791 727657855 726976633 726356804 725753963
2682 725753963 725111306 724475145 723899961 723312378 722636640 721909225 721190691 720455050 719634712 718753934
2702.4 718753934 717889845 717025936 716089785 715081453 714068294 713060141 712018609 710951269 709890544
2720.8 709890544 708846092 707802773 706751168 705724299 704793513 703967690 703166425 702351987 701545238
2739.1 701545238 700740635 699910820 699058414 698211074 697372258 696522415 695659280 694794178 693910360 692964852
2759.5F92964852r86874r82762j012563j058877j038372j008749j073659j177609j217067
2777.9F83408320j221716j251936j307011j378000j429319j469374j561642j685679
2794.2F72103643j753032j761973j824975j940369k003014k078593k241850k346754
2810.5F56153083k363324k454937k650022k892256l099740l234744l397882l655493
2826.8F32404685l950596m312157m897058n762637o968796q685232j1094510j4232934
2843.1E72500765j7450332j8698097j5439212p959962j84774M470348N779982N083740
2859.5E28102458L431141J331389q25048k589881l595710l677130l053009k302766
2875.8E16821444j886666j853883k150595k678097l145039l399551l549605l675878
$$ plain form
2759.5 692964852 691977978 690995216 689982653 688923776 687885404 686876655 685802996 684625387 683408320
2777.9 683408320 682186604 680934668 679627657 678249657 676820338 675350964 673789322 672103643
2794.2 672103643 670350611 668588638 666763663 664823294 662820280 660741687 658499837 656153083
2810.5 656153083 653789759 651334822 648684800 645792544 642692804 639458060 636060178 632404685
2826.8 632404685 628454089 624141932 619244874 613482237 606513441 597828209 586733699 572500765
2843.1 572500765 555050433 536352336 520913124 512953162 512768388 517238736 523018718 528102458
2859.5 528102458 531533599 532864988 532039940 529450059 525854349 522177219 519124210 516821444
2875.8 516821444 514934778 513080895 510930300 508252203 505107164 501707613 498158008 494482130
2892.1D94482130l757000l781349l827750m021734m435391n113720o194979p880867
2908.4D55469340j0224253j2707770j3983458j2776226r279698n009562j297921J486153
2924.7C91676605L431648M693508N589902O357938O993026P458895P648856P429629
2941D41280007O840378N907149M590600L035695J605659P71910Q26776J639486K800315
2959.4D69297975L975690N051195N983651O682754P033437P037640O840586O523311
2975.7E18426239O127477N760610N385518M903674M359067L802299L260375K718627
2992E54743886K137959J523852Q71897K21908l32057p49231j028418j155615j109123
3010.4E55125058r28641p15494n82933o25551q51035j204431j581669j840532j992524
$$ plain form
2892.1 494482130 490725130 486943781 483116031 479094297 474658906 469545186 463350207 455469340
2908.4 455469340 445245087 432537317 418553859 405777633 396497935 391488373 390190452 391676605
2924.7 391676605 395108253 399801761 405391663 411749601 418742627 426201522 433850378 441280007
2941 441280007 448120385 454027534 458618134 461653829 463259488 464031398 464858174 466497660 469297975
2959.4 469297975 473273665 478324860 484308511 490991265 498024702 505062342 511902928 518426239
2975.7 518426239 524553716 530314326 535699844 540603518 544962585 548764884 552025259 554743886
2992 554743886 556881845 558405697 559277594 559499502 559167445 558418214 557389796 556234181 555125058
3010.4 555125058 554196417 553480923 552897990 552272439 551421404 550216973 548635304 546794772 544802248
3028.7E44802248k108335k148271k168297k272129k427936k542257k593696k624155
3045.1E25917172k667248k731919k768338k769112k769828k748609k699256k642214
3061.4E04120648k589047k540410k451777k340943k304107k299279k261787k252639
3077.7D85080659k308428k354294k321601k283126k289712k281517k255112k286703
3094D66700166k362430k395600k433508k551824k679646k730161k736122k789229k871275
3112.4D43150371k920240k952993l025949l152787l252537l270149l277033l333748
3128.7D17964935l394395l444642l488451l521889l559709l587753l614097l668100
3145C89685899l695786l653824l632665l685415l772139l804028l765375l757983l779650
$$ plain form
3028.7 544802248 542693913 540545642 538377345 536105216 533677280 531135023 528541327 525917172
3045.1 525917172 523249924 520518005 517749667 514980555 512210727 509462118 506762862 504120648
3061.4 504120648 501531601 498991191 496539414 494198471 491894364 489595085 487333298 485080659
3077.7 485080659 482772231 480417937 478096336 475813210 473523498 471241981 468986869 466700166
3094 466700166 464337736 461942136 459508628 456956804 454277158 451546997 448810875 446021646 443150371
3112.4 443150371 440230131 437277138 434251189 431098402 427845865 424575716 421298683 417964935
3128.7 417964935 414570540 411125898 407637447 404115558 400555849 396968096 393353999 389685899
3145 389685899 385990113 382336289 378703624 375018209 371246070 367442042 363676667 359918684 356139034
3163.4C56139034l774613l757447l733009l701121l664404l631145l618866l586292
3179.7C26672137l543973l543765l553152l500551l394097l323465l301323l288984
3196B99222827l282338l263802l182232l064066l004849l017038k998799k923280k860874
3214.3B71625549k844036k859354k820581k730578k674461k655387k643674k600536
3230.7B49796942k538085k543882k572387k519488k440021k394467k380997k352029
3247B30055586k277762k194464k130211k110198k150521k164259k102733k053290k009318
3265.3B10862830j917854j826837j789734j761615j700014j636654j574800j529321
3281.6A97126001j500636j416907j320466j288176j258284j220643j218260j216560
$$ plain form
3163.4 356139034 352364421 348606974 344873965 341172844 337508440 333877295 330258429 326672137
3179.7 326672137 323128164 319584399 316031247 312530696 309136599 305813134 302511811 299222827
3196 299222827 295940489 292676687 289494455 286430389 283425540 280408502 277409703 274486423 271625549
3214.3 271625549 268781513 265922159 263101578 260371000 257696539 255041152 252397478 249796942
3230.7 249796942 247258857 244714975 242142588 239623100 237183079 234788612 232407615 230055586
3247 230055586 227777824 225583360 223453149 221342951 219192430 217028171 214925438 212872148 210862830
3265.3 210862830 208944976 207118139 205328405 203566790 201866776 200230122 198655322 197126001
3281.6 197126001 195625365 194208458 192887992 191599816 190341532 189120889 187902629 186686069
3298A86686069j175940j105398j034498j031116j103550j154393j147121j124189j098439
3316.3A76711425j072481j071647j105949j140639j141757j134396j122430j118630
3332.6A67803496j105308j047090j062557j144707j168117j181960j177460j101911
3348.9A58814386j066432j155466j229137j131043j014381j038060j072779j003489
3365.3A50103599r48548j025126j115262j033917q58412p74249p64936p84591p64355
3383.6A42034203o36965m25533k86355l93704n72100m81412j89021q1718l02911n13688
3404A38150796l49641p4237L1039M5285K6509K7329P0869J24067K02194L52800N17652
3426.5A39124662O00800N65454O18905P56860O93485N20631N10887O89000Q93786R69425
$$ plain form
3298 186686069 185510129 184404731 183370233 182339117 181235567 180081174 178934053 177809864 176711425
3316.3 176711425 175638944 174567297 173461348 172320709 171178952 170044556 168922126 167803496
3332.6 167803496 166698188 165651098 164588541 163443834 162275717 161093757 159916297 158814386
3348.9 158814386 157747954 156592488 155363351 154232308 153217927 152179867 151107088 150103599
3365.3 150103599 149155051 148129925 147014663 145980746 145122334 144348085 143583149 142798558 142034203
3383.6 142034203 141397238 140971705 140685350 140291646 139719546 139238134 139049113 138967395 138664484 138150796
3404 138150796 137801155 137726918 137757957 137803242 137829751 137857080 137927949 138052016 138254210 138607010 139124662
3426.5 139124662 139725462 140290916 140909821 141666681 142360166 142880797 143391684 144080684 144974470 145943895
3446.8A45943895Q90821R08777J071573J169696J239017J351908J283183J204163J443461
3465.2A56506494J619234J391933J096308J213208J562908J830146J875877J705200
3481.5A68801308J702681J889124J903028J824513J875400J942098J989142K040654
3497.8A83967948K131998K197102K117530K078011K220273K414987K642497K721101
3514.2B02491447K548769K512396K714500K922475K844021K683609K808094L078282
3530.5B24603593L288538L410697L390967L318176L498137L767505L817395L690079
3546.8B52785087L760248L982514M094720M163861M322708M537731M563272M416764
3563.1B86626905M483968N044610N465924N365342N271226N414427N619973N809903
$$ plain form
3446.8 145943895 146834716 147743493 148815066 149984762 151223779 152575687 153858870 155063033 156506494
3465.2 156506494 158125728 159517661 160613969 161827177 163390085 165220231 167096108 168801308
3481.5 168801308 170503989 172393113 174296141 176120654 177996054 179938152 181927294 183967948
3497.8 183967948 186099946 188297048 190414578 192492589 194712862 197127849 199770346 202491447
3514.2 202491447 205040216 207552612 210267112 213189587 216033608 218717217 221525311 224603593
3530.5 224603593 227892131 231302828 234693795 238011971 241510108 245277613 249095008 252785087
3546.8 252785087 256545335 260527849 264622569 268786430 273109138 277646869 282210141 286626905
3563.1 286626905 291110873 296155483 301621407 306986749 312257975 317672402 323292375 329102278
3579.4C29102278N925745N842328N758136N971521O367207O409466O396443O627083
3595.7C78400207O891846O989837O933123O820500O743282O938994P177531P230640
3612.1D34125960P156461O916821O975383P545769P691652P288754P043302P677376
3628.4D92421478Q450717P988035P541419P384359P239104P071077O699622O148398
3644.7E50944209N842090O374955P073462O707132O163657O167292O090284N604982
3661F00968063N070984M696965M285694L979921M117548M024566L754139M036784M183888
3679.4F39118552L809273L308952K792299K184630J603722J846016K395033K406359
3695.7F59464836K240062K253950K488970K809227K774894K237201J734018J838625
$$ plain form
3579.4 329102278 335028023 340870351 346628487 352600008 358967215 365376681 371773124 378400207
3595.7 378400207 385292053 392281890 399215013 406035513 412778795 419717789 426895320 434125960
3612.1 434125960 441282421 448199242 455174625 462720394 470412046 477700800 484744102 492421478
3628.4 492421478 500872195 508860230 516401649 523786008 531025112 538096189 544795811 550944209
3644.7 550944209 556786299 563161254 570234716 576941848 583105505 589272797 595363081 600968063
3661 600968063 606039047 610736012 615021706 619001627 623119175 627143741 630897880 634934664 639118552
3679.4 639118552 642927825 646236777 649029076 651213706 652817428 654663444 657058477 659464836
3695.7 659464836 661704898 663958848 666447818 669257045 672031939 674269140 676003158 677841783
3712F77841783K332806K258837J701475J260638J041531R90391J099825J341820J190305
3730.3F91059411O00636L88085R43482J507461J427949O63340K4974Q03292J188338
3748.7F98606968O26028R29415J497328J241863Q16226Q78334R91583O62148M45485
3767.1G06695378N18024O72519Q78334Q04663N55217L60966M16875N22434N16713O63638
3787.5G12604761O83904M30584J86920k4796N96M9413p4745N06878P49708M42147P11679
3809.9G16267049P81536J59920m66168j60039L4273L3200P35163Q72851N39839K48611
3830.3G19046235J2875J08182n5492m02033J13666P16031Q24511P06017L06725l64542
3850.7G21012175j209676o28948R97245J114011L85940j29998o3360J82748p0214j57237
$$ plain form
3712 677841783 680174589 682433426 684134901 685395539 686437070 687427461 688527286 689869106 691059411
3730.3 691059411 691660047 692048132 692991614 694499075 695927024 696590364 696615338 697418630 698606968
3748.7 698606968 699232996 700162411 701659739 702901602 703717828 704596162 705587745 706249893 706695378
3767.1 706695378 707213402 707885921 708764255 709568918 710124135 710485101 710901976 711424410 711941123 712604761
3787.5 712604761 713288665 713719249 713906169 713881373 713881969 713931382 713856637 714363515 715113223 715555370 716267049
3809.9 716267049 717048585 717208505 716742337 716582298 716616571 716649771 717384934 718257785 718797624 719046235
3830.3 719046235 719059110 719167292 719111800 718709767 718823433 719539464 720363975 721069992 721376717 721012175
3850.7 721012175 719802499 719173551 720170796 721284807 721670747 721540749 721477389 721660137 721589923 721432686
3871.1G21432686L07083N26726M96149K0266k89142J34289J64151J46032K26020j08778
3891.5G23055482M4227L95596l279n56588n14865p3731M66883P49052N12779J35064
3911.9G24210620r6321k67506j99556P4148J32561J2994L8981J02937j9848k9206J83403
3934.3G24143207J99974J8179q7321j37269p3195L2068j908O9916K34366J72675j5915
3956.7G24554777m6372K0504O4194Q9467P7962Q1480Q7440J6153k8312N9843J10030
3979.2G25087166Q6784J07587Q7201k4736o3121K6703J11103J60992J76013
3997.5G25755692
$$ plain form
3871.1 721432686 721739769 722266495 722762644 722782910 722493768 722628057 722792208 722938240 723164260 723055482
3891.5 723055482 723099709 723495305 723492026 722935438 722420573 722346842 722813725 723562777 724075556 724210620
3911.9 724210620 724114299 723846793 723647237 723721385 723853946 723866940 723905921 724008858 723989010 723959804 724143207
3934.3 724143207 724343181 724361360 724274039 724136770 724063575 724095643 724093735 724163651 724398017 724570692 724554777
3956.7 724554777 724508405 724528909 724593103 724682570 724760532 724842012 724929452 724945605 724917293 724977136 725087166
3979.2 725087166 725173950 725281537 725368738 725344002 725280881 725307584 725418687 725579679 725755692
3997.5 725755692
##END=$$ End of the data block
