##TITLE=$$ Begin of the data block
##JCAMP-DX=5.00 $$ ACD/SpecManager v 10.08
##SPECTROMETER/DATA SYSTEM=Alpha
##DATE=11 Jun 2014 19:36:16
##DATA TYPE=INFRARED SPECTRUM
##DATA CLASS=XYDATA
##ORIGIN=
##OWNER=
##NPOINTS=1765
##FIRSTX=399.75695801
##LASTX=3997.56933594
##MAXX=3997.56933594
##MINX=399.75695801
##MAXY=0.79667372
##MINY=0.13753201
##XFACTOR=1.0000000000
##YFACTOR=1.000000000000000e-9
##FIRSTY=0.44957131
##DELTAX=2.03957629
##XUNITS=1/CM
##YUNITS=ARBITRARY UNITS
##XYDATA=(X++(Y..Y))
399.8 449571311 449691147 449538112 448309720 447203636 447149605 447171301 446277052 444883287 443718553
418.1 443718553 443024039 442001939 440673739 439981550 439308643 437737167 436185062 435550034 435314327
436.5 435314327 434752285 433844388 433024108 432484657 431719124 430614203 429575503 428267866 426302761
454.8 426302761 423971444 421892881 420155644 418128610 416003942 414339393 412750363 410848141
471.1 410848141 409518242 409512699 409953833 410122663 410217077 410447627 410760254 410973758 410952032 410758406
491.5 410758406 410558134 410244256 409753859 409274012 408715338 407755286 406392455 405029774 403766453
509.9 403766453 402214050 400417596 398791641 397259980 395468235 393391490 391481698 390101284
526.2 390101284 388873607 387622833 386874378 386623770 386197805 385508031 385162145 385274619 385238230 384889990
546.6 384889990 384662867 384572715 384141177 383196175 382185757 381444901 380522072 378924787 377061129
565 377061129 375183403 372697443 369476706 366288245 363597661 361167103 359001726 357806712 358027011
583.3 358027011 358943194 359841377 360853463 362047344 362726003 362404287 361657560 360968828 359950125
601.7 359950125 358316660 356787682 356113315 356130660 356613249 358129293 361053258 364874363 369004428
620 369004428 373462915 378424942 383271635 387305498 390966594 395004272 399054229 402411669 405419469
638.4 405419469 408740550 411873132 414075851 415830970 417758167 419519246 420746893 421929538
654.7 421929538 423549742 425194114 426287979 427146852 428024143 428449064 428883076 430361927 432414174
673.1 432414174 434627205 436544001 438227564 440214455 442233086 443591565 444591939 445922375
689.4 445922375 447305858 447869629 447374105 446461439 446577549 448505551 451067120 453069150 454012364
707.7 454012364 453066826 451673865 453739464 459250391 464399725 468277633 472580731 477699488 482778341
726.1 482778341 487325519 491562456 495512933 498708040 501072407 503182471 505411506 507536769
742.4 507536769 509463727 511407673 513349295 514789581 515293539 515034914 514245510 512636900 510013521
760.8 510013521 506993175 504632533 503719747 504755437 508066833 513191164 518605530 522791028 525481999
779.1 525481999 527285099 528535306 529214382 529369295 529108882 528187096 526174486 523104191 519355953
797.5 519355953 514928341 509438932 502809227 495524257 488253266 481486917 475850880 472455263
813.8 472455263 472372830 475893497 482747316 492620260 504964352 518584371 531703770 542827010
830.1 542827010 551410437 557424366 560900271 562105715 561351418 559448838 557732940 556318521 554547012
848.5 554547012 551499426 546459019 542387903 543479681 548571110 552819729 553358674 550194621 543681800
866.8 543681800 533486128 521378398 512287617 509779632 514434636 525801599 541051447 555327713
883.1 555327713 565569937 571602404 574700296 576100051 576330841 575972795 576120913 577358425 579181969
901.5 579181969 580924153 582316160 582930028 581903577 578831136 574491501 569957674 565519810 561124146
919.8 561124146 557031333 553242266 549047947 543836415 537898719 531961620 526375115 521444321
936.2 521444321 517916799 516304135 516289949 517314732 519247591 521957040 524492681 525543511 524657011
954.5 524657011 522244990 518614173 513940811 508810759 503553867 497482121 489696234 480137825
970.8 480137825 469260603 457163483 443669826 429070145 414057523 398905337 383466393
985.1 383466393 367897421 352571428 337506175 322545379 307881266 293961138 281067580
999.4 281067580 269241095 258494705 248906523 240345061 232405335 224834666 217671677 210910425
1015.7 210910425 204461247 198448271 193263412 189313516 186796784 185744211 186158955 188011050
1032 188011050 191073120 194879070 199004844 203264013 207431674 211152509 214163274 216306791 217517465
1050.4 217517465 217926636 217955217 218154117 218851566 219982475 221261665 222357899 222869366 222393647
1068.7 222393647 220757440 218251809 215607896 213579655 212498918 212603912 214506537 218150124
1085 218150124 222419024 226718545 231264681 236193553 241419315 246871516 252569646 258386821 264042407
1103.4 264042407 269376427 274410725 279130161 283438206 287404835 291271299 295138568 298932523
1119.7 298932523 302711070 306715697 310946703 314859182 317699671 318811119 317707241 314352393
1136 314352393 309406400 303997517 299172372 295554757 293384433 292833924 294080853 297097325 301702410
1154.4 301702410 307742745 314968914 322899729 331119776 339588344 348441392 357599586 366859168
1170.7 366859168 376255155 385901034 395564854 404812932 413372815 421038061 427374840 431846082
1187 431846082 434208125 434522569 432805181 428979635 423284978 416397959 408949018 401217252 393482000
1205.4 393482000 386131018 379269451 372710407 366368324 360385239 354872167 349711180 344818652
1221.7 344818652 340385556 336582720 333328456 330474138 328062862 326229990 324892521 323841453
1238 323841453 323057532 322625756 322426498 322243780 322102964 322178483 322440267 322747201 323210508 324150413
1258.4 324150413 325736552 327888995 330610216 334083468 338328570 343119830 348331213 354075342
1274.7 354075342 360385656 367006779 373724937 380617559 387672693 394582927 401086092 407202303
1291 407202303 412939787 418054581 422394246 426273584 430076897 433730602 436997831 439921767 442657262
1309.4 442657262 445005924 446639955 447596520 448202312 448641509 448939323 449246109 449691683 450048655
1327.8 450048655 449960530 449515194 448988706 448331326 447310060 446174353 445456415 445070922 444637328
1346.1 444637328 444103420 443555683 442656934 440852493 438038230 434611171 430565923 425590694 420294493
1364.5 420294493 415380567 410658270 406011581 401212871 396285713 392092049 388775200 386010677
1380.8 386010677 383850902 382307947 381015420 379616320 377944350 375410318 371593446 366911173
1397.1 366911173 361595064 356083721 350438386 344114125 337856740 332231462 327056974 322504103
1413.4 322504103 318771899 315693378 313455015 312611461 312733680 313359141 314183056 314878225 315436751
1431.8 315436751 315929443 316288263 316725910 317245990 317566037 317610621 317390561 316933990 316495657 316171974
1452.2 316171974 315994531 316444606 318490386 321420193 323974669 326157361 328814924 332757324 338626385
1470.5 338626385 347399473 357560426 366939008 375333726 382728070 389091522 394140869 397906601
1486.8 397906601 400572360 402426839 403603345 403842807 403111696 402126729 401261747 399975330 396914661
1505.2 396914661 391355515 386760294 383106381 378914207 374643177 371361762 369554818 368243426
1521.5 368243426 367009252 365821123 364446640 362994164 360938549 357995898 355560750 353810877
1537.8 353810877 352339238 353211880 356667846 361083418 365611285 370379388 375521272 380847186
1554.1 380847186 385844409 391490340 398692638 404327959 408603132 412165999 414944559 417239159
1570.5 417239159 418915838 419950962 421342164 424062669 427362531 430284858 432388335 433426291
1586.8 433426291 433141738 431409180 428551257 424866289 420428574 415136814 408901840 401936382
1603.1 401936382 394405395 386152089 377068251 367799401 358776003 348541439 336503565 326629758
1619.4 326629758 318124413 308373570 299075842 291068166 284024805 278566778 273903489 268933564
1635.7 268933564 265432268 263675928 262470514 261567235 260948300 261030287 261788219 262771904 264762938
1654.1 264762938 267882288 271340370 275464177 280787081 287087053 293278456 300119132 308405995
1670.4 308405995 316646785 325350106 335050046 344307303 353036374 362762958 375670165 388515919
1686.7 388515919 400014430 412093103 423782885 436783910 451895744 468174398 487459987
1701 487459987 504219949 518453121 532691419 545024812 555431724 564481676 572644234 581050396
1717.3 581050396 589316726 596207798 602091670 607345700 611801445 615656912 618924201 622125566
1733.6 622125566 625952363 629919708 634289324 639471054 645234883 651368141 657766938 664677799
1749.9 664677799 671918273 678310931 683886647 689026058 693507612 697710335 701662660 704920948
1766.3 704920948 707460463 709545791 711731076 714110196 715848625 716817260 717631340 718638241 719592869
1784.6 719592869 720515013 721612692 722806573 724372089 726325393 728214800 729973137 731894374
1800.9 731894374 734047592 736201763 738182247 739895821 741534591 743333519 745175123 746813715
1817.2 746813715 748226523 749461412 750569940 751628935 752545416 753476739 754939854 756546080 757619977
1835.6 757619977 758444607 759377658 760080278 760453522 761241734 762522817 763728499 764629781 765303850
1854 765303850 766025722 766804636 767439723 767939925 768437326 768792510 768994749 769547760 770488083 771340847
1874.4 771340847 771909058 772298157 772700071 773192704 773615837 773836493 774015009 774487555 775069654 775386214
1894.7 775386214 775706470 776253819 776755452 777005315 777184069 777477682 777809441 778109193 778414130 778696179
1915.1 778696179 778858662 778973818 779136062 779463470 779938161 780193985 780216038 780355513 780622542 780734003
1935.5 780734003 780686140 780638218 780584097 780577540 780677915 780834734 781011403 781054974 780905068 780829728 780959368
1958 780959368 781054974 780952752 780826330 780841172 780932367 780946314 780927300 781040311 781160891 781091034 780971885
1980.4 780971885 781028688 781126440 781029046 780828416 780744374 780777037 780748904 780630648 780584872 780586064 780416131
2002.8 780416131 780139387 779975533 779896379 779702783 779361546 779043019 778841853 778634012 778327763 778088808
2023.2 778088808 777962923 777735114 777359903 777074635 776955724 776799142 776501238 776222289 776112735 776044071
2043.6 776044071 775854766 775673568 775694788 775774837 775711894 775623441 775677800 775769114 775713444 775611341 775695980
2066.1 775695980 775891125 775924444 775854945 775934875 776135445 776214302 776181817 776280284 776496828 776595533 776563287
2088.5 776563287 776636600 776829123 776899576 776823163 776870310 777102232 777250707 777217865 777225375 777374864 777456880
2110.9 777456880 777411103 777461171 777699172 777914345 777944684 777975380 778184950 778377354 778375328 778380990 778557658
2133.4 778557658 778735280 778748691 778754532 778948069 779179513 779233813 779234588 779383242 779608488 779743969 779827774
2155.8 779827774 780037224 780347884 780552089 780671656 780934632 781326950 781639278 781861067 782153785 782526016
2176.2 782526016 782792807 782965779 783257782 783651829 783951044 784150481 784420133 784782350 785080850 785285532
2196.6 785285532 785548627 785909414 786225080 786434650 786670685 787029207 787393510 787643015 787876189 788215518
2217 788215518 788555741 788761735 788939774 789228141 789535880 789732695 789873183 790072620 790298998 790472031
2237.4 790472031 790621698 790794849 790976226 791097701 791147590 791213751 791338444 791438580 791466057 791540384
2257.8 791540384 791711330 791844070 791876793 791935563 792089760 792227507 792276561 792335093 792475998 792592227
2278.2 792592227 792650402 792763948 792924762 792988002 792888522 792729616 792644262 792598188 792474449 792275548
2298.6 792275548 792086422 791944087 791733921 791381478 791009009 790714025 790455043 790143311 789735496 789227962
2319 789227962 788676560 788216293 787937045 787701130 787347555 786976159 786778212 786756873 786729097 786563337
2339.4 786563337 786446154 786744893 787661970 788797379 789270103 788662076 787364483 786070585 785092533
2357.7 785092533 784659982 784829915 785346687 786102355 787223756 788558483 789751768 790862083 792098582
2376.1 792098582 793340981 794416964 795303881 796010137 796490192 796673715 796621978 796544075 796511531 796409726
2396.5 796409726 796203613 796019495 795942307 795845389 795633435 795416355 795256078 795055449 794771791 794503748
2416.9 794503748 794310749 794080496 793719769 793341696 793062150 792794824 792429745 792071342 791825414 791567981
2437.3 791567981 791159987 790682077 790306389 790001929 789595306 789092004 788643956 788245857 787758768 787210524
2457.7 787210524 786731422 786262453 785677969 785035551 784455836 783903658 783254862 782487392 781681418 780879617
2478.1 780879617 780034304 779164493 778352857 777581215 776789308 775977373 775203884 774511695 773857713 773211062
2498.5 773211062 772634923 772145510 771690428 771239340 770761967 770226061 769565225 768768847 767983675 767362297
2518.9 767362297 766920805 766573966 766291857 766140103 766116679 766117096 766127110 766211390 766298652 766231954 765968680
2541.3 765968680 765613496 765308082 765084624 764907420 764792144 764725447 764615595 764408231 764148891 763893783
2561.7 763893783 763633847 763336301 763016284 762731552 762461901 762095511 761628032 761163414 760713816 760232508
2582.1 760232508 759732187 759270012 758859634 758428991 757911801 757353306 756826758 756303370 755721807 755102277
2602.5 755102277 754503191 753893435 753224075 752550423 751911998 751241505 750485420 749711037 748979151 748240232
2622.9 748240232 747442782 746620953 745828032 745031595 744187713 743357778 742616296 741906226 741129100 740304410
2643.3 740304410 739533126 738823652 738069594 737257898 736503422 735843599 735182524 734462082 733768284 733144164
2663.7 733144164 732486010 731747389 731016219 730362356 729718029 729024172 728348255 727733672 727128267 726487100
2684.1 726487100 725851655 725268066 724681377 724003196 723253369 722523153 721803427 721006393 720148623 719315290
2704.5 719315290 718462288 717475414 716389298 715362072 714401364 713380277 712298095 711245358 710219681
2722.8 710219681 709156871 708099842 707137287 706256866 705393672 704529405 703693986 702898502 702103078
2741.2 702103078 701274931 700446367 699639857 698829174 697978556 697089672 696205139 695292711 694311798 693329751
2761.6 693329751 692363501 691345215 690279841 689245760 688252330 687213480 686071098 684837580 683562279
2779.9 683562279 682276547 680951893 679560900 678126454 676666856 675132275 673465788 671720803
2796.2 671720803 669957161 668114305 666157186 664137721 662048638 659828901 657489061 655068576
2812.5 655068576 652552247 649891436 647031784 643967032 640726268 637291670 633602321 629624844
2828.9 629624844 625278473 620349169 614576519 607621491 598944545 587825835 573557258 556074142
2845.2 556074142 537333667 521835148 513817370 513625085 518127978 523925781 529012442 532442570
2861.5 532442570 533782780 532982945 530392945 526769400 523068547 520009696 517726064 515861392
2877.8 515861392 513965309 511716127 509010434 505910695 502515733 498959988 495321363 491567522
2894.1 491567522 487735152 483875811 479868293 475469083 470364183 464159757 456288815 446074963
2910.4 446074963 433382154 419429213 406689376 397423118 392360359 390987784 392422289 395804286
2926.8 395804286 400477022 406060636 412388146 419375658 426865816 434548497 442026824 448908508
2943.1 448908508 454813004 459401518 462471128 464138240 464977533 465839744 467470020 470265895 474282295
2961.4 474282295 479373306 485358059 492009699 499000669 506025851 512875915 519414961 525585830
2977.8 525585830 531381369 536770761 541702330 546106517 549929440 553203106 555956066 558128178
2994.1 558128178 559652388 560522854 560767531 560461462 559717119 558675289 557536781 556471586 555564046
3012.4 555564046 554829001 554199457 553549945 552713215 551529646 549969018 548154175 546171427 544051230
3030.8 544051230 541904986 539737582 537416756 534948111 532438576 529897690 527261257 524524689
3047.1 524524689 521775186 519054115 516311407 513530612 510742724 507996380 505329609 502730548
3063.4 502730548 500196159 497778505 495469242 493176728 490885556 488618940 486333638 483997285
3079.7 483997285 481665552 479400456 477151006 474857032 472572178 470302641 467961162 465550691
3096 465550691 463135242 460699618 458155185 455474675 452742845 450015664 447233886 444353878 441414535
3114.4 441414535 438429892 435377747 432249248 429031312 425742179 422418773 419055313 415656835
3130.7 415656835 412224203 408728540 405181438 401627243 398058653 394438982 390767425 387071669
3147 387071669 383398056 379745841 376044005 372251272 368429929 364640415 360876232 357115746 353351951
3165.4 353351951 349594504 345849603 342146069 338483602 334808648 331100702 327453226 323917568
3181.7 323917568 320379823 316819489 313348979 309979111 306623220 303250521 299897581 296598315
3198 296598315 293354362 290154755 287011027 283966601 281008303 278061271 275104702 272182822 269326597
3216.4 269326597 266491741 263680160 260954767 258284003 255607426 252950102 250355154 247800887
3232.7 247800887 245228261 242636383 240078926 237593114 235178322 232821450 230548784 228319630
3249 228319630 226065725 223829001 221630365 219462767 217352271 215274841 213209748 211208597 209302500
3267.4 209302500 207467794 205675170 203916594 202209800 200568408 198981538 197456196 195993438
3283.7 195993438 194561362 193154275 191795900 190513507 189308882 188124523 186925828 185762361
3300 185762361 184660122 183603898 182557523 181449682 180271164 179088503 177940696 176812023 175676674
3318.4 175676674 174551383 173465595 172396198 171282098 170101851 168930292 167819664 166736037
3334.7 166736037 165659174 164569542 163418770 162228167 161062449 159966812 158931419 157833636
3351 157833636 156624898 155394912 154237449 153148562 152052015 150959238 149925977 148924470 147886530
3369.3 147886530 146810785 145794675 144891739 144052044 143261611 142513037 141818464 141240478 140827596
3387.7 140827596 140508071 140064612 139460444 138941154 138679326 138558179 138305873 137903139 137647331 137585953
3408.1 137585953 137555823 137547493 137546226 137532011 137602612 137783423 138032988 138406321 138901740 139448091 140012026
3430.5 140012026 140698791 141518354 142208144 142668650 143138677 143813848 144686759 145653144 146598488 147593766
3450.9 147593766 148706421 149886683 151120782 152402773 153624997 154836103 156300128 157943279
3467.2 157943279 159378871 160532400 161775470 163335949 165154144 167013243 168733329 170468196
3483.6 170468196 172344312 174187526 175985366 177927881 179986998 182058737 184109837 186217830
3499.9 186217830 188373923 190412983 192432463 194734514 197332174 200034469 202694252 205253065
3516.2 205253065 207823500 210540384 213446185 216317192 219053373 221891165 224977568 228274912
3532.5 228274912 231719956 235153735 238520458 242109627 245942175 249761835 253467977 257250100
3548.8 257250100 261241674 265408874 269682467 274044812 278583258 283170462 287615359 292112619
3565.1 292112619 297191918 302758127 308228254 313522160 318910807 324555069 330415249 336349159
3581.5 336349159 342204750 348048449 354151428 360624224 367138535 373665929 380383044 387297988
3597.8 387297988 394304067 401309311 408217609 414995342 421961546 429190993 436460048 443649948
3614.1 443649948 450613827 457627922 465216964 473001897 480397701 487507820 495209455 503672540
3630.4 503672540 511729538 519418657 526916742 534144640 541149497 547817469 553984642 559887946
3646.7 559887946 566353679 573487580 580199003 586333036 592484593 598629713 604319811 609422863
3663 609422863 614069760 618289113 622257948 626386881 630381703 634101748 638178647 642416537 646231353
3681.4 646231353 649542689 652357101 654548883 656138778 657983601 660409749 662850201 665063679
3697.7 665063679 667250216 669724524 672577024 675396025 677658439 679386854 681183338 683469653
3714 683469653 685739338 687516451 688861489 689950287 690945804 692011595 693313360 694467366 694990158
3732.4 694990158 695359945 696469665 698137403 699587882 700169504 700054228 700763524 701922178 702595294
3750.7 702595294 703627348 705146074 706345737 707116961 707947791 708933234 709640384 710131645 710685194
3769.1 710685194 711375177 712230921 712992191 713495016 713772535 714137733 714702010 715254188 715879321 716534972
3789.5 716534972 717006981 717237651 717238963 717303634 717422903 717386425 717877209 718536615 718892634 719568133
3809.9 719568133 720301986 720433414 720047057 720015705 720095217 720120490 720848262 721637368 722070515 722311437
3830.3 722311437 722371757 722511411 722502291 722125828 722169936 722836971 723642290 724318027 724664986 724346995
3850.7 724346995 723065436 722401917 723480880 724652946 725056589 724921167 724852622 725056946 724978328
3869 724978328 724758506 725020230 725570917 726112187 726150632 725895643 726076126 726268828 726424992 726651847
3889.4 726651847 726520598 726485491 726820409 726807475 726247311 725771606 725752592 726233840 726971745 727448821
3909.8 727448821 727569878 727514982 727285564 727050245 727047503 727145970 727178097 727241337 727336168 727303505 727274120
3932.3 727274120 727426112 727602780 727638125 727539718 727401555 727364123 727395833 727402866 727486908 727669835 727787673
3954.7 727787673 727784395 727784038 727828920 727910876 728058457 728190601 728227913 728206396 728187799 728230715 728354335
3977.1 728354335 728467584 728544950 728640258 728694141 728653610 728650212 728775859 728917122 729019761 729135931
3997.5 729135931
##END=$$ End of the data block
