##TITLE=$$ Begin of the data block
##JCAMP-DX=5.00 $$ ACD/SpecManager v 10.08
##SPECTROMETER/DATA SYSTEM=Alpha
##DATE=11 Jun 2014 08:19:42
##DATA TYPE=INFRARED SPECTRUM
##DATA CLASS=XYDATA
##ORIGIN=
##OWNER=
##NPOINTS=1765
##FIRSTX=399.75695801
##LASTX=3997.56933594
##MAXX=3997.56933594
##MINX=399.75695801
##MAXY=0.70840585
##MINY=0.01598137
##XFACTOR=1.0000000000
##YFACTOR=1.000000000000000e-9
##FIRSTY=0.21243547
##DELTAX=2.03957629
##XUNITS=1/CM
##YUNITS=ARBITRARY UNITS
##XYDATA=(X++(Y..Y))
399.8 212435469 222154289 232262626 243275523 254726440 265932977 276785761 287429005 297788590
416.1 297788590 309169531 321125090 331475019 341591299 351769298 361079484 370013297 378725976
432.4 378725976 386767060 394677520 402985275 410831541 417651206 424031466 430472553 436653018
448.7 436653018 442316592 447963715 453679502 458933800 463471293 467736125 472131342 476108491
465 476108491 479412735 482791722 486551106 490076542 493141949 496440262 499998063 503054380 505735695
483.4 505735695 508753955 511772275 514028549 515993774 518552542 521342278 523474932 525122046
499.7 525122046 527143180 529415786 531118035 532476723 534195781 535950541 537047088 537792385 538965285
518.1 538965285 540294826 541130424 541887701 543231249 544726551 545699239 546551168 547852457 549251020
536.4 549251020 550198436 551066697 552368581 553640664 554298401 554639161 555208921 555785954 555791676 555351555
556.8 555351555 555089355 555174470 555330873 555580974 556114674 556486368 556274295 555983007 556097209 556336939
577.2 556336939 556368470 556522667 557329834 558519900 559281707 559682488 560388744 561093986 561066031 560618520
597.6 560618520 560384989 559991598 558815658 557234824 556030691 555202782 554413021 553954184 554242134
616 554242134 555005908 555643857 556325197 557670772 559171796 559791923 559975147 560839832 562243283 563476443
636.3 563476443 564619362 566015184 567215860 567629158 567692339 567993104 568034768 567290843 566399813 565940082
656.7 565940082 565391362 564304233 563276589 562736928 561822057 560499132 560436010 561054230 561263204
675.1 561263204 560598493 559690595 559218168 558526218 556851268 554655552 552453399 549545050 545112193
693.5 545112193 539465010 532969117 524988055 514962316 503211796 490184128 476441890 463620722
709.8 463620722 453583896 445947349 438799739 432362348 429905266 434494913 446307331 463668764
726.1 463668764 484921306 508255005 531019568 550778508 566846132 579634488 589232028 595699966
742.4 595699966 600050211 603466749 605971873 607236683 607988060 609018147 609790981 609653592 609252334
760.8 609252334 609403968 609705031 609596789 609572172 610207081 610934734 611049414 611086428 611658156 612143755
781.2 612143755 611929774 611628950 611801088 611825943 611102104 610241115 609937131 609702170 608956039 608142614
801.6 608142614 607717633 607147217 605914056 604490638 603414416 602254629 600501001 598518372 596704662
819.9 596704662 594693005 592105985 589281619 586399674 582921207 578478336 573380172 567842185
836.2 567842185 561418116 553422093 543047965 528703213 510955632 496726155 491161764 488051772
852.5 488051772 478262663 459808201 434735179 403788239 365470558 316863328 255752027 188299030
868.9 188299030 133047685 103916712 96696854 103186928 123219222 159060955 209996641 273181826
885.2 273181826 343240112 410735786 466494411 507677615 537093461 558416903 574137866
899.4 574137866 586099207 595655084 603331268 609249353 613848329 617609501 620501995 622410357
915.8 622410357 623639584 624490857 624861538 624643266 624209821 623925805 623603404 622977793 622280061 621874809
936.2 621874809 621612608 621163547 620657921 620395899 620143771 619450450 618416905 617371619 616093814
954.5 616093814 614202797 611925900 609637260 607150197 604113936 600692034 597198486 593411088
970.8 593411088 588859439 583598614 577920496 571598291 564313233 556357801 548254669 540079415
987.1 540079415 531709492 523474574 515872002 508837402 502080739 495620161 489439011 483111262
1003.5 483111262 476157427 468559980 460639209 452596247 444476962 436674714 429852724 424306393
1019.8 424306393 420020252 417113155 415679872 415454656 416003317 417031914 418320239 419492692 420097113
1038.1 420097113 419895560 419060886 417891026 416499943 415107906 414225757 414306611 415459812 417632401
1056.5 417632401 420713633 424257845 427387923 429317474 429622054 427941710 424070626 418478370
1072.8 418478370 412311822 406615198 401917934 398530811 396755397 396773010 398631781 402304947 407418400
1091.2 407418400 412876874 417282492 419916809 420993596 421165049 421043277 421067744 421524167 422477514
1109.5 422477514 423658729 424689740 425379634 425584704 425169349 424283981 423318565 422413319 421361893
1127.9 421361893 420040250 418480307 416537821 413961798 410721511 407110155 403538615 400230438
1144.2 400230438 397303849 394914389 393127620 391835660 390967488 390682310 391192436 392496169 394387484
1162.6 394387484 396659434 399050325 401113421 402534783 403444529 404148757 404730648 405061275 405040324
1180.9 405040324 404611617 403621614 401953369 399722546 397135943 394256622 391101927 387841642 384686291
1199.3 384686291 381697983 378822088 376059234 373393774 370650977 367638648 364318520 360755354
1215.6 360755354 356973499 352970541 348812252 344618142 340424001 336187750 331950992 327833802
1231.9 327833802 323844433 319883615 315912932 311965168 308019459 304021895 300043732 296144545
1248.2 296144545 292253643 288261354 284172982 280102879 276065111 271978527 267848909 263758361
1264.5 263758361 259681374 255539149 251299590 247035891 242802605 238555238 234268606 229953781
1280.8 229953781 225617111 221209913 216704145 212140098 207576573 202999726 198394582 193777546
1297.2 193777546 189185098 184630141 180071980 175528094 171044454 166659907 162349373 158099875
1313.5 158099875 153936699 149805844 145631567 141450077 137266099 133033723 128794834 124616034
1329.8 124616034 120583735 116735242 112921305 108855508 104634687 100672834 96961416 93286566
1346.1 93286566 89610852 85948631 82317844 78741468 75271942 71969159 68703271 65352865
1362.4 65352865 62172145 59299424 56477055 53722948 51054765 48363753 45868304 43580309
1378.7 43580309 41344363 39208066 37187606 35149474 33188242 31461410 29736685 27901690
1395.1 27901690 26196411 24604397 23132395 21828242 20568680 19453451 18557087 17827693 17207539
1413.4 17207539 16675293 16243257 16002905 15981374 16067464 16242411 16487943 16815906 17210221 17572226
1433.8 17572226 17921034 18387588 18836463 19173009 19445866 19707302 19976720 20207521 20399628 20540781
1454.2 20540781 20653026 20898253 21281011 21635545 22010045 22483746 22972904 23449829 24068957 24878008
1474.6 24878008 25721680 26614267 27598133 28677370 29771397 30927388 32312095 33958070 35579190
1493 35579190 37212778 39217271 41432191 43519162 45336559 47255717 50030489 52932438 55448819
1511.3 55448819 57891458 60394254 63001864 65591097 68437226 71409464 74172117 77050611
1527.6 77050611 79815939 82521558 85542530 88333309 90768106 93921095 97759560 101368308
1543.9 101368308 104918137 108409837 112138368 116123758 120239943 124308251 129553199 136457503
1560.3 136457503 141839370 146645874 151689798 156909689 162489101 167413324 171873823 176980972
1576.6 176980972 181825221 186013192 190099418 194078505 197877780 201518491 205015510 208335683
1592.9 208335683 211518988 214574367 217479303 220248982 222958505 225579187 228070572 230462804
1609.2 230462804 232719764 234723255 236560941 238541469 240464568 242129952 243733138 245384723
1625.5 245384723 247024730 248666301 250191063 251549780 253116935 255113006 257164776 259162694
1641.8 259162694 261095703 263174206 265706450 268080413 270449996 273867339 277357548 280452967
1658.2 280452967 283570260 286994487 290697962 294161648 297652274 301656723 305587769 309552103
1674.5 309552103 313864410 317931950 321592897 325294524 330001771 334830105 339074582 343340218
1690.8 343340218 347318828 351321608 355612516 359871060 364695132 369162768 373087943 377152592
1707.1 377152592 381033957 384570152 387773693 390804470 394254088 398049712 401464164 404621035
1723.4 404621035 407795399 410849452 413731009 416412383 419407904 422875315 425956726 428878546
1739.7 428878546 431930035 434907913 437706470 440361470 443171471 446285933 449197799 451816946
1756.1 451816946 454396039 456887931 459396422 461851835 464045048 466029078 467773169 469453901
1772.4 469453901 471285552 472827613 473648369 473722011 473215312 472042501 470215052 467930198 464966357
1790.7 464966357 461631536 459015220 457096636 455548853 454729378 454945147 456049860 457953870 460699737
1809.1 460699737 464288265 468529195 473172665 478109598 483133256 487940848 492558658 497165412
1825.4 497165412 501414120 505383849 509427965 513184547 516462028 519459844 522242069 524692535
1841.7 524692535 527036905 529606402 532202661 534621537 536815166 538828194 540843189 542879283
1858 542879283 544833899 546693146 548465312 550053835 551592469 553447962 555462241 557352364 559051335
1876.4 559051335 560613632 562186778 563795865 565340757 566773355 568196833 569742382 571274281
1892.7 571274281 572674930 574125111 575634599 577059627 578382134 579705596 581036687 582319677
1909 582319677 583604097 584901810 586130977 587243915 588398695 589634240 590924323 592246234 593464911
1927.4 593464911 594584823 595691979 596801221 597890854 598989487 600036085 600992024 601982892 603073061
1945.7 603073061 604195952 605262518 606212974 607107401 608009517 608859420 609658420 610451698 611256719
1964.1 611256719 612095833 613040686 614067852 615102768 616130352 617090285 617982626 618878901 619794607
1982.5 619794607 620661318 621483445 622296214 623071611 623828888 624641597 625497639 626315117 627072930 627816439
2002.8 627816439 628581285 629334331 630046964 630714536 631391406 632099748 632785857 633451462 634148121 634879947
2023.2 634879947 635548711 636127949 636719942 637396693 638072312 638678014 639277995 639910042 640532792 641132593
2043.6 641132593 641760111 642416358 643053412 643633664 644200265 644810796 645434022 646007001 646550536 647130072
2064 647130072 647713840 648273766 648857355 649480224 650065958 650598347 651152968 651740074 652281106 652753234
2084.4 652753234 653238416 653761148 654277503 654754579 655220330 655710161 656198442 656643689 657053888 657476366
2104.8 657476366 657891095 658272803 658665538 659078896 659440577 659753680 660095453 660463691 660792172 661089361
2125.2 661089361 661434948 661818802 662165225 662451684 662761807 663138032 663489401 663776696 664081097 664451718
2145.6 664451718 664832175 665189564 665575445 666020215 666452765 666849792 667303503 667847455 668378890 668841302
2166 668841302 669335842 669902265 670460343 670972824 671496570 672067285 672640979 673189998 673731208 674274147
2186.4 674274147 674816549 675344288 675853014 676368952 676874042 677347720 677815616 678308785 678795695 679213285
2206.8 679213285 679593384 680006742 680454373 680886507 681280792 681664765 682082832 682510793 682902753 683275938
2227.2 683275938 683656514 684046507 684450328 684862494 685259342 685655951 686050236 686435163 686824381 687216163
2247.6 687216163 687613487 688030422 688463390 688856244 689193428 689541519 689952314 690381765 690783918 691169858
2268 691169858 691567481 691987514 692369819 692695439 693037629 693409741 693737209 694012344 694275081 694524348
2288.4 694524348 694756269 694991112 695227027 695424139 695559680 695648015 695741892 695843995 695880890 695838511
2308.8 695838511 695821345 695875227 695906460 695847273 695688009 695480466 695355058 695345700 695331991 695310056 695392668
2331.2 695392668 695591271 695806384 695937574 695996344 696169317 696713448 697632015 698440552 698631108 698171616
2351.6 698171616 697404385 696723580 696318805 696247339 696589887 697283208 698106587 699036002 700086594 701120019
2372 701120019 702121139 703158915 704166949 705072165 705873728 706550717 707030237 707316637 707501888
2390.4 707501888 707644939 707748175 707835317 707959116 708106101 708218157 708263755 708269477 708288670 708345115 708398283
2412.8 708398283 708405852 708392262 708369911 708317220 708220541 708098054 707963526 707798719 707604110 707400382 707182169
2435.2 707182169 706905425 706554770 706155956 705712259 705219209 704677701 704073370 703386307 702573836 701635718
2455.6 701635718 700607955 699465215 698165298 696704805 695108712 693371177 691437006 689288437
2471.9 689288437 686957240 684430242 681668997 678685308 675525784 672219098 668759525 665179670
2488.3 665179670 661591589 658122063 654812515 651669025 648738682 646047056 643534541 641151845
2504.6 641151845 638895690 636732161 634625733 632565558 630622149 628878653 627325416 625988066
2520.9 625988066 624967217 624326348 624083221 624262333 624859452 625851572 627247453 629025042 631095350
2539.2 631095350 633390784 635880053 638490856 641137958 643780053 646359324 648782015 651023269
2555.6 651023269 653095126 654974282 656654716 658148170 659461319 660609782 661606252 662464142 663227320
2573.9 663227320 663916528 664507449 665003121 665434480 665803850 666108310 666374743 666618943 666826308 667001367
2594.3 667001367 667204142 667488873 667818725 668123722 668442070 668846488 669315815 669827104 670399368 671058476
2614.7 671058476 671824694 672689021 673617780 674611151 675679803 676775694 677871764 678990960 680110335
2633.1 680110335 681192815 682240486 683267057 684306920 685331166 686254442 687091172 687869847 688534677
2651.4 688534677 689061344 689504802 689902127 690209568 690370917 690425456 690454185 690439582 690312922 690138936
2671.8 690138936 690036297 689935267 689715385 689446509 689273477 689133108 688868403 688553631 688305378 688041449
2692.2 688041449 687697947 687346756 687027335 686702669 686351895 686006665 685676336 685305417 684872985 684438765
2712.6 684438765 684042454 683660209 683236063 682749033 682250381 681768954 681335151 680981100 680639029 680211008
2733 680211008 679695129 679202437 678795636 678379416 677860260 677275836 676713347 676213324 675733507 675234854
2753.4 675234854 674736202 674219668 673643649 673034072 672453344 671879888 671259880 670598626 669899285 669176877
2773.8 669176877 668478131 667792916 667083621 666320503 665480018 664595902 663701952 662804186 661879659 660891950
2794.2 660891950 659870923 658870697 657859623 656779349 655640483 654425979 653125286 651834965
2810.5 651834965 650593519 649293721 647873998 646385729 644864619 643289149 641646504 639959455
2826.8 639959455 638227880 636404693 634440660 632343709 630132675 627829850 625417173 622695804
2843.1 622695804 619497180 616030514 612829804 610286474 608353496 606745422 605207264 603634715
2859.5 603634715 602013648 600274622 598347723 596289217 594174206 592059612 590120912 588474751
2875.8 588474751 587020576 585634291 584253311 582888603 581605375 580399752 579262614 578199506
2892.1 578199506 577181458 576256037 575461984 574688077 573879182 573071837 572198212 571083069 569605887
2910.4 569605887 567843080 566001177 564320803 563001990 562081337 561468601 561068475 560824692 560752749
2928.8 560752749 560910940 561263144 561696112 562216043 562858999 563486934 564008892 564520836 565050423 565434754
2949.2 565434754 565568209 565573931 565544546 565484405 565481842 565604568 565849125 566229582 566744149 567345023 567947507
2971.6 567947507 568531334 569111288 569596112 569988132 570406318 570815027 571097136 571244061 571266472 571216941
2992 571216941 571246684 571354568 571446240 571530461 571638882 571805179 572026968 572183311 572201014 572224259 572395861
3014.5 572395861 572623432 572731733 572673798 572474718 572182715 571834743 571380675 570797324 570148110 569524825
3034.9 569524825 568902433 568122089 567174613 566211402 565312624 564419270 563423634 562354684 561318338
3053.2 561318338 560324192 559331715 558309495 557230830 556075573 554874003 553752303 552779973 551830113
3071.6 551830113 550761819 549552560 548276544 547083080 546011627 544951737 543862164 542742848
3087.9 542742848 541577995 540428162 539327621 538220465 537018239 535732031 534486771 533256412
3104.2 533256412 531934977 530593157 529327571 528032243 526556969 524996698 523568630 522302151
3120.5 522302151 521025658 519601941 518076658 516558826 515075803 513582945 512048841 510431767
3136.8 510431767 508739531 507083654 505462170 503814697 502151549 500436306 498655558 496899188
3153.2 496899188 495194376 493462265 491697580 489945799 488181382 486362368 484497607 482623756
3169.5 482623756 480739415 478831023 476934820 475077450 473211378 471286416 469321489 467362821
3185.8 467362821 465416700 463474602 461570799 459703624 457828134 455945402 454072803 452223092
3202.1 452223092 450380772 448509008 446598500 444700062 442858011 441046208 439241916 437430054
3218.4 437430054 435619652 433825314 432017207 430205852 428409547 426606387 424819469 423084080
3234.7 423084080 421365708 419633508 417926937 416240484 414520025 412790984 411087930 409400493
3251.1 409400493 407677352 405908138 404180050 402489722 400767237 399025738 397325128 395701200
3267.4 395701200 394113213 392500877 390877813 389305532 387806833 386342227 384893894 383472562
3283.7 383472562 382059336 380638242 379247665 377942860 376681507 375376076 374052674 372788310
3300 372788310 371549785 370291024 369029731 367761314 366497248 365216881 363885820 362549394 361186326
3318.4 361186326 359757662 358314991 356851101 355349690 353889138 352454036 350942761 349390030
3334.7 349390030 347875267 346391261 344935298 343549520 342243552 340983838 339753747 338548154
3351 338548154 337359726 336185992 335057139 333988190 332953840 331956029 331000179 330088526 329224288
3369.3 329224288 328346133 327432692 326590031 325882614 325243115 324572742 323890001 323287249 322755039 322241783
3389.7 322241783 321774781 321341425 320888460 320498765 320266128 320108920 319896281 319645017 319454759 319353968
3410.1 319353968 319322795 319357455 319416076 319472700 319561571 319710493 319982231 320395470 320845932 321268499
3430.5 321268499 321784735 322441638 323066831 323574483 324106067 324778885 325545818 326353222 327217281 328171074
3450.9 328171074 329173237 330227941 331380159 332561940 333697885 334868222 336178392 337583512
3467.2 337583512 338965386 340282708 341640234 343107373 344656467 346225470 347807944 349431187
3483.6 349431187 351092517 352826923 354657948 356526554 358361632 360202760 362112939 364103854
3499.9 364103854 366126627 368147582 370194018 372314334 374500066 376744539 379057199 381338179
3516.2 381338179 383578718 385838062 388143241 390498728 392947465 395562619 398271531 400947928
3532.5 400947928 403631866 406359106 409091532 411873072 414697945 417563677 420501113 423497111
3548.8 423497111 426562279 429764539 433020115 436195701 439360708 442571729 445722342 448917747
3565.1 448917747 452612966 456628263 460437864 464106321 467829317 471614957 475441158 479239792
3581.5 479239792 482854962 486485153 490606219 494961470 498946995 502829075 506926656 511070430
3597.8 511070430 515216351 519419491 523447394 527295649 531410515 535725057 539924443 543998241
3614.1 543998241 547847807 551841319 556281686 560471296 564069211 567551494 571874678 576714098
3630.4 576714098 580840707 584717512 588579714 592277527 595884085 599179745 601958394 604732394
3646.7 604732394 608419478 612498641 615712047 618555605 621666253 624543369 627017975 629305303
3663 629305303 631252706 632924199 634843946 636826634 638378203 640242875 642337620 643937290 645293772
3681.4 645293772 646429539 647299767 648277581 649527848 650696278 651654422 652478337 653192222 653922796
3699.8 653922796 654860437 655763447 656322718 656717062 657321870 658258140 659119844 659689963 660026014 660206556
3720.1 660206556 660432100 660759032 661069989 661306620 661413908 661415398 661683381 662398338 662817240 662589312
3740.5 662589312 662368655 662717462 663058341 663190484 663681984 664286315 664551854 664711714 665025711 665341020
3760.9 665341020 665476143 665512741 665527523 665750384 666137218 666243732 666079462 666007042 666161656 666326106
3781.3 666326106 666409373 666505814 666602194 666674972 666637003 666376770 665994167 665620446 665468574 665677190
3801.7 665677190 665824115 665933549 666258037 666364610 666053176 665682733 665516973 665323198 665256679 665561140
3822.1 665561140 665802479 665876031 665787578 665548325 665316403 665066063 664871693 664952695 665192962 665399671
3842.5 665399671 665532947 665394962 664809585 664060652 664029896 664713621 664873958 664633155 664379835 664229155
3862.9 664229155 664152324 663921595 663734674 663809776 663928151 664021313 663915753 663632989 663409710 663311899
3883.3 663311899 663421929 663435459 663211226 663130939 663104892 662785828 662271678 661822200 661663413 661904395
3903.7 661904395 662268102 662416339 662370563 662220478 661994934 661801815 661658704 661442399 661205232 661092103
3924.1 661092103 661024213 660844922 660661042 660642922 660702944 660625637 660336196 660012066 659847438 659746706
3944.5 659746706 659611225 659526587 659485042 659413159 659319282 659253418 659212530 659118056 658956885 658795595 658637583
3966.9 658637583 658475339 658350408 658271253 658205509 658118844 658017576 657936454 657854617 657732129 657606065
3987.3 657606065 657543302 657517612 657455623 657389998 657345653
3997.5 657345653
##END=$$ End of the data block
