##TITLE=$$ Begin of the data block
##JCAMP-DX=5.00 $$ ACD/SpecManager v 10.08
##SPECTROMETER/DATA SYSTEM=Alpha
##DATE=11 Jun 2014 08:19:42
##DATA TYPE=INFRARED SPECTRUM
##DATA CLASS=XYDATA
##ORIGIN=
##OWNER=
##NPOINTS=1765
##FIRSTX=399.75695801
##LASTX=3997.56933594
##MAXX=3997.56933594
##MINX=399.75695801
##MAXY=0.71017271
##MINY=0.01594422
##XFACTOR=1.0000000000
##YFACTOR=1.000000000000000e-9
##FIRSTY=0.21281566
##DELTAX=2.03957629
##XUNITS=1/CM
##YUNITS=ARBITRARY UNITS
##XYDATA=(X++(Y..Y))
399.8B12815657R965688R917096J0660260J1463970J1579752J0983736J0300994J0105550
416.1B97792703J1635095J2168616J0059535R597570R585679Q984536R126246R275764
432.4C78225744Q586824P809698P628024P496744O967038O625384O711394O222784
448.7D36273634N439222N448163N546778N219847M649818M319966M400522L976732
465D75274682L345549L439933L719688L412753K970219L132701L399193L162920K929032
483.4E04786670L120184L010035K208173J876533K463520K711176K112568J691103
499.7E23979962K173245K484858J708567J200795J738310J842797J055837P43865J220882
518.1E38149118J364887Q36194O52313J269221J524091R25541P17223J212835J427114
$$ plain form
399.8 212815657 222781345 232698441 243358701 254822671 266402423 277386159 287687153 297792703
416.1 297792703 309427798 321596414 331655949 341253519 350839198 359823734 368949980 378225744
432.4 378225744 386812568 394622266 402250290 409747034 416714072 423339456 430050850 436273634
448.7 436273634 441712856 447161019 452707797 457927644 462577462 466897428 471297950 475274682
465 475274682 478620231 482060164 485779852 489192605 492162824 495295525 498694718 501857638 504786670
483.4 504786670 507906854 510916889 513125062 515001595 517465115 520176291 522288859 523979962
499.7 523979962 526153207 528638065 530346632 531547427 533285737 535128534 536184371 536928236 538149118
518.1 538149118 539514005 540350199 541002512 542271733 543795824 544721365 545438588 546651423 548078537
536.4E48078537J054704R33230J412094J409948O15775K36571M46439L50416p6414
554.8E54461300k58743n007L22759K48134P4566K76386L06547j28031k83599J5021
575.2E55029333J80661J41681L70979R35316J091957N25117K33829O14285O76632M4108
595.6E59843898m02987k22802l29674j155793j619637j188040p43151o98745l82006
613.9E53101063K95102O23107M90547O50465J350761J484572O21081K41160R59575
632.3E59817433J443565J120687J012921J448810J379252N18799K4318K54691J11639
650.6E67132115o40571r41932o18756n96761j022757r56535m46439q45670j497031
669E59565663k65717N94437K37107o27935q46386m29809o66201j658380k202570k241910
$$ plain form
536.4 548078537 549133241 550066471 551478565 552888513 553504288 553740859 554187298 554537714 554461300
554.8 554461300 554202557 554197550 554520309 554768443 554843009 555119395 555425942 555297911 555014312 555029333
575.2 555029333 555209994 555351675 555722654 556657970 557749927 558275044 558508873 559123158 559799790 559843898
595.6 559843898 559440911 559218109 558888435 557732642 556113005 554924965 554181814 553483069 553101063
613.9 553101063 553396165 554019272 554509819 555160284 556511045 557995617 558616698 558857858 559817433
632.3 559817433 561260998 562381685 563394606 564843416 566222668 566741467 566765785 567020476 567132115
650.6 567132115 566491544 565549612 564930856 564334095 563311338 562354803 561908364 561062694 559565663
669 559565663 559299946 559894383 560131490 559503555 558657169 558227360 557561159 555902779 553700209 551458299
689.4E51458299k978325m479468n624532o440699p945180j0020316j1770666j2997150
705.7D89201963j3656944j2785941j0046065p615179p092387o382674k417683M562706
722D33767796J1765420J7411709K1288484K3242206K2706568J9788086J6065598J2770474
738.3E78806341R543001O379783M358352L478527K514779J223147O43075Q84771P38681
756.7F08570457j4186k75195J93715L41713n3346m5895N04851O01351J36197J47998
777.1F10107660O35743N11945j78755l12030P7307n7578p15792q00610k69472k47419
797.5F08750999p56979p87497l75151n17071j160323j348913j058638j189589j757026
815.8E99799812j933873j787484k002596k539456k826631k958060l502428m390061
$$ plain form
689.4 551458299 548479974 544000506 538375974 531935275 523990095 513969779 502199113 489201963
705.7 489201963 475545019 462759078 452713013 445097834 438005447 431622773 429205090 433767796
722 433767796 445533216 462944925 484233409 507475615 530182183 549970269 566035867 578806341
738.3 578806341 588349342 594729125 599087477 602566004 605080783 606303930 606947005 607831776 608570457
756.7 608570457 608556271 608281076 608474791 608816504 608763158 608717263 609222114 609823465 609959662 610107660
777.1 610107660 610743403 611255348 611076593 610764563 610841870 610784292 610068500 609267890 608998418 608750999
797.5 608750999 607994020 607206523 606831372 606314301 605153978 603805065 602746427 601556838 599799812
815.8 599799812 597865939 596078455 594075859 591536403 588709772 585751712 582249284 577859223
832.1E77859223n054951n546450o448687q010566j0400831j4352739j7706514j4173746
848.5D96164739n547643l141373r786665j8414408k5087566l0998379l8277775m8430979
864.8C16479951o0886323o7274720n5157423k9086441p224544O423592K0005331L5903379
881.1A59182802N0984949O3153103O9998175O7454874N5734277M1151851K9350519
895.4E37010550K1279157J5744686J2000561R579181P700980N919993M549742L713846
911.7F17498696K870798J884103J228273Q68618L89159j78516m39525l64422l67880
930F23389304n92828o43909l86119k84791m75764m92335k14576k36631p31647j076042
950.4F18254662j060486j261533j876473k327144k367318k503097k999067l399313
$$ plain form
832.1 577859223 572804272 567257822 560809135 552798569 542397738 528044999 510338485 496164739
848.5 496164739 490617096 487475723 477689058 459274650 434187084 403188705 364910930 316479951
864.8 316479951 255593628 188318908 133161485 104075044 96850500 103274092 123279423 159182802
881.1 159182802 210167751 273320854 343319029 410773903 466508180 507660031 537010550
895.4 537010550 558289707 574034393 586034954 595614135 603315115 609235108 613784850 617498696
911.7 617498696 620369494 622253597 623481870 624350488 624739647 624561131 624121606 623757184 623389304
930 623389304 622796476 622152567 621766448 621481657 621005893 620513558 620298982 620062351 619330704 618254662
950.4 618254662 617194176 615932643 614056170 611729026 609361708 606858611 603859544 600460231
966.8F00460231l510534l808916m533649n218565n664825o328285p276595p945597
983.1E56173265q115947q193910q338571q185744p599294p031978o747782o481230
999.4D95478809o181240o303430o967753p600874p872104q023590q134067p804722
1015.7D36591029o821364n512118m213781k866029j470447l15070M78238J001090J317978
1034.1D18189526J234293N97506k43127q39859j174987j404523j390934q54969R2268
1052.4D14205194J118361K167345L129094L557533L099204J903891L08633j621693
1068.7D27867562l820539n605638o217390n752564m723489l412724j819312J0937J879365
1087.1C98406208L652602N060047N441695M435063K666294J098723J70260j47521L4570
$$ plain form
966.8 600460231 596949697 593140781 588607132 583388567 577723742 571395457 564118862 556173265
983.1 556173265 548057318 539863408 531524837 523339093 515739799 508707821 501960039 495478809
999.4 495478809 489297569 482994139 476026386 468425512 460553408 452529818 444395751 436591029
1015.7 436591029 429769665 424257547 420043766 417177737 415707290 415392220 415870458 416871548 418189526
1034.1 418189526 419423819 420021325 419778198 418938339 417763352 416358829 414967895 414112926 414205194
1052.4 414205194 415323555 417490900 420619994 424177527 427276731 429180622 429489255 427867562
1068.7 427867562 424047023 418441385 412223995 406471431 401747942 398335218 396515906 396526843 398406208
1087.1 398406208 402058810 407118857 412560552 416995615 419661909 420760632 420930892 420783371 420817941
1105.4D20817941N18859R85741J143575R91881O91801K29776l89933q79169r66459
1123.8D23144013q94428j031518j316934j599074j996577k595216l216087l557921
1140.1D06936258l544003l334760k945215k367198j755476j283735q91030l10809N13226
1158.5C91017258J323223J907200K269506K360553K030224J418083R35883P22110N80788
1176.8D04564828L29584m1187m68284j011104j659482k198160k542704k866626l196538
1195.2C90910327l315568l178149k979875k861261k765506k660901k696246k985477
1211.5C67467344l357262l597140l773302l979593m136175m174859m196494m258871
1227.8C35993648m245520m104942l974140l958046l982902l961414l941238l982603
$$ plain form
1105.4 420817941 421336800 422322541 423466116 424457997 425149798 425379574 424989641 424110472 423144013
1123.8 423144013 422249585 421218067 419901133 418302059 416305482 413710266 410494179 406936258
1140.1 406936258 403392255 400057495 397112280 394745082 392989606 391705871 390814841 390504032 391017258
1158.5 391017258 392340481 394247681 396517187 398877740 400907964 402326047 403261930 403984040 404564828
1176.8 404564828 404894412 404853225 404384941 403373837 401714355 399516195 396973491 394106865 390910327
1195.2 390910327 387594759 384416610 381436735 378575474 375809968 373149067 370452821 367467344
1211.5 367467344 364110082 360512942 356739640 352760047 348623872 344449013 340252519 335993648
1227.8 335993648 331748128 327643186 323669046 319711000 315728098 311766684 307825446 303842843
1244.1C03842843l975392l904700l899127l999770m094839m083067m050047m083544
1260.4B71752357m119724m090219m075796m128098m210383m242226m243926m280343
1276.8B38361642m323602m337236m342541m398361m466757m515201m542217m574314
1293.1B02861413m605025m623010m616976m592136m563778m495189m436374m400924
1309.4A66528001m359230m262492m125878m092053m159942m165858m171997m223735
1325.7A32966816m224106m185096m055448l876693l857046m085824m202843l938399
1342A00541361l695265l679923l697359l671445l603905l519796l433168l324218l308847
1360.4F8607435l368006l180306k862390k784465k713497k672267k702482k479258
$$ plain form
1244.1 303842843 299867451 295962751 292063624 288063854 283969015 279885948 275835901 271752357
1260.4 271752357 267632633 263542414 259466618 255338520 251128137 246885911 242641985 238361642
1276.8 238361642 234038040 229700804 225358263 220959902 216493145 211977944 207435727 202861413
1293.1 202861413 198256388 193633378 189016402 184424266 179860488 175365299 170928925 166528001
1309.4 166528001 162168771 157906279 153780401 149688348 145528406 141362548 137190551 132966816
1325.7 132966816 128742710 124557614 120502166 116625473 112768427 108682603 104479760 100541361
1342 100541361 96846096 93166173 89468814 85797369 82193464 78673668 75240500 71916282 68607435
1360.4 68607435 65239429 62059123 59196733 56412268 53698771 51026504 48324022 45844764
1376.7D5844764k273646k234440k143666k028722k031100j915391j666665j701947
1393B9849187j871825j753146j597300j474324j316604j247013j097798r07430p54591
1411.4A7829156o19159n05160m34375k81078m5160R0642K15213K95243L21977L60321
1431.8A7227620L70549L79419M61316M24379L25875K62678K41835K55754K38679K10934
1452.2B0399038J54277J23845K50701L77782L64579M07012M95494M96803M76846O00811
1472.6B4147188Q13116Q64930Q86858R49319J049325J095004J166625J390651J654323
1490.9C4017339J623705J624052K002977K235226K102956J819920J929808K802693
1507.2E0158676K910215K518259K463386K512782K582044K575628K855473K986550
$$ plain form
1376.7 45844764 43571118 41336678 39193012 37164290 35133190 33217799 31551134 29849187
1393 29849187 27977362 26224216 24626916 23152592 21835988 20588975 19491177 18583747 17829156
1411.4 17829156 17209997 16704837 16270462 15989384 15944224 16034866 16250079 16545322 16867299 17227620
1431.8 17227620 17598169 17977588 18438904 18863283 19189158 19451836 19693671 19949425 20188104 20399038
1452.2 20399038 20553315 20677160 20927861 21305643 21670222 22077234 22572728 23069531 23546377 24147188
1472.6 24147188 24960304 25825234 26712092 27661411 28710736 29805740 30972365 32363016 34017339
1490.9 34017339 35641044 37265096 39268073 41503299 43606255 45426175 47355983 50158676
1507.2 50158676 53068891 55587150 58050536 60563318 63145362 65720990 68576463 71563013
1523.6G1563013K779998K874240K761908K707973L008612K800114K465107L156013
1539.9I4116978L835388L632150L578097L528111L756508L982037M073903M005090
1556.2A24508262N216360O923899N379513M787087N058885N262315N587518M902810
1572.5A67626649M444882N115793M864275M189834M073218L963485L792867L641397
1588.8B01712400L487259L308639L171220L031254K896607K790436K725661K590492
1605.1B25713968K428144K351270K259433K014503J808509J931906J920372J694813
1621.4B42122918J603231J599372J583323J611739J527995J373261J568377J974285
1637.8B54964501K041518K019853J967698K138406K602995K429634K436906L427446
$$ plain form
1523.6 71563013 74343011 77217251 79979159 82687132 85695744 88495858 90960965 94116978
1539.9 94116978 97952366 101584516 105162613 108690724 112447232 116429269 120503172 124508262
1556.2 124508262 129724622 136648521 142028034 146815121 151874006 157136321 162723839 167626649
1572.5 167626649 172071531 177187324 182051599 186241433 190314651 194278136 198071003 201712400
1588.8 201712400 205199659 208508298 211679518 214710772 217607379 220397815 223123476 225713968
1605.1 225713968 228142112 230493382 232752815 234767318 236575827 238507733 240428105 242122918
1621.4 242122918 243726149 245325521 246908844 248520583 250048578 251421839 252990216 254964501
1637.8 254964501 257006019 259025872 260993570 263131976 265734971 268164605 270601511 274028957
1654.1B74028957L446817L094375L157944L471583L717303L466577L538370M076749
1670.4C01998675L980368L984124M286647M051208L710479L797084M748672M780590
1686.7C35337847M193217M241735M014939M089087M354060M283815M820049M451096
1703C69785845L930688M065752L865540L559262L267795L056317L422797L788322L435195
1721.4D02177513L172934L173858L056734K913148K739697L040612L475666L090441
1737.7D26840603K917737L010690K962739K839624K713889K843410L083170K866953
1754D50078815K603173K566278K491415K523184K465486K205462K007603J783580J696944
1772.4D70421940J786530J498014Q28177J08778m87536j168430j828998k301634k966791
$$ plain form
1654.1 274028957 277475774 280570149 283728093 287199676 290916979 294383556 297921926 301998675
1670.4 301998675 305979043 309963167 314249814 318301022 322011501 325808585 330557257 335337847
1686.7 335337847 339531064 343772799 347787738 351876825 356230885 360514700 365334749 369785845
1703 369785845 373716533 377782285 381647825 385207087 388474882 391531199 394953996 398742318 402177513
1721.4 402177513 405350447 408524305 411581039 414494187 417233884 420274496 423750162 426840603
1737.7 426840603 429758340 432769030 435731769 438571393 441285282 444128692 447211862 450078815
1754 450078815 452681988 455248266 457739681 460262865 462728351 464933813 466941416 468724996 470421940
1772.4 470421940 472208470 473706484 474534661 474643439 474155903 472987473 471158475 468856841 465890050
1790.7D65890050l304571k617687j949102j540422p97361K04175J096339J914560K768338
1809.1D61664319L613263M228622M605442M921556N052060M860580M656762M614770
1825.4D98217374M251987L979683M024386L723681L273189L017903K821743K505899
1841.7E25815845K363801K516508K537012K397477K216697K066732K041280K022028
1858E43977380J939714J847446J769185J629352J591742J855851J980960J849890J682937
1876.4E60124457J588225J586318J599610J543701J439690J447857J577318J544952
1892.7E72452128J397550J449823J516104J415730J287281J287461J321435J296341
1909E83423853J315057J317978J215756J113057J171410J241803J297951J312196J192391
$$ plain form
1790.7 465890050 462585479 459967792 458018690 456478268 455680907 455885082 456981421 458895981 461664319
1809.1 461664319 465277582 469506204 474111646 479033202 484085262 488945842 493602604 498217374
1825.4 498217374 502469361 506449044 510473430 514197111 517470300 520488203 523309946 525815845
1841.7 525815845 528179646 530696154 533233166 535630643 537847340 539914072 541955352 543977380
1858 543977380 545917094 547764540 549533725 551163077 552754819 554610670 556591630 558441520 560124457
1876.4 560124457 561712682 563299000 564898610 566442311 567882001 569329858 570907176 572452128
1892.7 572452128 573849678 575299501 576815605 578231335 579518616 580806077 582127512 583423853
1909 583423853 584738910 586056888 587272644 588385701 589557111 590798914 592096865 593409061 594601452
1927.4E94601452J111985J130998J135349J088381J079798J032710R63628J015544
1943.7F03159845J107037J113713J060307R66251Q99136Q96513Q36551P63178P76291
1962.1F11578822Q38697Q84295R58383J023948J043975J044154R56417Q66472Q79765
1980.4F20074928R05275Q48890Q00132P89285Q01027Q37624Q52704Q34525P96973P58887
2000.8F28300250P42793P52031P46966P29382O96838O84917O87599O69122O44445O56724
2021.2F35311067P14362P06076O28949N96940O51181O71565O36220O42240O61731O26922
2041.6F41847253N69641N85437O49274O48260N73873N68927O34372O31392N63741N49674
2062F47821844N90264N71847N35965N74172O28173N87702N20766N46157O18100N96822
$$ plain form
1927.4 594601452 595713437 596844435 597979784 599068165 600147963 601180673 602144301 603159845
1943.7 603159845 604266882 605380595 606440902 607407153 608306289 609202802 610039353 610802531 611578822
1962.1 611578822 612417519 613301814 614260197 615284145 616328120 617372274 618328691 619195163 620074928
1980.4 620074928 620980203 621829093 622629225 623418510 624219537 625057161 625909865 626744390 627541363 628300250
2000.8 628300250 629043043 629795074 630542040 631271422 631968260 632653177 633340776 634009898 634654343 635311067
2021.2 635311067 636025429 636731505 637360454 637957394 638608575 639280140 639916360 640558600 641220331 641847253
2041.6 641847253 642416894 643002331 643651605 644299865 644873738 645442665 646077037 646708429 647272170 647821844
2062 647821844 648412108 648983955 649519920 650094092 650722265 651309967 651830733 652376890 652994990 653591812
2082.4F53591812M86672M56929N14567N27143M83990M88102N07295M55440L97503M25696
2102.8F58335149M73619M24027L46720L53277M04000L87431L44515L68177L97683L55422
2123.2F62190020L09944L33607L48926L19719K86460L16263L77774L55363K86638L00467
2143.6F65425181L73960L77476L43800L81589M46736M45426M39942M97222N53548N28038
2164F69812918M77075N14329N65827N45978N01573N14686N71371N75959N54741N69045
2184.4F75203502N66423N25475M98533N09024N41091N37335M98712M67599M69625M73082
2204.8F80290401M18484L83377M29571M57823M26114M09186M23133M25816L84390L60012
2225.2F84408307L89397M06862L93450L88086L95178M05491M31359M17590L99172M28796
$$ plain form
2082.4 653591812 654078484 654535413 655049980 655577123 656061113 656549215 657056510 657511950 657909453 658335149
2102.8 658335149 658808768 659232795 659579515 659932792 660336792 660724223 661068738 661436915 661834598 662190020
2123.2 662190020 662499964 662833571 663182497 663502216 663788676 664104939 664482713 664838076 665124714 665425181
2143.6 665425181 665799141 666176617 666520417 666902006 667348742 667794168 668234110 668731332 669284880 669812918
2164 669812918 670289993 670804322 671370149 671916127 672417700 672932386 673503757 674079716 674634457 675203502
2184.4 675203502 675769925 676295400 676793933 677302957 677844048 678381383 678880095 679347694 679817319 680290401
2204.8 680290401 680708885 681092262 681521833 681979656 682405770 682814956 683238089 683663905 684048295 684408307
2225.2 684408307 684797704 685204566 685598016 685986102 686381280 686786771 687218130 687635720 688034892 688463688
2245.6F88463688M17471L56018L39687L78669L97920L83794L79920M12703M14729L83020
2265.9F92327619L77714M07100M28557M03524L74138L51787L34322L14296L07142L07083
2286.3F95933282K72394K27153K04980K15948K24650J86026J37567J28985R2864J2576
2306.7F97636425j6629M9948J03951K4855j00195j69635j64032o7055K9921L3140N3466
2329.2F97414160J52409K21252J73748O5803O9440K47061N12719P78675P32541K40028
2349.6G00607836l28779o46532o71684m78030o2525L89397O23942P21991Q56519J005649
2370G02017784J056552J020670R99153R69648Q80778P83384O75440M70161K49863J56879
2390.4G09280312J54913J47402J14143P3135P2062J06394P0572N960L1114P3135L9935
$$ plain form
2245.6 688463688 688881159 689237177 689576864 689955533 690353453 690737247 691117167 691529870 691944599 692327619
2265.9 692327619 692705333 693112433 693540990 693944514 694318652 694670439 695004761 695319057 695626199 695933282
2286.3 695933282 696205676 696432829 696637809 696853757 697078407 697264433 697402000 697530985 697623849 697636425
2306.7 697636425 697619796 697669744 697773695 697798550 697698355 697528720 697364688 697297633 697327554 697360694 697414160
2329.2 697414160 697566569 697787821 697961569 698027372 698096812 698343873 698856592 699635267 700367808 700607836
2349.6 700607836 700279057 699632525 698960841 698482811 698420286 698809683 699433625 700155616 701012135 702017784
2370 702017784 703074336 704095006 705094159 706063807 706944585 707727969 708403409 708873570 709123433 709280312
2390.4 709280312 709435225 709582627 709696770 709769905 709841967 709948361 710018933 710024893 710056007 710129142 710169077
2412.8G10169077L219M17j5617o2406j11639j23263j30117j53422j69277j81675k21849
2435.2G09003448k87950l40461l73543m24325n09441n67794o13093p05898q23200r25362
2455.6G03432381j016497j130760j284182j440525j565099j721501j952410k190232
2471.9F91131175k378107k553403k755523k965569l164768l346622l503323l595650
2488.3F66868210l575146l459335l316700l149390k930344k690374k519131k416432
2504.6F42811358k292752k166391k091706k048373j952111j764715j540780j304746
2520.9F27649784j012444o45340k36988J81615N89133R97305J408755J778067K084553
2539.2F32794440K346277K535343K621114K674759K702355K607286K409756K205909
$$ plain form
2412.8 710169077 710172296 710172713 710157096 710094690 709983051 709859788 709729671 709576249 709406972 709225297 709003448
2435.2 709003448 708715498 708375037 708001494 707577169 707067728 706499934 705886841 705180943 704357743 703432381
2455.6 703432381 702415884 701285124 700000942 698560417 696995318 695273817 693321407 691131175
2471.9 691131175 688753068 686199665 683444142 680478573 677313805 673967183 670463860 666868210
2488.3 666868210 663293064 659833729 656517029 653367639 650437295 647746921 645227790 642811358
2504.6 642811358 640518606 638352215 636260509 634212136 632260025 630495310 628954530 627649784
2520.9 627649784 626637340 625992000 625755012 625936627 626525760 627523065 628931820 630709887 632794440
2539.2 632794440 635140717 637676060 640297174 642971933 645674288 648281574 650691330 652897239
2555.6F52897239K031326J872480J693904J489938J312434J168251J017928Q68619
2571.9F64352119P51674O63042N71490M87685M44829M03285L24965K47776K23518K35080
2592.3F68705463K39492K48611K70247K81036K76864L19779M26411M92990N18620N74351
2612.7F72353864O32286P07865Q49008R76741J042307J089036J111329J107395J105964
2631F80975795J096308J078963J071930J067639J041531R71258R00388Q77082Q07285
2649.4F89888179O53148N35429M72128L81052K40267J01030N4776R6143N6743q7678
2669.8F92391217j39594j09434j59085k42949k48432j91271j85848k65300k90036k36154
2690.2F90323114k47418l17574l55065l38375l06964l28958l64900l71814l75032l94404
$$ plain form
2555.6 652897239 654928565 656801045 658494949 659984887 661297321 662465572 663483500 664352119
2571.9 664352119 665103793 665766835 666338325 666826010 667270839 667674124 667999089 668246865 668470383 668705463
2592.3 668705463 668944955 669193566 669463813 669744849 670021713 670341492 670767903 671260893 671779513 672353864
2612.7 672353864 672986150 673694015 674543023 675519764 676562071 677651107 678762436 679869831 680975795
2631 680975795 682072103 683151066 684222996 685290635 686332166 687303424 688203812 689080894 689888179
2649.4 689888179 690541327 691076756 691548884 691929936 692170203 692271233 692326009 692422152 692478895 692391217
2669.8 692391217 692251623 692142189 691983104 691740155 691491723 691300452 691114604 690849304 690559268 690323114
2690.2 690323114 690075696 689758122 689403057 689064682 688757718 688428760 688063860 687692046 687317014 686922610
2710.6F86922610m20869m06086l69310m08292m85778m86791m70638m46201l84688l91543
2731F82652414m67777n23627m94004m00722l87251m93288n79059n59568m95613m81010
2751.4F77770495n01811n11468n32805n66543n77330n62251n80549o40452o76870o93500
2771.8F71926916p18058p11798o92725p21991p88033q31604q41618q85189r36985r51528
2792.2F63847387r76980j014709j012385j003981j070559j154244j215160j288354
2808.5F55111015j302958j262963j304328j408219j489520j551450j586258j608908
2824.8F43596411j667977j759648j862526j987457k101779k207875k311051k449870
2841.1F27248228k782584l232062l444969l176391k552510j938939j594424j519799
$$ plain form
2710.6 686922610 686501741 686095655 685726345 685318053 684832275 684345484 683874846 683428645 683043957 682652414
2731 682652414 682184637 681661010 681167006 680766284 680379033 679885745 679306686 678747118 678251505 677770495
2751.4 677770495 677268684 676757216 676224411 675657868 675080538 674518287 673937738 673297286 672620416 671926916
2771.8 671926916 671208858 670497060 669804335 669082344 668294311 667462707 666621089 665735900 664798915 663847387
2792.2 663847387 662870407 661855698 660843313 659839332 658768773 657614529 656399369 655111015
2808.5 655111015 653808057 652545094 651240766 649832547 648343027 646791577 645205319 643596411
2824.8 643596411 641928434 640168786 638306260 636318803 634217024 632009149 629698098 627248228
2841.1 627248228 624465644 621233582 617788613 614612222 612059712 610120773 608526349 607006550
2857.4F07006550j555085j610577j739204j946450k088010k136469k123356j945793
2873.7E91861606j662732j482665j411915j366317j336396j280963j215637j162589
2890.1E80942392j078248r91702r01341q01683p84933q16703q14140q60155j067996
2908.4E72825491j423537j771808j910329j728594j328945r17256o15061m07338k35736
2926.8E62486887o4969J51813L54648M50551N21004O23823O35385N66542N43952N10931
2947.2E66780567L80337J83106L5643j7046m5181m8637M3750K09689L52204M78029
2967.6E68352461N95748O29306O17445N92470M74334L60667L97504M38034L12805J31548
2987.9E72902322J788l8028N3108J32143J53363J52826J01924J20938J94013J26899
$$ plain form
2857.4 607006550 605451465 603840888 602101684 600155234 598067224 595930755 593807399 591861606
2873.7 591861606 590198874 588716209 587304294 585937977 584601581 583320618 582104981 580942392
2890.1 580942392 579864144 578872442 577971101 577169418 576384485 575567782 574753642 573893487 572825491
2908.4 572825491 571401954 569630146 567719817 565991223 564662278 563745022 563129961 562722623 562486887
2926.8 562486887 562421918 562573731 562928379 563378930 563899934 564523757 565159142 565725684 566269636 566780567
2947.2 566780567 567160904 567344010 567379653 567362607 567317426 567268789 567312539 567522228 567874432 568352461
2967.6 568352461 568948209 569577515 570194960 570787430 571261764 571622431 572019935 572457969 572770774 572902322
2987.9 572902322 572904110 572866082 572919190 573051333 573204696 573357522 573459446 573580384 573774397 573901296
3008.3E73901296j610K2531J35183J60337R7096o378j51277k61426l31699m72606o22213
3030.8E72469234o80148o60181o72698q00014r26018r39846q84294q78394r76026j057029
3051.2E63994586j039147j032591j063406j066506j095712j150489j168072j107276
3067.5E55271387r96709j004576j144469j231969j223802j169801j113236j101553
3083.8E46285272j104534j112759j120210j097739j084804j128435j247227j327515
3100.1E37062049j292408j278698j349747j351595j269519j318932j477122j520932
3116.4E26203096j402974j261234j293600j482844j577497j517951j480699j523793
3132.8E14662504j572788j641869j699567j640320j569688j616836j698613j769781
$$ plain form
3008.3 573901296 573899686 573922217 574057400 574217737 574314833 574308455 574157178 573895752 573564053 573091447 572469234
3030.8 572469234 571789086 571128905 570456207 569656193 568730175 567790329 566906035 566027641 565051615 563994586
3051.2 563994586 562955439 561922848 560859442 559792936 558697224 557546735 556378663 555271387
3067.5 555271387 554274678 553270102 552125633 550893664 549669862 548500061 547386825 546285272
3083.8 546285272 545180738 544067979 542947769 541850030 540765226 539636791 538389564 537062049
3100.1 537062049 535769641 534490943 533141196 531789601 530520082 529201150 527724028 526203096
3116.4 526203096 524800122 523538888 522245288 520762444 519184947 517666996 516186297 514662504
3132.8 514662504 513089716 511447847 509748280 508107960 506538272 504921436 503222823 501453042
3149.1E01453042j840800j816869j738101j739442j779706j794338j795828j807988
3165.4D87139970j854211j903117j897454j888931j925081j931757j901268j911492
3181.7D71926659j948863j949370j918107j902402j930862j963288j940697j895935
3198D56477135j897364j895965j871585j891762j900048j852959j852482j886279j843780
3216.4D39584911j792222j817167j847178j840055j809269j778096j791507j817048
3232.7D25092369j783549j736433j745820j736641j697778j728058j745671j702965
3249D11215454j696258j731873j746297j713425j698613j728713j748056j727462j660823
3267.4C95763934j600087j598150j606136j568943j525760j501501j453638j397967
$$ plain form
3149.1 501453042 499612242 497795373 496057272 494317830 492538124 490743786 488947958 487139970
3165.4 487139970 485285759 483382642 481485188 479596257 477671176 475739419 473838151 471926659
3181.7 471926659 469977796 468028426 466110319 464207917 462277055 460313767 458373070 456477135
3198 456477135 454579771 452683806 450812221 448920459 447020411 445167452 443314970 441428691 439584911
3216.4 439584911 437792689 435975522 434128344 432288289 430479020 428700924 426909417 425092369
3232.7 425092369 423308820 421572387 419826567 418089926 416392148 414664090 412918419 411215454
3249 411215454 409519196 407787323 406041026 404327601 402628988 400900275 399152219 397424757 395763934
3267.4 395763934 394163847 392565697 390959561 389390618 387864858 386363357 384909719 383511752
3283.7C83511752j372933j384199j402319j375883j340479j304895j255393j248628
3300C72827023j286268j310527j304388j304597j293033j272798j312464j370848j413136
3318.4C60958964j432747j424521j461953j531482j553774j525461j505465j529842
3334.7C48993719j553923j544535j503706j404345j294643j269221j282871j253694
3351C37886781j209438j183153j136213j092464j081765j058071r87113q91685q71390
3369.3C28375489r43840r40919q17209p23392p26462p57783p18177o41465n79297n11587
3389.7C21015358m52727m27753m10527l54618l13699l00169k67833k14011j59591q5295
3410.1C18029135R686N2780L6866N3435J06931J30713J98364L40909M20302L94344
$$ plain form
3283.7 383511752 382138819 380754620 379352301 377976418 376635939 375331044 374075651 372827023
3300 372827023 371540755 370230228 368925840 367621243 366328210 365055412 363742948 362372100 360958964
3318.4 360958964 359526217 358101696 356639743 355108261 353554487 352029026 350523561 348993719
3334.7 348993719 347439796 345895261 344391555 342987210 341692567 340423346 339140475 337886781
3351 337886781 336677343 335494190 334357977 333265513 332183748 331125677 330138564 329246879 328375489
3369.3 328375489 327431649 326490730 325673521 324950129 324223667 323465884 322747707 322106242 321526945 321015358
3389.7 321015358 320562631 320134878 319724351 319369733 319056034 318755865 318488032 318274021 318114430 318029135
3410.1 318029135 318038821 318091601 318128467 318181902 318288833 318419546 318617910 318958819 319379121 319773465
3430.5C19773465M79132O22988O02037N52416N80966O41316P56592Q86828R22888R61304
3450.9C26779932J019954J010687J070976J208365J237631J211613J254141J338870
3467.2C36132169J380354J350492J351059J433134J581371J647919J591861J582265
3483.6C48050624J679808J798391J875818J935452J933664J881421J858592J909673
3499.9C62923443J982212K034933K104163K177924K202391K246440K300441K276123
3516.2C80248070K285808K329975K373875K425283K484530K577961K668231K675802
3532.5D00069535K701998K811700K855628K851844K857834K908618L003716L061593
3548.8D23122466L101468L214478L268331L250212L292054L283352L189146L283262
$$ plain form
3430.5 319773465 320252597 320875585 321477622 322030038 322611004 323252320 324008912 324895740 325818628 326779932
3450.9 326779932 327799886 328810573 329881549 331089914 332327545 333539158 334793299 336132169
3467.2 336132169 337512523 338863015 340214074 341647208 343228579 344876498 346468359 348050624
3483.6 348050624 349730432 351528823 353404641 355340093 357273757 359155178 361013770 362923443
3499.9 362923443 364905655 366940588 369044751 371222675 373425066 375671506 377971947 380248070
3516.2 380248070 382533878 384863853 387237728 389663011 392147541 394725502 397393733 400069535
3532.5 400069535 402771533 405583233 408438861 411290705 414148539 417057157 420060873 423122466
3548.8 423122466 426223934 429438412 432706743 435956955 439249009 442532361 445721507 449004769
3565.1D49004769L766418M018336L801793L675401L743947L809184L848374L846675
3581.5D79514897L731638L786624M198640M352063M045278L989577M149318M237354
3597.8E12005389M323005M301846M061938L942728M247129M412651M246116M105210
3614.1E45646012L929138M117072M558921M282057L668010L578424M495264M992544
3630.4E79267442M144907L822565L870905L816664L733218L361046K858639K922356
3646.7F07797742L806114M077017L172696K843022L143609K918601K525568K335787
3663F32620156K002358J748979K006233K085030J680911J974523K120971J599014J367331
3681.4F49205506J131296Q68917J018524J328706J202345R25660Q03531P34627P91967
$$ plain form
3565.1 449004769 452771187 456789523 460591316 464266717 468010664 471819848 475668222 479514897
3581.5 479514897 483246535 487033159 491231799 495583862 499629140 503618717 507768035 512005389
3597.8 512005389 516328394 520630240 524692178 528634906 532882035 537294686 541540802 545646012
3614.1 545646012 549575150 553692222 558251143 562533200 566201210 569779634 574274898 579267442
3630.4 579267442 583412349 587234914 591105819 594922483 598655701 602016747 604875386 607797742
3646.7 607797742 611603856 615680873 618853569 621696591 624840200 627758801 630284369 632620156
3663 632620156 634622514 636371493 638377726 640462756 642143667 644118190 646239161 647838175 649205506
3681.4 649205506 650336802 651205719 652224243 653552949 654755294 655680954 656484485 657219112 658011079
3699.8F58011079J014709R24647N43237M20391P21276J050532Q39114M82440K95520
3718.1F64302945J76311J97649L20255L23415K24829J64211J39415L03566N86212K94507
3738.5F67033315k16604q4042M25219K81811J56164O07193O23286K19106J43707L38137
3758.9F69527292L17812N8651j2219N6327K16663L04460J12414m9233O974J28567R3877
3781.3F70761585M1962Q8930Q9824P4387k3723k12490k71798k72691j28686J49548
3801.7F70296848Q6367J19150L13103M9651l09229k75076o7234k02477j67966K13921
3822.1F70057058K54214J53721P629k27213l22103k58446o4612J51337J65700J33872
3842.5F70051157Q6189j96338o17683o92844J15812P30872Q5592l25561l16917j19269
$$ plain form
3699.8 658011079 659025788 659950435 660493672 660914063 661635339 662685871 663524985 664007425 664302945
3718.1 664302945 664479256 664676905 664997160 665320575 665545404 665709615 665849030 666152596 666738808 667033315
3738.5 667033315 666816711 666732669 667157888 667439699 667595863 668203056 668826342 669045448 669189155 669527292
3758.9 669527292 669845104 669903755 669891536 669947863 670164526 670468986 670581400 670532167 670539141 670667708 670761585
3781.3 670761585 670803547 670892477 670982301 671056688 671032965 670820475 670548677 670275986 670147300 670296848
3801.7 670296848 670383215 670502365 670815468 670865119 670555890 670280814 670213580 670011103 669843137 670057058
3822.1 670057058 670311272 670464993 670472622 670245409 669923306 669664860 669600248 669751585 669917285 670051157
3842.5 670051157 670137346 669941008 669323325 668630481 668746293 669477165 669562757 669237196 668920279 668801010
3862.9F68801010O1929j03891j99854m2499O2705P7068j61826l41892k13743n0842
3883.3F67888165J05321J6689j45674n543k9921l46780m94480l65138n5492K74062
3903.7F66841209K99513J4484j86562k19286k35319k22146j53721j53780j72734n9366
3924.1F65752292k1577j51932j37330k801l4451j76549k54155k14398j05202r9420
3944.5F64554477j71542j34051o5446q9586j22845j07646q4579r2328j09553j05619
3964.9F63471282r9540Tj19686j17302n2810l5465j01625r9838l8505r6500j78218
3987.3F62432253j28746r0241q3029K5987O7890
3997.5F62224114
$$ plain form
3862.9 668801010 668862939 668759048 668559194 668516695 668579400 668656468 668494642 668152750 667939007 667888165
3883.3 667888165 667993486 668010175 667864501 667858958 667829037 667482257 666987777 666622639 666567147 666841209
3903.7 666841209 667140722 667155206 666968644 666749358 666514039 666291893 666138172 665984392 665811658 665752292
3924.1 665752292 665730715 665578783 665441453 665438652 665404201 665227652 664973497 664759099 664653897 664554477
3944.5 664554477 664382935 664248884 664183438 664093852 663971007 663863361 663778782 663686454 663576901 663471282
3964.9 663471282 663371742 663272202 663152516 663035214 662982404 662946939 662845314 662745476 662706971 662610471 662432253
3987.3 662432253 662303507 662213266 662130237 662156224 662224114
3997.5 662224114
##END=$$ End of the data block
