##TITLE=$$ Begin of the data block
##JCAMP-DX=5.00 $$ ACD/SpecManager v 10.08
##SPECTROMETER/DATA SYSTEM=Alpha
##DATE=11 Jun 2014 08:19:42
##DATA TYPE=INFRARED SPECTRUM
##DATA CLASS=XYDATA
##ORIGIN=
##OWNER=
##NPOINTS=1765
##FIRSTX=399.75695801
##LASTX=3997.56933594
##MAXX=3997.56933594
##MINX=399.75695801
##MAXY=0.71292388
##MINY=0.01600125
##XFACTOR=1.0000000000
##YFACTOR=1.000000000000000e-9
##FIRSTY=0.21289232
##DELTAX=2.03957629
##XUNITS=1/CM
##YUNITS=ARBITRARY UNITS
##XYDATA=(X++(Y..Y))
$$ plain form
399.8 212892324 222998321 233130723 243961126 254997194 265962631 277075529 287919402
414 287919402 298058748 309330165 321500570 331789136 341419667 350873113 359695256 368620604
430.4 368620604 377449632 385453612 393021882 400821835 408614039 415767431 422358274 428976953
446.7 428976953 435192406 440575838 445841163 451254517 456486821 461192340 465492964 469826043
463 469826043 473759085 477008253 480323017 484105200 487725466 490871221 494248211 497818261 500729501
481.3 500729501 503192246 506064177 509116948 511490822 513482511 516000867 518792450 521020591
497.7 521020591 522787094 524884820 527154505 528765500 530067503 531841516 533607483 534630954
514 534630954 535418510 536711872 538072824 538841128 539502442 540722251 542035699 542922616 543833077
$$ packed form
399.8B12892324J0105997J0132402J0830403J1036068J0965437J1112898J0843873
414B87919402J0139346J1271417J2170405J0288566R630531R453446Q822143Q925348
430.4C68620604Q829028Q003980P568270P799953P792204P153392O590843O618679
446.7D28976953O215453N383432N265325N413354N232304M705519M300624M333079
463D69826043L933042L249168L314764L782183L620266L145755L376990L570050K911240
481.3E00729501K462745K871931L052771K373874J991689K518356K791583K228141
497.7E21020591J766503K097726K269685J610995J302003J774013J765967J023471
514E34630954P87556J293362J360952P68304O61314J219809J313448Q86917R10461
$$ plain form
532.3 543833077 545197070 546645463 547686934 548613727 549884319 551128983 551805556 552216232 552829146
550.7 552829146 553327143 553301871 552966714 552720666 552724361 552856684 553023517 553393126 553756833 553645194
571.1 553645194 553272247 553196907 553481102 553728104 553988755 554761052 555824637 556491613 556836426 557376206
591.5 557376206 557892442 557863891 557563961 557475209 557201564 556015074 554298103 553105295 552496791 551877439
611.9 551877439 551409423 551662445 552392423 552949965 553595126 554889858 556268573 556857705 557137668
630.2 557137668 558047533 559343755 560486197 561725676 563246012 564472914 564898133 565003693 565362275
648.6 565362275 565460205 564727247 563771665 563289523 562816083 561761200 560679615 560088038 559143186 557790458
669 557790458 557743430 558384776 558584869 557948232 557104528 556637943 555894613 554188192 552020669 549845517
$$ packed form
532.3E43833077J363993J448393J041471R26793J270592J244664O76573M10676O12914
550.7E52829146M97997k5272l35157k46048L695J32323J66833L69609L63707j11639
571.1E53645194l72947p5340K84195K47002K60651P72297J063585O66976L44813N39780
591.5E57376206N16236k8551k99930q8752k73645j186490j716971j192808o08504o19352
611.9E51877439m68016K53022P29978N57542O45161J294732J378715N89132K79963
630.2E57137668R09865J296222J142442J239479J520336J226902M25219J05560L58582
648.6E65362275R7930p32958r55582m82142m73440j054883j081585n91577r44852j352728
669E57790458m7028O41346K00093o36637q43704m66585p43330j706421k167523k175152
$$ plain form
689.4 549845517 546902597 542432070 536798894 530342817 522441983 512523592 500838161 487895072
705.7 487895072 474310160 461637557 451659173 444007695 436846763 430418193 427975237 432560027
722 432560027 444343954 461697847 482936829 506195307 528890967 548610032 564615607 577355742
738.3 577355742 586957753 593449116 597807765 601212740 603716671 605011165 605694652 606536090 607235074
756.7 607235074 607225060 606973946 607189238 607518077 607391775 607307017 607879758 608577967 608749032 608868837
777.1 608868837 609493554 609999478 609759688 609391749 609508574 609554887 608938277 608188570 607884228 607613683
797.5 607613683 606917560 606167197 605738282 605128050 603904486 602607667 601665199 600491166 598675311
815.8 598675311 596713185 594958067 592986763 590433061 587593257 584635794 581138849 576714933
$$ packed form
689.4E49845517k942920m470527n633176o456077p900834r918391j1685431j2943089
705.7D87895072j3584912j2672603r978384p651478p160932o428570k442956M584790
722D32560027J1783927J7353893K1238982K3258478K2695660J9719065J6005575J2740135
738.3E77355742R602011O491363M358649L404975K503931J294494O83487Q41438O98984
756.7F07235074j0014k51114K15292L28839j26302q4758N72741O98209J71065J19805
777.1F08868837O24717N05924k39790l67939J16825M6313o16610p49707l04342k70545
797.5F07613683o96123p50363m28915o10232j223564j296819r42468j174033j815855
815.8E98675311j962126j755118j971304k553702k839804k957463l496945m423916
$$ plain form
832.1 576714933 571595848 566085815 559771657 551845908 541460574 527113378 509414434 495239735
848.5 495239735 489664525 486502349 476696521 458227545 433153927 402300000 364166111 315834820
864.8 315834820 255112201 188059896 133066535 104052514 96878596 103357539 123370104 159240574
881.1 159240574 210213736 273367345 343326718 410737604 466474950 507632613 536983073
895.4 536983073 558242977 573907495 585833907 595366418 602990925 608850956 613411069 617174268
911.7 617174268 620122612 622060955 623262882 624093413 624486566 624304771 623842716 623491704 623155296
930 623155296 622571826 621941090 621591270 621337473 620868146 620361686 620099127 619813859 619072437 617988825
950.4 617988825 616906703 615614772 613694251 611355543 609032571 606572151 603584945 600188732
$$ packed form
832.1E76714933n119085n510033o314158p925749j0385334j4347196j7698944j4174699
848.5D95239735n575210l162176r805828j8468976k5073618l0853927l8133889m8331291
864.8C15834820o0722619o7052305n4993361k9014021p173918O478943K0012565L5870470
881.1A59240574N0973162O3153609O9959373O7410886N5737346M1157663K9350460
895.4E36983073K1259904J5664518J1926412R532511P624507N860031M560113L763199
911.7F17174268K948344J938343J201927Q30531L93153j81795m62055l51012l36408
930F23155296n83470o30736l49820k53797m69327n06460k62559k85268p41422j083612
950.4F17988825j082122j291931j920521k338708k322972k460420k987206l396213
$$ plain form
966.8 600188732 596668601 592825890 588242054 582977533 577301323 570995033 563750744 555810094
983.1 555810094 547680318 539495170 531161308 522965729 515366256 508332729 501599193 495165080
999.4 495165080 489006668 482714266 475801319 468231618 460357934 452376813 444285542 436487347
1015.7 436487347 429668635 424150527 419916719 417019218 415539980 415246189 415719897 416671962 417931706
1034.1 417931706 419141769 419743180 419515193 418696821 417529345 416127115 414739043 413859993 413932234
1052.4 413932234 415065914 417218924 420293182 423823714 426914215 428810924 429134578 427531034
1068.7 427531034 423756778 418228179 412051976 406291276 401526809 398061067 396196485 396172434 398035109
1087.1 398035109 401703596 406794816 412262231 416707665 419367373 420479506 420689821 420571893 420616031
$$ packed form
966.8F00188732l520131l842711m583836n264521n676210o306290p244289p940650
983.1E55810094q129776q185148q333862q195579p599473p033527o733536o434113
999.4D95165080o158412o292402o912947p569701p873684p981121q091271p798195
1015.7D36487347o818712n518108m233808k897501j479238k93791M73708R52065J259744
1034.1D17931706J210063O01411k27987q18372j167476j402230j388072q79050P2241
1052.4D13932234J133680K153010L074258L530532L090501J896709L23654j603544
1068.7D27531034l774256n528599o176203n760700m764467l465742j864582k4051J862675
1087.1C98035109L668487N091220N467415M445434K659708J112133K10315j17928M4138
$$ plain form
1105.4 420616031 421124190 422090620 423248857 424282342 424989700 425185233 424733192 423802316 422814548
1123.8 422814548 421919227 420888245 419584781 418021321 416072488 413498789 410263270 406675994
1140.1 406675994 403127104 399834961 396923542 394533575 392749071 391479850 390622497 390309960 390776157
1158.5 390776157 392060816 393977344 396253318 398593754 400633514 402078778 403013915 403738379 404314190
1176.8 404314190 404595196 404525965 404072344 403073192 401423991 399205029 396611273 393753439 390619606
1195.2 390619606 387339920 384157121 381164163 378299028 375531405 372853607 370115370 367094427
1211.5 367094427 363742739 360158682 356383532 352413088 348292917 344123363 339929283 335697621
1227.8 335697621 331498891 327415168 323414952 319407582 315396786 311433733 307508677 303545445
$$ packed form
1105.4D20616031N08159R66430J158237J033485P07358J95533m52041r30876r87768
1123.8D22814548q95321j030982j303464j563460j948833k573699l235519l587276
1140.1D06675994l548890l292143k911419k389967j784504j269221q57353l12537M66197
1158.5C90776157J284659J916528K275974K340436K039760J445264R35137P24464N75811
1176.8D04314190K81006o9231m53621r99152j649201k218962k593756k857834l133833
1195.2C90619606l279686l182799k992958k865135k767623k677798k738237l020943
1211.5C67094427l351688l584057l775150l970444m120171m169554m194080m231662
1227.8C35697621m198730m083723m000216m007370m010796l963053l925056l963232
$$ plain form
1244.1 303545445 299555242 295619905 291722149 287747920 283679336 279619426 275573462 271472454
1260.4 271472454 267349929 263275385 259198278 255056858 250826150 246560335 242335752 238101497
1276.8 238101497 233784467 229417771 225055844 220638439 216133431 211611092 207111776 202573583
1293.1 202573583 197977990 193359196 188731104 184116498 179553285 175063074 170625389 166262820
1309.4 166262820 161963090 157726958 153592750 149475157 145295218 141121924 136944994 132720828
1325.7 132720828 128501967 124325924 120279171 116415218 112592034 108539887 104325227 100355200
1342 100355200 96672781 93020640 89310251 85618526 82017019 78499727 75058535 71746871 68466790
1360.4 68466790 65105423 61930206 59079893 56302056 53594466 50926615 48225433 45743000
$$ packed form
1244.1C03545445l990203l935337l897756l974229m068584m059910m045964m101008
1260.4B71472454m122525m074544m077107m141420m230708m265815m224583m234255
1276.8B38101497m317030m366696m361927m417405m505008m522339m499316m538193
1293.1B02573583m595593m618794m628092m614606m563213m490211m437685m362569
1309.4A66262820m299730m236132m134208m117593m179939m173294m176930m224166
1325.7A32720828m218861m176043m046753l863953l823184m052147m214660l970027
1342A00355200l682419l652141l710389l691725l601507l517292l441192l311664l280081
1360.4F8466790l361367l175217k850313k777837k707590k667851k701182k482433
$$ plain form
1376.7 45743000 43472786 41257031 39133333 37128828 35114951 33166539 31446580 29727712
1393 29727712 27909771 26243517 24686562 23199895 21841360 20569814 19497663 18626774 17886082
1411.4 17886082 17269341 16772795 16342545 16047081 16001249 16105879 16296649 16560566 16897213 17288355
1431.8 17288355 17693453 18103683 18555952 18953618 19263120 19523544 19773042 20030715 20277750 20504061
1452.2 20504061 20656416 20761121 21002300 21388654 21743100 22101922 22554301 23053693 23568751 24218941
1472.6 24218941 25047120 25900403 26785607 27744684 28809274 29917989 31092256 32480922 34133211
1490.9 34133211 35783831 37442196 39431535 41627821 43736581 45602262 47567017 50351098
1507.2 50351098 53232651 55725168 58154691 60657848 63271128 65899529 68795770 71783729
$$ packed form
1376.7D5743000k270214k215755k123698k004505k013877j948412j719959j718868
1393B9727712j817941j666254j556955j486667j358535j271546j072151q70889p40692
1411.4A7886082o16741m96546m30250k95464m5832J04630J90770K63917L36647L91142
1431.8A7288355M05098M10230M52269L97666L09502K60424K49498K57673K47035K26311
1452.2B0504061J52355J04705K41179L86354L54446L58822M52379M99392N15058O50190
1472.6B4218941Q28179Q53283Q85204R59077J064590J108715J174267J388666J652289
1490.9C4133211J650620J658365J989339K196286K108760J865681J964755K784081
1507.2E0351098K881553K492517K429523K503157K613280K628401K896241K987959
$$ plain form
1523.6 71783729 74560501 77454723 80241658 82970507 85995033 88808052 91310613 94519876
1539.9 94519876 98307602 101833306 105369538 108918861 112700820 116684325 120772913 124835320
1556.2 124835320 130103320 136990041 142327517 147115961 152194500 157474265 163041666 167919114
1572.5 167919114 172377437 177496985 182332858 186509788 190595403 194566727 198350906 201982841
1588.8 201982841 205455512 208732784 211870924 214885160 217762262 220520586 223221943 225821629
1605.1 225821629 228271469 230592161 232773528 234733507 236534983 238461435 240338713 241967469
1621.4 241967469 243530616 245139658 246727630 248334959 249891013 251314282 252877504 254802495
1637.8 254802495 256834745 258875847 260893285 263107091 265772492 268232763 270687401 274133921
$$ packed form
1523.6G1783729K776772K894222K786935K728849L024526K813019K502561L209263
1539.9I4519876L787726L525704L536232L549323L781959L983505M088588M062407
1556.2A24835320N268000O886721N337476M788444N078539N279765N567401M877448
1572.5A67919114M458323N119548M835873M176930M085615L971324L784179L631935
1588.8B01982841L472671L277272L138140L014236K877102K758324K701357K599686
1605.1B25821629K449840K320692K181367J959979J801476J926452J877278J628756
1621.4B41967469J563147J609042J587972J607329J556054J423269J563222J924991
1637.8B54802495K032250K041102K017438K213806K665401K460271K454638L446520
$$ plain form
1654.1 274133921 277599514 280718505 283927143 287474602 291251987 294768661 298372149 302483797
1670.4 302483797 306461036 310467452 314796984 318880111 322628498 326472312 331252873 336038977
1686.7 336038977 340251476 344537914 348590255 352707356 357095748 361419946 366250575 370689601
1703 370689601 374623090 378696889 382586092 386157453 389414996 392503977 396002561 399824768 403240055
1721.4 403240055 406401098 409611732 412727773 415673375 418422610 421495765 424997032 428078920
1737.7 428078920 430992693 434028894 437014222 439838260 442514628 445329279 448412955 451300919
1754 451300919 453937650 456543744 459068924 461601585 464053810 466249466 468254358 470069557 471820354
1772.4 471820354 473614365 475102216 475938231 476042390 475531936 474350840 472510725 470217586 467286408
$$ packed form
1654.1B74133921L465593L118991L208638L547459L777385L516674L603488M111648
1670.4C02483797L977239M006416M329532M083127L748387L843814M780561M786104
1686.7C36038977M212499M286438M052341M117101M388392M324198M830629M439026
1703C70689601L933489M073799L889203L571361L257543L088981L498584L822207L415287
1721.4D03240055L161043L210634L116041K945602K749235L073155L501267L081888
1737.7D28078920K913773L036201K985328K824038K676368K814651L083676K887964
1754D51300919K636731K606094K525180K532661K452225K195656K004892J815199J750797
1772.4D71820354J794011J487851Q36015J04159n10454j181096j840115k293139k931178
$$ plain form
1790.7 467286408 463983685 461346745 459408432 457883954 457078218 457250834 458323210 460249513 463036180
1809.1 463036180 466648370 470888853 475535721 480490953 485535413 490383834 495075345 499758244
1825.4 499758244 504067421 508068323 512079418 515793920 519070685 522078633 524875045 527384460
1841.7 527384460 529804170 532357156 534874439 537242532 539444149 541508019 543560803 545613706
1858 545613706 547576189 549416900 551191807 552855670 554462492 556286931 558241844 560124695 561854541
1876.4 561854541 563447356 565022588 566624522 568181336 569640040 571100950 572659552 574167013
1892.7 574167013 575556695 577020347 578537941 579958737 581269801 582604051 583978057 585268915
1909 585268915 586515069 587785482 589022815 590176284 591354012 592570424 593843877 595156252 596356630
$$ packed form
1790.7D67286408l302723k636940j938313j524478q05736J72616J072376J926303K786667
1809.1D63036180L612190M240483M646868M955232N044460M848421M691511M682899
1825.4D99758244M309177M000902M011095L714502L276765L007948K796412K509415
1841.7E27384460K419710K552986K517283K368093K201617K063870K052784K052903
1858E45613706J962483J840711J774907J663863J606822J824439J954913J882851J729846
1876.4E61854541J592815J575232J601934J556814J458704J460910J558602J507461
1892.7E74167013J389682J463652J517594J420796J311064J334250J374006J290858
1909E85268915J246154J270413J237333J153469J177728J216412J273453J312375J200378
$$ plain form
1927.4 596356630 597486138 598639071 599779487 600861609 601938367 602986574 603973985 604990661
1943.7 604990661 606080592 607188344 608236372 609179795 610090733 611022174 611888111 612679183 613457859
1962.1 613457859 614255130 615090251 616026223 617048979 618105412 619161844 620133102 621024549 621920407
1980.4 621920407 622846186 623723686 624527633 625305831 626097620 626924396 627767444 628589213 629387796 630173683
2000.8 630173683 630932927 631682754 632411599 633092463 633752346 634462237 635205865 635915101 636575997 637220442
2021.2 637220442 637902975 638583183 639200151 639811158 640502274 641199410 641823351 642433822 643079281 643716037
2041.6 643716037 644311130 644925714 645578206 646208286 646774590 647350430 647999644 648644924 649224460 649794042
2062 649794042 650389612 650959730 651493967 652063012 652703106 653308392 653836548 654385388 654991984 655565679
$$ packed form
1927.4E96356630J129508J152933J140416J082122J076758J048207R87411J016676
1943.7F04990661J089931J107752J048028R43423R10938R31441Q65937P91072P78676
1962.1F13457859P97271Q35121R35972J022756J056433J056432R71258Q91447Q95858
1980.4F21920407R25779Q77500Q03947P78198P91789Q26776Q43048Q21769P98583P85887
2000.8F30173683P59244P49827P28845O80864O59883P09891P43628P09236O60896O44445
2021.2F37220442O82533O80208O16968O11007O91116O97136O23941O10471O45459O36756
2041.6F43716037N95093O14584O52492O30080N66304N75840O49214O45280N79536N69582
2062F49794042N95570N70118N34237N69045O40094O05286N28156N48840O06596N73695
$$ plain form
2082.4 655565679 656043530 656518459 657042086 657552838 658024907 658512712 659032583 659508348 659915268 660347939
2102.8 660347939 660838425 661284566 661663651 662057698 662474096 662828267 663130581 663474977 663864851 664228380
2123.2 664228380 664559066 664914012 665283501 665625513 665917814 666215837 666579247 666940033 667250693 667563975
2143.6 667563975 667915702 668286681 668659449 669058383 669510484 669972777 670427501 670924604 671477377 672001600
2164 672001600 672448039 672929645 673509777 674102306 674647689 675193191 675780296 676359832 676901042 677446306
2184.4 677446306 678003788 678546786 679068625 679581225 680114746 680633724 681098819 681550980 682034910 682521403
2204.8 682521403 682958245 683379173 683832169 684285879 684713125 685138345 685565650 685993671 686402857 686773241
2225.2 686773241 687138498 687535763 687955678 688359737 688742936 689141154 689576864 689993799 690377235 690778732
$$ packed form
2082.4F55565679M77851M74929N23627N10752M72069M87805N19871M75765M06920M32671
2102.8F60347939M90486M46141L79085L94047M16398L54171L02314L44396L89874L63529
2123.2F64228380L30686L54946L69489L42012K92301K98023L63410L60786L10660L13282
2143.6F67563975L51727L70979L72768L98934M52101M62293M54724M97103N52773N24223
2164F72001600M46439M81606N80132N92529N45383N45502N87105N79536N41210N45264
2184.4F77446306N57482N42998N21839N12600N33521N18978M65095M52161M83930M86493
2204.8F82521403M36842M20928M52996M53710M27246M25220M27305M28021M09186L70384
2225.2F86773241L65257L97265M19915M04059L83199L98218M35710M16935L83436M01497
$$ plain form
2245.6 690778732 691196978 691581190 691941202 692348897 692776561 693172753 693553030 693959534 694395304 694802344
2265.9 694802344 695165813 695554018 695985854 696399808 696777701 697140336 697494924 697813332 698095322 698377192
2286.3 698377192 698660612 698902130 699106812 699351728 699611247 699788511 699897647 700036526 700196326 700279117
2306.7 700279117 700292945 700330317 700410426 700469434 700453341 700339794 700188816 700110555 700119555 700172484 700272024
2329.2 700272024 700420320 700616241 700819373 700953126 701043725 701255560 701766312 702591062 703330934 703524590
2349.6 703524590 703176081 702585340 701991200 701584339 701585889 702044368 702722669 703382730 704140306 705088377
2370 705088377 706068754 707023919 707985818 708915234 709743679 710449338 711042047 711482942 711756587 711927116
2390.4 711927116 712079763 712231755 712348700 712445736 712560833 712680995 712754965 712777734 712802410 712855339
$$ packed form
2245.6F90778732M18246L84212L60012M07695M27664L96192L80277M06504M35770M07040
2265.9F94802344L63469L88205M31836M13954L77893L62635L54588L18408K81990K81870
2286.3F98377192K83420K41518K04682K44916K59519J77264J09136J38879J59800Q2791
2306.7G00279117J3828L7372Q0109N9008j6093j13547j50978p8261R000N2929R9540
2329.2G00272024J48296J95921K03132J33753R0599K11835N10752Q24750P39872J93656
2349.6G03524590l48509n90741n94140m06861J550M58479O78301O60061P57576R48071
2370G05088377R80377R55165R61899R29416Q28445P05659N92709M40895K73645J70529
2390.4G11927116J52647J51992J16945R7036J15097J20162P3970K2769K4676N2929
$$ plain form
2410.8 712855339 712902784 712923884 712923110 712886393 712810934 712714076 712607265 712491870 712353945 712162316 711947739
2433.2 711947739 711738229 711461604 711097717 710707366 710293710 709816158 709267437 708646417 707939863 707132101
2453.6 707132101 706199467 705155015 704025149 702747166 701270700 699655771 697928727 696004212
2469.9 696004212 693814039 691424429 688882768 686129808 683138609 679933488 676554084 673059702
2486.2 673059702 669506490 665963054 662506878 659177601 656020880 653077841 650346279 647795558
2502.5 647795558 645402312 643154740 641002893 638901055 636848807 634901941 633138478 631579280
2518.9 631579280 630238175 629205108 628565609 628345490 628549337 629157424 630162358 631568193 633337498
2537.2 633337498 635423481 637783647 640341163 643000305 645689428 648354471 650925279 653338432
$$ packed form
2410.8G12855339M7445K1100p74l6717p5459r6858j06811j15395j37925j91629k14577
2433.2G11947739k09510k76625l63887l90351m13656m77552n48721o21020p06554q07762
2453.6G07132101r32634j044452j129866j277983j476466j614929j727044j924515
2469.9F96004212k190173k389610k541661k752960k991199l205121l379404l494382
2486.2F73059702l553212l543436l456176l329277l156721k943039k731562k550721
2502.5F47795558k393246k247572k151847k101838k052248j946866j763463j559198
2518.9F31579280j341105j033067o39499k20119K03847O08087J004934J405835J769305
2537.2F33337498K085983K360166K557516K659142K689123K665043K570808K413153
$$ plain form
2553.5 653338432 655570209 657638133 659548581 661258876 662767649 664115965 665298462 666295648
2569.8 666295648 667149663 667917550 668594420 669169068 669661283 670099914 670497119 670831561 671099961 671340585
2590.2 671340585 671569943 671788096 672026396 672319174 672648251 672959626 673280299 673676431 674148381 674666643
2610.6 674666643 675225019 675893843 676705003 677600145 678553700 679563820 680629790 681737840 682831645
2629 682831645 683914542 685035884 686159909 687242746 688314021 689390242 690393090 691273749 692113698
2647.3 692113698 692937076 693641663 694176078 694612861 695002496 695292950 695446193 695502162 695538938 695548236
2667.7 695548236 695456624 695319057 695207357 695046782 694801033 694572806 694425523 694264531 693986237 693655193
2688.1 693655193 693381667 693129659 692819893 692474484 692140877 691816926 691471457 691114068 690773129 690408587
$$ packed form
2553.5F53338432K231777K067924J910448J710295J508773J348316J182497R97186
2569.8F66295648Q54015P67887O76870N74648M92215M38631L97205L34442K68400K40624
2590.2F71340585K29358K18153K38300K92778L29077L11375L20673L96132M71950N18262
2610.6F74666643N58376O68824Q11160Q95142R53555J010120J065970J108050J093805
2629F82831645J082897J121342J124025J082837J071275J076221J002848Q80659Q39949
2647.3F92113698Q23378P04587N34415M36783L89635K90454J53243N5969L6776R298
2667.7F95548236r1612j37567j11700j60575k45749k28227j47283j60992k78294l31044
2688.1F93655193k73526k52008l09766l45409l33607l23951l45469l57389l40939l64542
$$ plain form
2708.5 690408587 689959168 689485669 689085662 688733697 688341558 687864244 687346578 686856568 686434388 686071038
2728.9 686071038 685692430 685250223 684756279 684261739 683821917 683386505 682855427 682274222 681746900 681290388
2749.3 681290388 680835187 680317402 679787040 679274976 678726256 678133726 677541077 676939428 676296175 675638974
2769.7 675638974 674970686 674252629 673531651 672839820 672128916 671378136 670559287 669653296 668730199 667843819
2790.1 667843819 666916072 665900946 664858222 663817942 662763834 661656559 660498381 659292817
2806.4 659292817 658018351 656748116 655520201 654215813 652759850 651225746 649697363 648146272
2822.7 648146272 646499872 644762814 642990053 641155660 639170706 637056112 634838343 632481158
2839.1 632481158 629981637 627229750 624073982 620649934 617425382 614818573 612830281 611173868
$$ packed form
2708.5F90408587m49419m73499m00007l51965l92139m77314n17666m90010m22180l63350
2728.9F86071038l78608m42207m93944m94540m39822m35412n31078n81205n27322m56512
2749.3F81290388m55201n17785n30362n12064n48720n92530n92649o01649o43253o57201
2769.7F75638974o68288p18057p20978o91831p10904p50780q18849r05991r23097q86380
2790.1F67843819r27747j015126j042724j040280j054108j107275j158178j205564
2806.4F59292817j274466j270235j227915j304388j455963j534104j528383j551091
2822.7F48146272j646400j737058j772761j834393j984954k114594k217769k357185
2839.1F32481158k499521k751887l155768l424048l224552k606809j988292j656413
$$ plain form
2855.4 611173868 609600782 608024538 606435001 604713023 602751493 600672483 598584592 596485198
2871.7 596485198 594524026 592849851 591364503 589940131 588559687 587220252 585923612 584678829
2888 584678829 583511353 582434237 581430554 580528557 579738200 578982592 578205168 577392519 576496422
2906.4 576496422 575386763 573936105 572190404 570353627 568666160 567322850 566379666 565737784 565313041
2924.7 565313041 565085590 565031707 565188706 565546513 565998316 566515386 567114711 567723632 568283975 568844855
2945.1 568844855 569395721 569803774 569969594 569972336 569941759 569886148 569814622 569826245 570020378 570420206 570999026
2967.6 570999026 571675539 572309852 572879910 573440611 573922157 574303091 574709177 575147569 575465083 575594127
2987.9 575594127 575597584 575570107 575592518 575683057 575826108 575956762 576033652 576162338 576382816 576540291 576552987
$$ packed form
2855.4F11173868j573086j576244j589537j721978j961530k079010k087891k099394
2871.7E96485198j961172j674175j485348j424372j380444j339435j296640j244783
2888E84678829j167476j077116j003683r01997p90357p55608p77424q12649q96097
2906.4E76496422j109659j450658j745701j836777j687467j343310r43184o41882m24743
2924.7E65313041k27451n3883J56999L57807M51803N17070N99325O08921N60343N60880
2945.1E68844855N50866M08053J65820K742l0577n5611p1526J1623J94133L99828N78820
2967.6E70999026O76513O34313N70058N60701M81546L80934M06086M38392L17514J29044
2987.9E75594127L457k7477K2411R0539J43051J30654P6890J28686K20478J57475J2696
$$ plain form
3010.4 576552987 576554120 576670289 576848924 576947808 576885879 576691866 576433480 576096177 575615883 575012743
3030.8 575012743 574350834 573679328 572986603 572183311 571261168 570317149 569404662 568484783 567472339
3049.1 567472339 566371202 565305650 564298868 563273609 562220573 561115921 559928119 558723450
3065.5 558723450 557597816 556578159 555558622 554429889 553214610 551971257 550780296 549674392
3081.8 549674392 548571765 547446012 546293020 545101464 543941736 542823136 541661918 540402532
3098.1 540402532 539084494 537805438 536546171 535210371 533858299 532579303 531238675 529705763
3114.4 529705763 528108776 526627541 525287807 523994207 522615016 521113634 519573808 518055856
3130.7 518055856 516524255 514913797 513202786 511455119 509760439 508119941 506483793 504812181
$$ packed form
3010.4E76552987J133J16169J78635R8884o1929j94013k58386l37303m80294o03140
3030.8E75012743o61909o71506o92725q03292r22143r44019r12487r19879j012444
3049.1E67472339j101137j065552j006782j025259j053036j104652j187802j204669
3065.5E58723450j125634j019657j019537j128733j215279j243353j190961j105904
3081.8E49674392j102627j125753j152992j191556j159728j118600j161218j259386
3098.1E40402532j318038j279056j259267j335800j352072j278996j340628j532912
3114.4E29705763j596987j481235j339734j293600j379191j501382j539826j517952
3130.7E18055856j531601j610458j711011j747667j694680j640498j636148j671612
$$ plain form
3147 504812181 503055513 501213968 499394000 497643530 495884746 494074225 492248744 490439147 488614559
3165.4 488614559 486760348 484890401 482970983 480984658 478980660 477016598 475084960 473150909
3181.7 473150909 471227914 469301343 467331141 465345114 463378429 461417198 459458441 457523346
3198 457523346 455618352 453731567 451824933 449879467 447943062 446062833 444204211 442318320 440409273
3216.4 440409273 438501924 436624736 434775710 432952344 431145102 429317772 427479416 425662249
3232.7 425662249 423877507 422128618 420402080 418671459 416916937 415144414 413411200 411737740
3249 411737740 410056531 408305466 406521827 404774964 403043538 401308030 399581730 397852927 396142095
3267.4 396142095 394483626 392868936 391278118 389711440 388192713 386728585 385278851 383814722
$$ packed form
3147E04812181j756668j841545j819968j750470j758784j810521j825481j809597j824588
3165.4D88614559j854211j869947j919418j986325k003998j964062j931638j934051
3181.7D73150909j922995j926571j970202j986027j966685j961231j958757j935095
3198D57523346j904994j886785j906634j945466j936405j880229j858622j885891j909047
3216.4D40409273j907349j877188j849026j823366j807242j827330j838356j817167
3232.7D25662249j784742j748889j726538j730621j754522j772523j733214j673460
3249D11737740j681209j751065j783639j746863j731426j735508j726300j728803j710832
3267.4C96142095j658469j614690j590818j566678j518727j464128j449734j464129
$$ plain form
3283.7 383814722 382361293 380926043 379518300 378186077 376883179 375554413 374249905 372977018
3300 372977018 371686816 370380640 369055599 367690891 366343498 365032345 363674104 362254351 360810488
3318.4 360810488 359351426 357891947 356390417 354784995 353159249 351615369 350087613 348521829
3334.7 348521829 346956819 345405459 343896210 342473000 341091901 339695483 338346720 337100089
3351 337100089 335888952 334654510 333432823 332253516 331097037 329985291 328954607 327998608 327087194
3369.3 327087194 326147854 325159967 324239880 323453546 322715253 321929783 321154267 320499331 319949836 319434702
3389.7 319434702 318905503 318387449 317956686 317606241 317286521 316976845 316666216 316396892 316210419 316085726
3410.1 316085726 315998405 315957397 315968066 316036850 316146642 316271573 316487193 316848189 317263305 317662537
$$ packed form
3283.7C83814722j453429j435250j407743j332223j302898j328766j304508j272887
3300C72977018j290202j306176j325041j364708j347393j311153j358241j419753j443863
3318.4C60810488j459062j459479j501530j605422j625746j543880j527756j565784
3334.7C48521829j565010j551360j509249j423210j381099j396418j348763j246631
3351C37100089j211137j234442j221687j179307j156479j111746j030684r55999r11414
3369.3C27087194r39340r87887r20087p86334p38293p85470p75516o54936n49495n15134
3389.7C19434702n29199n18054m30763l50445l19720l09676l10629k69324j86473j24693
3410.1C16085726q7321m1008J0669O8784J09792J24931K15620L60996M15116L99232
$$ plain form
3430.5 317662537 318159610 318775505 319358945 319890916 320472360 321147084 321895003 322698385 323554903 324513346
3450.9 324513346 325568348 326658964 327787578 328943610 330077440 331229478 332508892 333930254
3467.2 333930254 335378081 336792916 338245034 339745581 341296792 342881829 344472289 346117198
3483.6 346117198 347870082 349702597 351569802 353472620 355357647 357236266 359186620 361209452
3499.9 361209452 363254309 365304649 367385894 369553804 371798098 374063134 376351058 378680497
3516.2 378680497 381070763 383474857 385888517 388350546 390890658 393545300 396319658 399142087
3532.5 399142087 401979715 404840320 407683998 410551459 413454562 416401446 419449002 422575593
3548.8 422575593 425743848 429019779 432368457 435692400 439041913 442419291 445694715 449023247
$$ packed form
3430.5C17662537M97073O15895N83440N31971N81444O74724P47919Q03382Q56518R58443
3450.9C24513346J055002J090616J128614J156032J133830J152038J279414J421362
3467.2C33930254J447827J414835J452118J500547J551211J585037J590460J644909
3483.6C46117198J752884J832515J867205J902818J885027J878619J950354K022832
3499.9C61209452K044857K050340K081245K167910K244294K265036K287924K329439
3516.2C78680497K390266K404094K413660K462029K540112K654642K774358K822429
3532.5C99142087K837628K860605K843678K867461K903103K946884L047556L126591
3548.8D22575593L168255L275931L348678L323943L349513L377378L275424L328532
$$ plain form
3565.1 449023247 452885211 457026750 460903823 464646846 468464136 472341299 476309508 480319589
3581.5 480319589 484168679 488036662 492338538 496803522 500920296 504959762 509221792 513604760
3597.8 513604760 518049896 522489965 526692390 530756295 535147071 539704978 544047415 548256636
3614.1 548256636 552360296 556662500 561312318 565633476 569393516 573119521 577746630 582862139
3630.4 582862139 587204278 591219366 595191300 599066854 602882981 606343925 609295249 612344742
3646.7 612344742 616361618 620617211 623820245 626670003 629911542 632947087 635542393 637931526
3663 637931526 640004456 641847372 643957794 646128654 647874653 649884701 651986003 653538406 654902101
3681.4 654902101 656134784 657149673 658275962 659611762 660728753 661625385 662492931 663329065 664175272
$$ packed form
3565.1D49023247L861964M141539L877073L743023L817290L877163L968209M010081
3581.5D80319589L849090L867983M301876M464984M116774M039466M262030M382968
3597.8E13604760M445136M440069M202425M063905M390776M557907M342437M209221
3614.1E48256636M103660M302204M649818M321158L760040L726005M627109N115509
3630.4E82862139M342139M015088L971934L875554L816127L460944K951324L049493
3646.7F12344742M016876M255593L203034K849758L241539L035545K595306K389133
3663F37931526K072930J842916K110422K170860J745999K010048K101302J552403J363695
3681.4F54902101J232683J014889J126289J335800J116991Q96632Q67546Q36134Q46207
$$ plain form
3699.8 664175272 665136576 666016877 666664243 667262435 668075442 669119596 669936955 670401275 670688629
3718.1 670688629 670904338 671176553 671530187 671856880 672124505 672355652 672518134 672784686 673334122 673665762
3738.5 673665762 673531055 673515141 673970819 674229503 674355149 674944580 675546169 675741613 675862551 676190495
3758.9 676190495 676520228 676593542 676557124 676576436 676819503 677191734 677327752 677235663 677187324 677310705
3779.3 677310705 677432895 677484751 677571058 677655756 677707672 677658439 677401006 677058399 676810980 676847577 677152574
3801.7 677152574 677267849 677331924 677551150 677505791 677170396 676937461 676899314 676743448 676675260 676902294
3822.1 676902294 677070796 677165329 677163064 676999867 676805019 676612735 676517427 676598132 676702499 676833093
3842.5 676833093 676964521 676820755 676281452 675666928 675726116 676325619 676370680 676049054 675784886 675741434
$$ packed form
3699.8F64175272R61304Q80301O47366N98192Q13007J044154Q17359M64320K87354
3718.1F70688629K15709K72215L53634L26693K67625K31147J62482K66552N49436L31640
3738.5F73665762j34707j5914M55678K58684J25646N89431O01589J95444J20938L27944
3758.9F76190495L29733P3314l6418J9312K43067L72231J36018r2089m8339J23381
3779.3F77310705J22190N1856Q6307Q4698N1916m9233k57433l42607k47419L6597L04997
3801.7F77152574J15275O4075K19226m5359l35395k32935l8147j55866o8188K27034
3822.1F76902294J68502R4533k265j63197j94848j92284r5308Q0705J04367J30594
3842.5F76833093J31428j43766n39303o14524N9188N99503M5061l21626k64168m3452
$$ plain form
3862.9 675741434 675814152 675697088 675554633 675591290 675657094 675682843 675527990 675262570 675050795 674941599
3883.3 674941599 675006211 674951255 674752831 674755216 674744904 674448967 674062908 673762619 673629820 673787296
3903.7 673787296 674038887 674097121 674016774 673845053 673592329 673378110 673255205 673134387 672983706 672903597
3924.1 672903597 672847033 672681332 672526300 672525525 672540724 672406912 672152698 671904743 671729445 671555519
3944.5 671555519 671376228 671301782 671326458 671283782 671114624 670969784 670937955 670905530 670799375 670663714
3964.9 670663714 670501471 670343041 670258045 670219779 670147896 670040071 669936121 669874728 669840455 669736981
3985.3 669736981 669623673 669604063 669550419 669420600 669382513 669403553
3997.5 669403553
$$ packed form
3862.9F75741434P2718j17064j42455L6657O5804K5749j54853k65420k11775j09196
3883.3F74941599O4612n4956j98424K385j0312k95937l86059l00289j32799J57476
3903.7F73787296K51591N8234q0347j71721k52724k14219j22905j20818j50681q0109
3924.1F72903597n6564j65701j55032p75J5199j33812k54214k47955j75298j73926
3944.5F71555519j79291p4446K4676m2676j69158j44840l1829l2425j06155j35661
3964.9F70663714j62243j58430q4996l8266p1883j07825j03950o1393l4273j03474
3985.3F69736981j13308j9610n3644j29819l8087K1040
3997.5F69403553
##END=$$ End of the data block
