##TITLE=$$ Begin of the data block
##JCAMP-DX=5.00 $$ ACD/SpecManager v 10.08
##SPECTROMETER/DATA SYSTEM=Alpha
##DATE=11 Jun 2014 08:19:42
##DATA TYPE=INFRARED SPECTRUM
##DATA CLASS=XYDATA
##ORIGIN=
##OWNER=
##NPOINTS=1765
##FIRSTX=399.75695801
##LASTX=3997.56933594
##MAXX=3997.56933594
##MINX=399.75695801
##MAXY=0.71791780
##MINY=0.01592523
##XFACTOR=1.0000000000
##YFACTOR=1.000000000000000e-9
##FIRSTY=0.21137111
##DELTAX=2.03957629
##XUNITS=1/CM
##YUNITS=ARBITRARY UNITS
##XYDATA=(X++(Y..Y))
399.8B11371109R643838R457349J0186077J1048376J1102945J0688722J0585964J0076433
416.1B94160813J0738254J1867970J0506064R627282R309829Q920371R184778Q955866
432.4C73271227Q038461P702798P720440P373512O997675O875306O868303O284207
448.7D31131929N398452N304009N495012N225897M562408M115819M130811L941745
465D69306082L598690L634631L752351L391385K940953L204197L584891L094941K480031
483.4D98988152K875149L187299K404451K020836K625406K793312K069592J562655
499.7E18526852J987279K254247J637101J347304J827240J852870J108825P56383J167536
518.1E32465637J275897P61568P07031J329660J424491R13859R30548J389980J402914
$$ plain form
399.8 211371109 221014947 230472296 240658373 251706749 262809694 273498416 284084380 294160813
416.1 294160813 304899067 316767037 327273101 336900383 346210212 355130583 364315361 373271227
432.4 373271227 381309688 389012486 396732926 404106438 411104113 417979419 424847722 431131929
448.7 431131929 436530381 441834390 447329402 452555299 457117707 461233526 465364337 469306082
465 469306082 472904772 476539403 480291754 483683139 486624092 489828289 493413180 496508121 498988152
483.4 498988152 501863301 505050600 507455051 509475887 512101293 514894605 516964197 518526852
499.7 518526852 520514131 522768378 524405479 525752783 527580023 529432893 530541718 531298101 532465637
518.1 532465637 533741534 534503102 535210133 536539793 537964284 538878143 539808691 541198671 542601585
536.4E42601585R72689Q81135J161695J132428P20620M45426N29528M92453K0146l91244
556.8E48566461k15888K15053K75493J97649L72588K91825j57535k54929N5909L10659
577.2E49657285K55406K82526P45773R12488N34534M32849P06256N76496m3452k90573
597.6E53769588n2452l21507j188755j533806j056314o60837o56545l19183L93272
616E48373461P16030N61238P25567J348198J327693M96328K68042J028299J494646
634.3E56339502J214445J126885J499117J384437M86553P629K74599O9916o77943p89285
654.7E60935855l07441l68118r80675j046658n80609q25226j216412j33454N20944
673.1E55998206J99616n38528p37548m30047p63536j665473k106487k184272k916336
$$ plain form
536.4 542601585 543574274 544455409 545617104 546749532 547470152 547915578 548445106 548937559 548957705 548566461
556.8 548566461 548350573 548565626 548841119 549038768 549411356 549703181 549545646 549290717 549346626 549657285
577.2 549657285 549912691 550195217 550940990 551853478 552388012 552820861 553527117 554103613 554060161 553769588
597.6 553769588 553717136 553395629 552206874 550673068 549616754 548955917 548299372 547980189 548373461
616 548373461 549089491 549650729 550376296 551724494 553052187 553548515 553816557 554844856 556339502
634.3 556339502 557553947 558680832 560179949 561564386 562050939 562058568 562333167 562403083 561725140 560935855
654.7 560935855 560628414 560260296 559279621 558232963 557652354 556827128 555610716 555477262 555998206
673.1 555998206 556197822 555659294 554921746 554491699 553728163 552062690 549956203 547771931 544855595
691.4E44855595m395187n614639o474495p898628r895027j1677742j2988716j3612002
707.7D72299159j2590826r844273p533610p053793o340950k391100M583954J1731387
724D42859948J7285525K1200330K3229688K2612989J9646704J6029596J2796045R602308
740.4E85263133O470025M359424L386795K480626J307607P01070Q44479P18176L3617
758.7F05564952j91748K56896L39746j10566o9201N98192O90222R2208L7253N74708
779.1F07782662N56707q0228k65777P6413j132n96225p26342k80798k28524o78837
799.5F05557919p96319m69207n65827j159012j358688j040995j072824j653016j957238
817.9E95484793j826107j998902k558112k872288k997816l530025m415453n077242
$$ plain form
691.4 544855595 540460408 534845769 528371274 520472646 510577619 498899877 485911161 472299159
707.7 472299159 459708333 449864060 442330450 435276657 428935707 426544607 431128561 442859948
724 442859948 460145473 481345803 504575491 527188480 546835184 562864780 575660825 585263133
740.4 585263133 591733158 596092582 599479377 601960003 603267610 603968680 604813159 605531335 605564952
758.7 605564952 605373204 605630100 605969846 605859280 605790079 606388271 607078493 607170701 607207954 607782662
779.1 607782662 608339369 608259141 607993364 608069777 608068645 607472420 606746078 606465280 606236756 605557919
799.5 605557919 604761600 604292393 603726566 602567554 601208866 600167871 599095047 597442031 595484793
817.9 595484793 593658686 591659784 589101672 586229384 583231568 579701543 575286090 570208848
834.2E70208848n572439o462812p981599j0357439j4364421j7729104j4158308n593658
850.5D87989068l278613r924024j8442721k4952024l0796230l8143456m8301637o0563057
866.8B53587306o6708938n4540202k8648466o978318O577410K0099148L5989143N1093906
883.1B10470989O3211546O9927990O7295790N5597037M1084796K9311597K1192849
897.4E58092594J5632868J1923253R487212P577419N861223M585505L744244K869308
913.7F19773626J875520J181305Q06689L59237j72734m11153l29614l60846o02067
932.1F22119963o04451l04818k25126m73917n52893l04460l01600p77006j147389j165211
952.5F16263092j362205j941681k357483k365053k512395l059745l465533l537476
$$ plain form
834.2 570208848 564636409 558173597 550191998 539834559 525470138 507741034 493582726 487989068
850.5 487989068 484710455 474786431 456343710 431391686 400595456 362452000 314150363 253587306
866.8 253587306 186878368 132338166 103689700 96711382 103288792 123387940 159377083 210470989
883.1 210470989 273682535 343610525 410906315 466503352 507588148 536899745 558092594
897.4 558092594 573725462 585648715 595135927 602713346 608574569 613160074 616904318 619773626
913.7 619773626 621649146 622830451 623637140 623996377 623823643 623412490 623082876 622722030 622119963
932.1 622119963 621515512 621210694 620985568 620511651 619958758 619654298 619352698 618575692 617428303 616263092
952.5 616263092 614900887 612959206 610601723 608236670 605724275 602664530 599198997 595661521
968.8E95661521l834069m587710n267918n687654o316721p246316p930755q090616
985.1E46699762q136987q288026q155346p574320p008851o704270o418229o133079
1001.4D88280654o252408o892294p510692p746130p850706p950843p621378o640046
1017.7D29816157n402476m202396k908021j537621m04537L22700P84963J135886J133204
1036.1D18737859N50270k88755q93712j198471j398831j381547q63552P4119J105338
1054.5D14442718K078116K954304L437579L072321J898647L32266j519114l663838
1070.8D23032999n494118o206810n792439m797310l554821j993388j34438J786023
1087.1C96845698L630370N102188N518645M548490K773136J144200K13713n1946J23650
$$ plain form
968.8 595661521 591827452 587239742 581971824 576284170 569967449 562721133 554790378 546699762
985.1 546699762 538562775 530274749 522119403 514545083 507536232 500831962 494413733 488280654
1001.4 488280654 482028246 475135952 467625260 459879130 452028424 444077581 436456203 429816157
1017.7 429816157 424413681 420211285 417303264 415765643 415361106 415683806 416468769 417604655 418737859
1036.1 418737859 419288129 418999374 418105662 416907191 415508360 414126813 413263261 413337380 414442718
1054.5 414442718 416520834 419475138 422912717 425985038 427883685 428215951 426696837 423032999
1070.8 423032999 417538881 411332071 405539632 400742322 397187501 395194113 395059675 396845698
1087.1 396845698 400476068 405578256 411096901 415645391 418418527 419562727 419776440 419724494 419848144
1105.4D19848144N33789R75341J192331J067341P05510J60933m80771r40204j002580
1123.8D22059834r09328j033783j314193j566470j944751k558469l181428l507406
1140.1D06044006l469020l250569k892196k337277j724988j248062q58039l10123M75854
1158.5C90429586J261383J809597K142370K243310J952887J373023Q91983O98150N82724
1176.8D03385013L14862m5508m38124r70066j625627k210200k592474k892375l171653
1195.2C89753848l277421l167569k965540k825618k764880k715379k748818l002792
1211.5C66285831l365398l598720l758877l976286m151493m184782m169613m185617
1227.8C34895045m182429m085689l983260l983378m003704l983497l962606l978700
$$ plain form
1105.4 419848144 420381933 421357274 422549605 423616946 424322456 424483389 424002618 423062414 422059834
1123.8 422059834 421150506 420116723 418802530 417236060 415291309 412732840 409551412 406044006
1140.1 406044006 402574986 399324417 396432221 394094944 392369956 391121894 390263855 389953732 390429586
1158.5 390429586 391690969 393500566 395642936 397886246 399839133 401212156 402104139 402802289 403385013
1176.8 403385013 403699875 403654367 403216243 402246177 400620550 398410350 395817876 392925501 389753848
1195.2 389753848 386476427 383308858 380343318 377517700 374752820 372037441 369288623 366285831
1211.5 366285831 362920433 359321713 355562836 351586550 347435057 343250275 339080662 334895045
1227.8 334895045 330712616 326626927 322643667 318660289 314656585 310673088 306710482 302731782
1244.1C02731782l962904l909826l908456l971874m038543m056364m057408m097998
1260.4B70728409m129916m085273m069239m137307m219800m226521m214063m274383
1276.8B37371907m332871m327163m335209m430235m510090m511460m493222m544184
1293.1B01887473m607692m609048m580677m568070m549101m481331m434749m385993
1309.4A65670812m323542m240856m124105m095345m159123m161924m160345m207864
1325.7A32197708m222766m190251m045606l841333l801688m049815m204706l943123
1342I9898420l682740l656998l681555l664799l586412l493279l406845l283389l261805
1360.4F8180598l345743l179799k886020k823587k708056k610374k642426k448075
$$ plain form
1244.1 302731782 298768878 294859052 290950596 286978722 282940179 278883815 274826407 270728409
1260.4 270728409 266598493 262513220 258443981 254306674 250086874 245860353 241646290 237371907
1276.8 237371907 233039036 228711873 224376664 219946429 215436339 210924879 206431657 201887473
1293.1 201887473 197279781 192670733 188090056 183521986 178972885 174491554 170056805 165670812
1309.4 165670812 161347270 157106414 152982309 148886964 144727841 140565917 136405572 132197708
1325.7 132197708 127974942 123784691 119739085 115897752 112096064 108046249 103841543 99898420
1342 99898420 96215680 92558682 88877127 85212328 81625916 78132637 74725792 71442403 68180598
1360.4 68180598 64834855 61655056 58769036 55945449 53237393 50627019 47984593 45536518
1376.7D5536518k253491k215598k127573k014369k024129j929525j670405j667550
1393B9633878j811672j707113j584967j453717j280186j220843j097623r45520p86534
1411.4A7745703n89689m49499m08960l02799o9524R8609K09128K71516L21219L77571
1431.8A7203275M00936M17590M83322M26732L23584K75001K68107K65969K33935K10770
1452.2B0509221J65654J63699K71622L33286L04938L80237N29972N40672M81790N84496
1472.6B4265587Q09752Q79477R19043R91389J073483J106059J204770J425408J641166
1490.9C4316134J633636J676385K017237K195846K105613J888115J999046K805397
1507.2E0637409K889957K504357K438336K518606K656549K648003K848819K954260
$$ plain form
1376.7 45536518 43283027 41067429 38939856 36925487 34901358 32971833 31301428 29633878
1393 29633878 27822206 26115093 24530126 23076409 21796223 20575380 19477757 18532237 17745703
1411.4 17745703 17156014 16706515 16297555 15994756 15925232 16023841 16232969 16504485 16825704 17203275
1431.8 17203275 17604211 18021801 18505123 18931855 19255439 19530440 19798547 20064516 20298451 20509221
1452.2 20509221 20674875 20838574 21110196 21443482 21748420 22128657 22658629 23199301 23681091 24265587
1472.6 24265587 25075339 25954816 26873859 27865248 28938731 30044790 31249560 32674968 34316134
1490.9 34316134 35949770 37626155 39643392 41839238 43944851 45832966 47832012 50637409
1507.2 50637409 53527366 56031723 58470059 60988665 63645214 66293217 69142036 72096296
1523.6G2096296K793640K899512K761543K717458L057167K852782K524331L235333
1539.9I4938062L833406L564477L536589L519751L749833L969647M102953M089802
1556.2A25304520N277828O870806N333468M798532N081772N282537N597308M900068
1572.5A68446839M456520N118862M825592M128799M018724L942459L782943L612876
1588.8B02333614L448367L261164L094852K918705K774910K694413K652421K520800
1605.1B25699246K335980K202988K081350J882672J725063J817286J801595J625046
1621.4B41171226J549333J541451J536727J585826J551315J468122J659960K012074
1637.8B54076034K103269K115488K108365K346605K792389K559870K643049L688752
$$ plain form
1523.6 72096296 74889936 77789448 80550991 83268449 86325616 89178398 91702729 94938062
1539.9 94938062 98771468 102335945 105872534 109392285 113142118 117111765 121214718 125304520
1556.2 125304520 130582348 137453154 142786622 147585154 152666926 157949463 163546771 168446839
1572.5 168446839 172903359 178022221 182847813 186976612 190995336 194937795 198720738 202333614
1588.8 202333614 205781981 209043145 212137997 215056702 217831612 220526025 223178446 225699246
1605.1 225699246 228035226 230238214 232319564 234202236 235927299 237744585 239546180 241171226
1621.4 241171226 242720559 244262010 245798737 247384563 248935878 250404000 252063960 254076034
1637.8 254076034 256179303 258294791 260403156 262749761 265542150 268102020 270745069 274433821
1654.1B74433821L563673L176898L296613L645838L862351L598183L673256M157841
1670.4C03408474M028260M083723M423380M146248L767997L852308M816353M846335
1686.7C37373078M271716M333555M095227M177481M445821M358858M875719M497826
1703C72429281L989310M114449L912687L596395L297746L152818L552109L829717L436208
1721.4D05310720L197968L219515L126145L003061K825647L097773L456056L070384
1737.7D30307269K968103L068566K980203K874463K781541K877503L060341K847910
1754D53765899K639502K632231K532542K528250K456367K223432K062142J853734J738071
1772.4D74432170J769603J469344Q23557R7483n29855j207978j849353k281606k907127
$$ plain form
1654.1 274433821 277997494 281174392 284471005 288116843 291979194 295577377 299250633 303408474
1670.4 303408474 307436734 311520457 315943837 320090085 323858082 327710390 332526743 337373078
1686.7 337373078 341644794 345978349 350073576 354251057 358696878 363055736 367931455 372429281
1703 372429281 376418591 380533040 384445727 388042122 391339868 394492686 398044795 401874512 405310720
1721.4 405310720 408508688 411728203 414854348 417857409 420683056 423780829 427236885 430307269
1737.7 430307269 433275372 436343938 439324141 442198604 444980145 447857648 450917989 453765899
1754 453765899 456405401 459037632 461570174 464098424 466554791 468778223 470840365 472694099 474432170
1772.4 474432170 476201773 477671117 478494674 478592157 478062302 476854324 475004971 472723365 469816238
1790.7D69816238l274769k633631j975030j558721p82579K37614J111626J923889K803982
1809.1D65668619L655195M231870M600525M962027N110592M905373M716962M691810
1825.4E02542973M326045M027188M012346L696680L272176L034771K852797K549529
1841.7E30314505K407968K555907K582788K424002K192378K026558K054334K089262
1858E48647702J984656J834392J759172J670956J637280J836002J955569J879752J705408
1876.4E64910889J574576J592814J637519J580953J465679J447856J541376J521349
1892.7E77273011J407325J448632J485705J397014J313448J341879J373947J315534
1909E88356495J279175J295209J271248J171589J163483J201212J257062J288891J190901
$$ plain form
1790.7 469816238 466541469 463907838 461932808 460374087 459591508 459829122 460940748 462864637 465668619
1809.1 465668619 469323814 473555684 478156209 483118236 488228828 493134201 497851163 502542973
1825.4 502542973 506869018 510896206 514908552 518605232 521877408 524912179 527764976 530314505
1841.7 530314505 532722473 535278380 537861168 540285170 542477548 544504106 546558440 548647702
1858 548647702 550632358 552466750 554225922 555896878 557534158 559370160 561325729 563205481 564910889
1876.4 564910889 566485465 568078279 569715798 571296751 572762430 574210286 575751662 577273011
1892.7 577273011 578680336 580128968 581614673 583011687 584325135 585667014 587040961 588356495
1909 588356495 589635670 590930879 592202127 593373716 594537199 595738411 596995473 598284364 599475265
1927.4E99475265J128792J157403J160980J108765J085341J033902R76026J024843
1943.7F08151317J104831J100302J038134R67980R38415R28223Q43525P70033P67588
1962.1F16610348Q05497Q57771R47714J025974J060129J051485R62377R02116R23753
1980.4F25147164R42528Q75414P97033P66456P61390P80761Q16941Q49307Q33094P67529
2000.8F33337617P32005P63416P63595P11203O84499P18415P27475O86526O58393O75619
2021.2F40458763P12990O82295O32107O42002O77943O56903O15358O31511O64532O42539
2041.6F47016943N98013O18637O58869O30677N65767N99444O69241O42777N83171N81921
2062F53165460O13272N80668N34952N78165O35684N81085N14567N71311O53267O02185
$$ plain form
1927.4 599475265 600604057 601761460 602922440 604031205 605116546 606150448 607126474 608151317
1943.7 608151317 609256148 610356450 611394584 612362564 613300979 614229202 615072727 615842760 616610348
1962.1 616610348 617415845 618273616 619221330 620247304 621307433 622358918 623321295 624223411 625147164
1980.4 625147164 626089692 626965106 627762139 628528595 629289985 630070746 630887687 631736994 632570088 633337617
2000.8 633337617 634069622 634833038 635596633 636307836 636992335 637710750 638438225 639124751 639783144 640458763
2021.2 640458763 641171753 641854048 642486155 643128157 643806100 644463003 645078361 645709872 646374404 647016943
2041.6 647016943 647614956 648233593 648892462 649523139 650088906 650688350 651357591 652000368 652583539 653165460
2062 653165460 653778732 654359400 654894352 655472517 656108201 656689286 657203853 657775164 658428431 659030616
2082.4F59030616M89176M92692N61416N50210M70877M71353N29767N05864M34637M43518
2102.8F63980126M87030M37260L74138L78966L95119L69251L39449L68297M15563L90888
2123.2F67936087L39806L63171L93510L67641L10838K97368L57151L73661L20375L21508
2143.6F71381116L76582L85404L62813M03166M91440M87745M38869M72903N40614N42701
2164F75883353N05447N26607N83947N94556N58257N65946O01113N58615N13315N57363
2184.4F81448519N89311N57900N32210N30481N45621N39958M91679M65036N08844N13018
2204.8F86722577M30822M11332M64856M68433M31061M13179M24385M52936M28677L73900
2225.2F91022158L70085M09603M45843M35650M01378M00543M35829M28796L85046L78311
$$ plain form
2082.4 659030616 659519792 660012484 660573900 661124110 661594987 662066340 662596107 663101971 663536608 663980126
2102.8 663980126 664467156 664904416 665278554 665657520 666052639 666421890 666761339 667129636 667545199 667936087
2123.2 667936087 668275893 668639064 669032574 669400215 669711053 670008421 670365572 670739233 671059608 671381116
2143.6 671381116 671757698 672143102 672505915 672909081 673400521 673888266 674327135 674800038 675340652 675883353
2164 675883353 676388800 676915407 677499354 678093910 678652167 679218113 679819226 680377841 680891156 681448519
2184.4 681448519 682037830 682595730 683127940 683658421 684204042 684744000 685235679 685700715 686209559 686722577
2204.8 686722577 687153399 687564731 688029587 688498020 688929081 689342260 689766645 690219581 690648258 691022158
2225.2 691022158 691392243 691801846 692247689 692683339 693084717 693485260 693921089 694349885 694734931 695113242
2245.6F95113242M10556M13359L89814M06325M22180M11152M02809M18126M37916M19259
2265.9F99244738L90529M17590M33505L94165L69132L58701L58999L61740L52919L22461
2286.3G03004479K75433K29478K13445K38001K38478J89781J59383J76251J42753O0559
2306.7G04928041L7491P8201R1672M8757j79m9830o3657r478L1472K6166N7578J30236
2331.2G05306470J87099J72437J45077J76788K62260N09381Q25584P30992J97053l14117
2351.6G08199024n51402n32925l21031L0458M04537O03675O50168P59959R10998R55998
2372G11109459R24886R27567R16660Q19564P11262O16074M46200K55108J53601J45555
2392.4G17025936J59382J44303J18912J03712Q9407M5359Q702M0829R2745P0214J6272
$$ plain form
2245.6 695113242 695523798 695937157 696326971 696733296 697155476 697566628 697969437 698387563 698825479 699244738
2265.9 699244738 699635267 700052857 700486362 700880527 701249659 701608360 701967359 702329099 702682018 703004479
2286.3 703004479 703279912 703509390 703722835 703960836 704199314 704389095 704548478 704724729 704867482 704928041
2306.7 704928041 704965532 705043733 705135405 705184162 705183983 705134153 705070496 705061018 705092490 705118656 705176234 705306470
2331.2 705306470 705493569 705666006 705811083 705987871 706250131 706759512 707585096 708316088 708513141 708199024
2351.6 708199024 707647622 707114697 706793666 706824124 707228661 707832336 708482504 709242463 710153461 711109459
2372 711109459 712034345 712961912 713878572 714698136 715409398 716025472 716471672 716726780 716880381 717025936
2392.4 717025936 717185318 717329621 717448533 717552245 717641652 717687011 717695713 717736542 717829287 717899501 717915773
2414.8G17915773K027k3902p3790r9480j01328j18673j65403k07186j95443j77264
2435.2G16755331k45095l53753m04895m34935n03540n64694o08444o75261p95067r36270
2455.6G11233377j040637j140654j299620j485288j615584j735151j947343k201319
2471.9F98767781k386451k552390k778291l018260l215731l374874l502846l579140
2488.3F74359798l586232l500343l337621l155291k965391k747476k548337k394498
2504.6F50124609k270221k160371k075135k060652j991570j775086j535773j313389
2520.9F34942412j011848o26743k33471J63912N92709J045764J455485J788974K095640
2539.2F40212834K391338K601981K691329K727687K707839K606273K446532K234280
$$ plain form
2414.8 717915773 717917800 717893898 717820108 717720628 717619300 717500627 717335224 717128038 716932595 716755331
2435.2 716755331 716510236 716156483 715751588 715316653 714813113 714248419 713639975 712964714 712169647 711233377
2455.6 711233377 710192740 709052086 707752466 706267178 704651594 702916443 700969100 698767781
2471.9 698767781 696381330 693828940 691050649 688032389 684816658 681441784 677938938 674359798
2488.3 674359798 670773566 667273223 663935602 660780311 657814920 655067444 652519107 650124609
2504.6 650124609 647854388 645694017 643618882 641558230 639566660 637791574 636255801 634942412
2520.9 634942412 633930564 633303821 633070350 633234262 633826971 634872735 636328220 638117194 640212834
2539.2 640212834 642604172 645206153 647897482 650625169 653333008 655939281 658385813 660620093
2555.6F60620093K049029J932860J769721J538396J344740J189769J016855Q51393
2571.9F72312856P53402P01428O17027N17070M57526M04656L25501K47120K35498K70606
2592.3F76842690K50875K26021K75135L27528L25084L25918L86297M76122N60344O25610
2612.7F80621624O84083P69257Q66115R55939J051307J126409J132965J090884J097798
2631F89396381J145363J139939J100183J073479J055241J011610R42528R02057Q38280
2649.4F98605061O73949M93050M08411M01974L36647J63436M2438M0949J5735q7559
2669.8G01094091j37985j12772j51038k34723k35200j53124j42992k46465k89679k51352
2690.2F99138761k72513l42369l59714l26455l07142l33310l65376l69668l72827l79622
$$ plain form
2555.6 660620093 662669122 664601982 666371703 667910099 669254839 670444608 671461463 672312856
2571.9 672312856 673066258 673767686 674384713 674901783 675359309 675763965 676089466 676336586 676572084 676842690
2592.3 676842690 677093565 677319586 677594721 677922249 678247333 678573251 678959548 679435670 679996014 680621624
2612.7 680621624 681305707 682074964 682941079 683897018 684948325 686074734 687207699 688298583 689396381
2631 689396381 690541744 691681683 692781866 693855345 694910586 695922196 696864724 697766781 698605061
2649.4 698605061 699279010 699772060 700180471 700582445 700919092 701082528 701124966 701165915 701181650 701094091
2669.8 701094091 700956106 700843334 700692296 700457573 700222373 700069249 699926257 699679792 699390113 699138761
2690.2 699138761 698866248 698523879 698164165 697837710 697530568 697197258 696831882 696462214 696089387 695709765
2710.6F95709765l76761l66807l74675m41372n12064n06460m60923m14789l89039m08411
2731F91458464m67182n17368m77671l99113m14670n08725n68927n56051m93586m60566
2751.4F86594605m87566n13196n40316n68688n77330n83470n91934o27696o76811p00355
2771.8F80727243p16328p02799o89506p34687p82311q21471q91686r31382q99434q99076
2792.2F72658563r82285j063347j064896j038194j084864j161874j219332j284241
2808.5F63759530j298011j268804j320720j425206j493573j533211j584708j662672
2824.8F52172625j725554j778365j891911k053022k161562k228618k303064k444267
2841.1F35586262k789200l249824l480792l235459k640605k032042j650810j562178
$$ plain form
2710.6 695709765 695333004 694966197 694591522 694150150 693638086 693131626 692670703 692255914 691866875 691458464
2731 691458464 690991282 690473914 689996243 689597130 689182460 688673735 688104808 687548757 687055171 686594605
2751.4 686594605 686107039 685593843 685053527 684484839 683907509 683324039 682732105 682104409 681427598 680727243
2771.8 680727243 680010915 679308116 678618610 677883923 677101612 676280141 675388455 674457073 673557639 672658563
2792.2 672658563 671676278 670612931 669548035 668509841 667424977 666263103 665043771 663759530
2808.5 663759530 662461519 661192715 659871995 658446789 656953216 655420005 653835297 652172625
2824.8 652172625 650447071 648668706 646776795 644723773 642562211 640333593 638030529 635586262
2841.1 635586262 632797062 629547238 626066446 622830987 620190382 618158340 616507530 614945352
2857.4F14945352j594007j629651j763463j968681k084971k121627k145231j998246
2873.7E99639475j694440j507581j452386j405358j338006j258194j193523j123250
2890.1E88666737j063287j018465r01580p76410p67529q11457q32498q74222j048684
2908.4E80572605j392186j749575j900851j736165j338243r14216o07014m06801k66374
2926.8E70261180j09493J49309L90828M93586N61118O22690N96166N71429O08683N72503
2947.2E74717999L99827J92523P0513n96p0691p2003L6955K18809M13358N73575O49453
2969.6E77129722O35743O16789N94377M77195L61025L80814M09723L18110J88350P6712
2990E81188560J4603M7743Q1360J11163J47998J22905J31488K05994J70469J3173k9386
$$ plain form
2857.4 614945352 613351345 611721694 609958231 607989550 605904579 603782952 601637721 599639475
2873.7 599639475 597945035 596437454 594985068 593579710 592241704 590983510 589789987 588666737
2890.1 588666737 587603450 586584985 585683405 584906995 584139466 583328009 582495511 581621289 580572605
2908.4 580572605 579180419 577430844 575529993 573793828 572455585 571541369 570934355 570527554 570261180
2926.8 570261180 570151687 570300996 570691824 571185410 571746528 572369218 572965384 573536813 574145496 574717999
2947.2 574717999 575117826 575310349 575380862 575380266 575309575 575237572 575274527 575493336 575906694 576480269 577129722
2969.6 577129722 577765465 578382254 578976631 579453826 579814851 580195665 580605388 580923498 581111848 581188560
2990 581188560 581203163 581250906 581332266 581443429 581591427 581714332 581845820 582051814 582222283 582235456 582206070
3012.4E82206070J10209J97590J01507m0710j53602k67624l84689n06401n95987o48200
3032.8E80018163o51002o69599q19742r58980r41395q70884r01639j036465j092136
3051.2E72076321j039029j053094j093567j067757j085401j173377j224995j155376
3067.5E63183725j010656r90868j129449j245141j281201j227796j109302j092852
3083.8E54096460j145124j158118j176894j179934j169324j205205j285971j317680
3100.1E44458210j254379j249790j360059j396120j319229j357735j524150j593888
3116.4E33402860j509070j375318j341939j441896j544416j570344j564324j558959
3132.8E21496594j560748j630425j702249j686216j679778j697063j735151j851976
$$ plain form
3012.4 582206070 582316279 582513869 582615376 582574666 582421064 582153440 581768751 581262350 580666363 580018163
3032.8 580018163 579367161 578697562 577877820 576918840 575977445 575106561 574204922 573168457 572076321
3051.2 572076321 571037292 569984198 568890631 567822874 566737473 565564096 564339101 563183725
3067.5 563183725 562173069 561182201 560052752 558807611 557526410 556298614 555189312 554096460
3083.8 554096460 552951336 551793218 550616324 549436390 548267066 547061861 545775890 544458210
3100.1 544458210 543203831 541954041 540593982 539197862 537878633 536520898 534996748 533402860
3116.4 533402860 531893790 530518472 529176533 527734637 526190221 524619877 523055553 521496594
3132.8 521496594 519935846 518305421 516603172 514916956 513237178 511540115 509804964 507952988
3149.1E07952988j898348j794279j740992j821875j881034j846373j829326j878232
3165.4D93262529j916676j902700j908272j984626k036065k015084j979888j965940
3181.7D77553278j982212k008319k008378k012104k026975j999974j949281j955807
3198D61610228k017826k028257j990646j969337j949758j919657j917779j945555j916081
3216.4D43955332j864314j893163j932442j888692j846403j870215j901418j884192
3232.7D28874493j800299j744717j780600j815825j827926j822144j759946j716703
3249D14606333j732618j777530j820415j784921j711606j732618j800358j767964j689940
3267.4C98788363j674593j672446j630694j585364j562506j538635j513183j487553
$$ plain form
3149.1 507952988 506054640 504260361 502519369 500697494 498816460 496970087 495140761 493262529
3165.4 493262529 491345853 489443153 487534881 485550255 483514190 481499106 479519218 477553278
3181.7 477553278 475571066 473562747 471554369 469542265 467515290 465515316 463566035 461610228
3198 461610228 459592402 457564145 455573499 453604162 451654404 449734747 447816968 445871413 443955332
3216.4 443955332 442091018 440197855 438265413 436376721 434530318 432660103 430758685 428874493
3232.7 428874493 427074194 425329477 423548877 421733052 419905126 418082982 416323036 414606333
3249 414606333 412873715 411096185 409275770 407490849 405779243 404046625 402246267 400478303 398788363
3267.4 398788363 397113770 395441324 393810630 392225266 390662760 389124125 387610942 386123389
3283.7C86123389j454026j456409j483470j457423j398623j356691j346022j367480
3300C74803245j397043j399160j382291j392454j402110j415878j478672j526058j526654
3318.4C61882925j542300j577109j626790j705199j705527j629293j647860j737803
3334.7C48711044j752824j711458j684219j607149j509756j477003j470924j467287
3351C36030424j432926j406282j385301j290948j226693j254111j241863j177728j128585
3369.3C24485987j106023j132906j104235r54241q46595q68678q79824q02576p11680
3387.7C16079229o45667o01769n67794n41538n27888m77403l86984l31670l03298k88159
3408.1C11407059k45928j48297o6459l2425j9371K0504R2148J65165K61247L63022
$$ plain form
3283.7 386123389 384669363 383212954 381729484 380272061 378873438 377516747 376170725 374803245
3300 374803245 373406202 372007042 370624751 369232297 367830187 366414309 364935637 363409579 361882925
3318.4 361882925 360340625 358763516 357136726 355431527 353726000 352096707 350448847 348711044
3334.7 348711044 346958220 345246762 343562543 341955394 340445638 338968635 337497711 336030424
3351 336030424 334597498 333191216 331805915 330514967 329288274 328034163 326792300 325614572 324485987
3369.3 324485987 323379964 322247058 321142823 320188582 319341987 318473309 317593485 316790909 316079229
3387.7 316079229 315433562 314831793 314263999 313722461 313194573 312717170 312330186 311998516 311695218 311407059
3408.1 311407059 311161131 311012834 310946375 310913950 310894579 310915083 311007231 311172396 311433643 311796665
3428.5C11796665M02332M75257N47111N08040M95643N80311O86168P89374Q67308Q94725
3448.9C18042934R65446J037687J072049J183331J293749J263767J236231J323044
3465.2C27418238J430511J473010J452088J472235J561076J690357J725316J668066
3481.5C39890897J689226J780837J876742J968980K000183J950532J961768K036065
3497.8C55155230K100080K123415K143592K212673K295763K352148K389550K414197
3514.2C73186648K434224K480089K510936K547860K558738K583861K724051K908379
3530.5C93934786K945036K889007K942801L031254L054350L044486L134936L238678
3546.8D18215334L249765L291100L407836L462523L451646L524840L570973L453911
$$ plain form
3428.5 311796665 312198997 312674254 313221365 313729405 314225048 314805359 315491527 316280901 317148209 318042934
3448.9 318042934 319008380 320046067 321118116 322301447 323595196 324858963 326095194 327418238
3465.2 327418238 328848749 330321759 331773847 333246082 334807158 336497515 338222831 339890897
3481.5 339890897 341580123 343360960 345237702 347206682 349206865 351157397 353119165 355155230
3497.8 355155230 357255310 359378725 361522317 363734990 366030753 368382901 370772451 373186648
3514.2 373186648 375620872 378100961 380611897 383159757 385718495 388302356 391026407 393934786
3530.5 393934786 396879822 399768829 402711630 405742884 408797234 411841720 414976656 418215334
3546.8 418215334 421465099 424756199 428164035 431626558 435078204 438603044 442174017 445627928
3563.1D45627928L501385M037440M322052M069477L974140M104227M184455M212290
3579.4D78033394M188686M064620M174351M657954M736633M306018M305601M604518
3595.7E13071775M675329M672706M658342M451632M348636M706740M891455M663110
3612.1E50139725M478872M307508M548193M997253M631460L994465L967523M935503
3628.4E86000502N388320M494011M170775M195571M097641L960669L599644L202200
3644.7F19109333L337144M193247M351973L319502K987802L346443L104330K717196
3661F46466970K575577K217471J933217K219320K244591J789809K085924K122581J557290
3679.4F65212750J392603J213968J013458J253784J527190J245618R42290Q50379Q21233
$$ plain form
3563.1 445627928 449129313 453166753 457488805 461558282 465532422 469636649 473821104 478033394
3579.4 478033394 482222080 486286700 490461051 495119005 499855638 504161656 508467257 513071775
3595.7 513071775 517747104 522419810 527078152 531529784 535878420 540585160 545476615 550139725
3612.1 550139725 554618597 558926105 563474298 568471551 573103011 577097476 581064999 586000502
3628.4 586000502 591388822 595882833 600053608 604249179 608346820 612307489 615907133 619109333
3644.7 619109333 622446477 626639724 630991697 634311199 637299001 640645444 643749774 646466970
3661 646466970 649042547 651260018 653193235 655412555 657657146 659446955 661532879 663655460 665212750
3679.4 665212750 666605353 667819321 668832779 670086563 671613753 672859371 673801661 674652040 675473273
3697.7F75473273R24885J093268R11177N71847N58436Q82446J124382Q05498M15921
3716.1F82761133L00705K93553L22700L86238M18603L37362K16425J47462K93195N71728
3736.5F86049104K96414j88947m4167M52518L00289J88946O20485N57005J48535J62840
3756.9F88543022L70860K71976P0035O9678Q6367K39968L29435O8486p6592J13845
3777.3F90087080K43247P3313j3351N2154P3552N7578p9632k30372j92880j75774m8578
3799.7F89846337K09272Q5294R9421K65598p75l00288k42055l3557j14024k7537K31624
3822.1F90019310J31249P3016K741j39057j57833j47343l7193Q2910J3232L9637Q1003
3844.6F89961672j54913n10037n67138J38521O40989J3888k91705j71066M351J3054
$$ plain form
3697.7 675473273 676398158 677491426 678402603 678974450 679532886 680415332 681539714 682345212 682761133
3716.1 682761133 683061838 683355391 683678091 684064329 684482932 684820294 685036719 685184181 685477376 686049104
3736.5 686049104 686345518 686156571 686112404 686564922 686865211 687054157 687674642 688231647 688380182 688543022
3756.9 688543022 688913882 689185858 689255893 689325571 689411938 689651906 689981341 690049827 689973235 690087080
3777.3 690087080 690330327 690403640 690390289 690442443 690515995 690573573 690493941 690263569 690070689 689894915 689846337
3799.7 689846337 690055609 690140903 690240324 690505922 690505147 690204859 689962804 689929247 689815223 689787686 690019310
3822.1 690019310 690150559 690223575 690226316 690087259 689929426 689782083 689744890 689827800 689841032 689880669 689961672
3844.6 689961672 689806759 689296722 688729584 688868105 689509094 689522982 689231277 689060211 689064562 689077616
3865F89077616j96934j62065P272J0490L1710o8844j54137j60039j53780L3081J907
3887.4F88266277j37090L9100J5974l06606m33445l47078j41740J67668K88904J08600
3907.8F87520564r3103k19345k71261j86801p1466j32441j84596o3598m6253j67906
3928.2F86083794j26362N9068M8637j33395k36511k38478j70768j36792j49846r9302
3948.6F84900045l4153l1293n6803p3015j07944j44244r8288m0531q4400j51396j29163
3971F83948815o0082o7114j06931r3699m7087k6167q9407j26779l9100J1026n2034
3993.4F83251441m1008j2935
3997.5F83197498
$$ plain form
3865 689077616 688880682 688718617 688725889 688736379 688768089 688699245 688545108 688385069 688231289 688264370 688266277
3887.4 688266277 688129187 688168287 688184261 687877655 687444210 687097132 686955392 687123060 687411964 687520564
3907.8 687520564 687427461 687208116 686936855 686750054 686678588 686546147 686361551 686297953 686251700 686083794
3928.2 686083794 685957432 686016500 686065137 685931742 685695231 685456753 685285985 685149193 684999347 684900045
3948.6 684900045 684865892 684834599 684777796 684704781 684596837 684452593 684354305 684313774 684229374 684077978 683948815
3971 683948815 683888733 683821619 683714688 683620989 683573902 683547735 683458328 683331549 683292449 683303475 683251441
3993.4 683251441 683210433 683197498
3997.5 683197498
##END=$$ End of the data block
