##TITLE=$$ Begin of the data block
##JCAMP-DX=5.00 $$ ACD/SpecManager v 10.08
##SPECTROMETER/DATA SYSTEM=Alpha
##DATE=11 Jun 2014 08:19:42
##DATA TYPE=INFRARED SPECTRUM
##DATA CLASS=XYDATA
##ORIGIN=
##OWNER=
##NPOINTS=1765
##FIRSTX=399.75695801
##LASTX=3997.56933594
##MAXX=3997.56933594
##MINX=399.75695801
##MAXY=0.72584492
##MINY=0.01600002
##XFACTOR=1.0000000000
##YFACTOR=1.000000000000000e-9
##FIRSTY=0.20872347
##DELTAX=2.03957629
##XUNITS=1/CM
##YUNITS=ARBITRARY UNITS
##XYDATA=(X++(Y..Y))
$$ plain form
399.8 208723471 218112543 227181092 237152755 248048007 259136707 269895047 280323893 290470958
416.1 290470958 301513880 312907666 322511047 331697196 340946704 349778593 358690739 367403150
432.4 367403150 375296205 382986099 390948445 398397326 405140013 411756903 418470383 424650550
448.7 424650550 429837108 434815496 440155268 445556521 450370222 454685956 459073931 463051111
465 463051111 466283232 469538510 473360032 477086008 480068952 483076543 486537367 489727795 492526591
483.4 492526591 495513707 498428077 500573575 502500117 505121768 507992506 510184884 511864543
499.7 511864543 513912737 516148150 517782331 519142151 520903587 522700727 523806870 524565935 525738299
518.1 525738299 526989162 527736604 528399527 529600203 531020403 532021403 532949388 534337878 535759926
$$ packed form
399.8B08723471R389072R068549R971663J0895252J1088700J0758340J0428846J0147065
416.1B90470958J1042922J1393786R603381R186149R249508Q831889Q912146Q712411
432.4C67403150P893055P689894P962346P448881O742687O616890O713480O180167
448.7D24650550N186558M978388N339772N401253M813701M315734M387975L977180
465D63051111L232121L255278L821522L725976K982944L007591L460824L190428K798796
483.4D92526591K987116K914370K145498J926542K621651K870738K192378J679659
499.7E11864543K048194K235413J634181J359820J761436J797140J106143P59065J172364
518.1E25738299J250863P47442O62923J200676J420200J001000R27985J388490J422048
$$ plain form
536.4 535759926 536745131 537656665 538784862 539751410 540288210 540704906 541333497 541844249 541771054 541353762
556.8 541353762 541178763 541420817 541728199 542007506 542537808 543058634 543084919 542837739 542860329 543216169
577.2 543216169 543581128 543997288 544791222 545695126 546193779 546529830 547200859 547894239 548024297 547886610
597.6 547886610 548048258 548012674 546997726 545544922 544650733 544186592 543687344 543531060 544147313 545171678
618 545171678 546044767 547012150 548587680 550191998 550993204 551489115 552626431 554236889 555629730
636.3 555629730 556934953 558588743 560112119 560820878 561134875 561704457 562068820 561606586 560839593
654.7 560839593 560473680 560168624 559430003 558745623 558491468 557829261 556582093 556457102 557128906 557456076
675.1 557456076 556967199 556315720 556012332 555346429 553710043 551595151 549465418 546699882 542441428
$$ packed form
536.4E35759926R85205R11534J128197R66548N36800M16696O28591N10752p3195m17292
556.8E41353762j74999K42054L07382K79307N30302N20826K6285k47180K2590L55840
577.2E43216169L64959M16160P93934R03904M98653L36051O71029O93380J30058j37687
597.6E47886610J61648l5584j014948j452804q94189m64141m99248j56284O16253J024365
618E45171678Q73089R67383J575530J604318Q01206M95911J137316J610458J392841
636.3E55629730J305223J653790J523376P08759L13997N69582L64363m62234p66993
654.7E60839593l65913l05056p38621o84380k54155o62207j247168j24991O71804L27170
675.1E57456076m88877o51479l03388o65903j636386k114892k129733k765536m258454
$$ plain form
693.5 542441428 536897123 530466557 522563577 512635708 500964105 487980127 474333912 461741090
709.8 461741090 451924711 444271773 436979622 430561125 428233892 432822704 444550127 461951554
726.1 461951554 483330607 506735682 529558003 549401820 565546930 578359723 587939084 594421029
742.4 594421029 598802030 602241755 604821086 606197715 606974065 607934058 608731568 608783901 608580530
760.8 608580530 608866632 609242380 609061539 608820796 609238029 609865785 609999955 610049844 610550702 610996306
781.2 610996306 610854506 610576570 610654235 610650361 610049188 609340966 609074593 608804286 608076572 607301950
801.6 607301950 606876135 606303632 605091691 603683829 602577269 601353943 599563062 597534239 595620632
819.9 595620632 593522966 590843141 587859452 584824681 581201911 576565683 571319103 565704703
$$ packed form
693.5E42441428n544305o430566p902980r927869j1671603j2983978j3646215j2592822
709.8D61741090r816379p652938p292151o418497k327233M588812J1727423J7401427
726.1D61951554K1379053K3405075K2822321J9843817J6145110J2812793R579361O481945
742.4E94421029M381001L439725K579331J376629P76350R59993P97510N2333k03371
760.8F08580530K86102L75748j80841k40743M17233O27756J34170M9889N00858M45604
781.2F10996306j41800k77936P7665l874o01173p08222k66373k70307p27714p74622
801.6F07301950m25815n72503j211941j407862j106560j223326j790881k028823j913607
819.9E95620632k097666k679825k983689l034771l622770m636228n246580n614400
$$ plain form
836.2 565704703 559182465 551033854 540404022 525741279 507827818 493582994 487841010 484331965
852.5 484331965 474165976 455428928 430160284 399118155 360767901 312263876 251611859
866.8 251611859 185205698 131385013 103425749 96876927 103816278 124293149 160595804 211899787
883.1 211899787 275178760 345089018 412450105 468161821 509244025 538451552 559582889
897.4 559582889 575219750 587114692 596533477 604057610 609845042 614289939 617886662 620641530
913.7 620641530 622427702 623554111 624347150 624722660 624541879 624124825 623861492 623607397 623084843
932.1 623084843 622494280 622172952 621974587 621540785 620915353 620426476 619937360 618966162 617574692 616179168
952.5 616179168 614679277 612672508 610237837 607753992 605161190 602088213 598602712 594996452
$$ packed form
836.2E65704703o522238q148611j0629832j4662743j7913461j4244824n741984l509045
852.5D84331965j0165989j8737048k5268644l1042129l8350254m8504025o0652017
866.8B51611859o6406161n3820685k7959264o548822O939351K0476871L6302655N1303983
883.1B11899787O3278973O9910258O7361087N5711716M1082204K9207527K1131337
897.4E59582889J5636861J1894942R418785P524133N787432M444897L596723K754868
913.7F20641530J786172J126409P93039L75510j80781m17054k63333k54095n22554
932.1F23084843n90563l21328j98365m33802o25432m88877m89116r71198j391470j395524
952.5F16179168j499891k006769k434671k483845k592802l072977l485501l606260
$$ plain form
968.8 594996452 591076553 586401522 580991626 575124979 568650723 561271310 553246737 545125484
985.1 545125484 537036061 528889179 520932555 513551176 506712854 500132918 493787885 487733305
1001.4 487733305 481612355 474919081 467654735 460206121 452723891 445191473 438001901 431741178
1017.7 431741178 426594943 422489017 419498175 417705566 416928053 416855961 417263597 418022931 418816298
1036.1 418816298 419101477 418616623 417575091 416270882 414842427 413509578 412704855 412790239 413856834
1054.5 413856834 415851653 418637484 421819061 424635679 426365554 426668823 425277323 421872973
1070.8 421872973 416687846 410681844 404858887 399839848 395993322 393695861 393262118 394794136
1087.1 394794136 398251534 403294265 408904910 413649529 416666359 418102175 418601453 418752462 418983370
$$ packed form
968.8E94996452l919899m675031n409896n866647o474256p379413q024573q121253
985.1E45125484q089423q146882p956624p381379o838322o579936o345033o054580
1001.4D87733305o120950o693274p264346p448614p482230p532418p189572o260723
1017.7D31741178n146235m105926k990842j792609p77513p2092M07636P59334P93367
1036.1D18816298K85179m84854j041532j304209j428455j332849q04723Q5384J066595
1054.5D13856834J994819K785831L181577K816618J729875L03269j391500l404350
1070.8D21872973n185127o006002n822957n019039l846526k297461m33743J532018
1087.1C94794136L457398N042731N610645M744619L016830J435816M99278J51009K30908
$$ plain form
1105.4 418983370 419604719 420683533 421905637 422899544 423504025 423597872 423102349 422165513 421138585
1123.8 421138585 420167565 419043541 417637676 416013062 414072156 411578119 408488125 405098528
1140.1 405098528 401807606 398786187 396111459 393953919 392388135 391258061 390429139 390056044 390394360
1158.5 390394360 391442150 393000811 394905150 396921128 398681283 399942070 400792658 401469111 402029246
1176.8 402029246 402353674 402352333 401946247 400960922 399307609 397112846 394564211 391722113 388599277
1195.2 388599277 385356694 382222265 379274815 376430869 373660833 370962650 368185729 365125835
1211.5 365125835 361740589 358139843 354380220 350443155 346356213 342221677 338074714 333886474
1227.8 333886474 329717189 325668097 321717203 317763120 313773423 309788436 305844754 301888108
$$ packed form
1105.4D18983370O21349J078814J222104R93907O04481R3847m95523r36836j026928
1123.8D21138585r71020j124024j405865j624614j940906k494037l089994l389597
1140.1D05098528l290922l021419k674728k157540j565784j130074q28922l73095L38316
1158.5C90394360J047790J558661J904339K015978J760155J260787Q50588O76453N60135
1176.8D02029246L24428j341m06086r85325j653313k194763k548635k842098l122836
1195.2C88599277l242583l134429k947450k843946k770036k698183k776921l059894
1211.5C65125835l385246l600746l759623l937065m086942m134536m146963m188240
1227.8C33886474m169285m049092l950894l954083l989697l984987l943682l956646
$$ plain form
1244.1 301888108 297900409 293957949 290047497 286038399 281942308 277900815 273903698 269846916
1260.4 269846916 265741855 261672795 257607430 253468573 249240875 245011374 240824610 236591399
1276.8 236591399 232266903 227908701 223564655 219174460 214693949 210165024 205626994 201054648
1293.1 201054648 196452588 191844940 187252089 182688609 178146884 173652500 169217825 164868906
1309.4 164868906 160590097 156351849 152191043 148082495 143942758 139804214 135665461 131475866
1325.7 131475866 127273768 123104885 119062148 115211450 111419491 107406981 103236541 99290103
1342 99290103 95589064 91922514 88245384 84602438 81017613 77497177 74085772 70845626 67630380
1360.4 67630380 64296909 61126653 58278438 55505846 52812807 50191533 47548302 45082029
$$ packed form
1244.1C01888108l987699l942460l910452m009098m096091m041493l997117m056782
1260.4B69846916m105061m069060m065365m138857m227698m229501m186764m233211
1276.8B36591399m324496m358202m344046m390195m480511m528925m538030m572346
1293.1B01054648m602060m607648m592851m563480m541725m494384m434675m348919
1309.4A64868906m278809m238248m160806m108548m139737m138544m138753m189595
1325.7A31475866m202098m168883m042737l850698l791959m012510m170440l946438
1342I9290103l701039l666550l677130l642946l584825l520436l411405l240146l215246
1360.4F7630380l333471l170256k848215k772592k693039k621274k643231k466273
$$ plain form
1376.7 45082029 42824760 40658839 38589593 36619190 34639128 32736707 31058051 29382937
1393 29382937 27594853 25920890 24358679 22912767 21620238 20377547 19296082 18419692 17681386
1411.4 17681386 17077401 16625758 16275264 16037565 16000023 16115455 16328227 16599586 16932847 17315499
1431.8 17315499 17703054 18118788 18622555 19067569 19392818 19661184 19933201 20219505 20480361 20701189
1452.2 20701189 20858653 21001961 21263782 21639479 22012021 22430029 22939730 23442775 23908509 24522636
1472.6 24522636 25384896 26270226 27157471 28146727 29261133 30399708 31607579 33040825 34724940
1490.9 34724940 36399737 38104679 40159561 42397346 44528916 46422523 48449621 51313478
1507.2 51313478 54217283 56722645 59177730 61706327 64349502 66999570 69908336 72935104
$$ packed form
1376.7D5082029k257269k165921k069246j970403j980062j902421j678656j675114
1393B9382937j788084j673963j562211j445912j292529j242691j081465q76390p38306
1411.4A7681386o03985m51643l50494k37699l7542J15432K12772K71359L33261L82652
1431.8A7315499L87555M15734N03767M45014L25249K68366K72017K86304K60856K20828
1452.2B0701189J57464J43308K61821L75697L72542M18008N09701N03045M65734O14127
1472.6B4522636Q62260Q85330Q87245R89256J114406J138575J207871J433246J684115
1490.9C4724940J674797J704942K054882K237785K131570J893607K027098K863857
1507.2E1313478K903805K505362K455085K528597K643175K650068K908766L026768
$$ plain form
1523.6 72935104 75772621 78710586 81513159 84247194 87284938 90126030 92671141 95964260
1539.9 95964260 99856161 103431724 106961884 110483684 114225328 118165664 122251779 126360014
1556.2 126360014 131659642 138500974 143803731 148589745 153665036 158944979 164520636 169409424
1572.5 169409424 173888013 178997532 183768585 187847167 191810757 195669517 199342728 202830479
1588.8 202830479 206121713 209209800 212149993 214919642 217523694 219993711 222383618 224676445
1605.1 224676445 226827309 228841186 230716243 232390016 233899966 235498592 237139657 238675252
1621.4 238675252 240197852 241775230 243351743 244959369 246583670 248208120 250097156 252338678
1637.8 252338678 254662395 257060856 259525657 262286335 265504777 268445075 271524757 275722682
$$ packed form
1523.6G2935104K837517K937965K802573K734035L037744K841092K545111L293119
1539.9I5964260L891901L575563L530160L521800L741644L940336M086115M108235
1556.2A26360014N299628O841332N302757M786014N075291N279943N575657M888788
1572.5A69409424M478589N109519M771053M078582L963590L858760L673211L487751
1588.8B02830479L291234L088087K940193K769649K604052K470017K389907K292827
1605.1B24676445K150864K013877J875057J673773J509950J598626J641065J535595
1621.4B38675252J522600J577378J576513J607626J624301J624450J889036K241522
1637.8B52338678K323717K398461K464801K760678L218442K940298L079682M197925
$$ plain form
1654.1 275722682 279647201 283108592 286659449 290544122 294628471 298390806 302221388 306538641
1670.4 306538641 310660869 314793080 319248438 323416173 327211946 331103712 335950315 340796590
1686.7 340796590 345034510 349301577 353346139 357492566 361924797 366333812 371274918 375813693
1703 375813693 379869729 384062946 388013810 391647816 395037860 398317456 401958168 405797094 409225732
1721.4 409225732 412446439 415733069 418945223 422010332 424871653 427989781 431464523 434562624
1737.7 434562624 437543452 440626740 443637133 446502924 449252248 452126980 455186337 458020538
1754 458020538 460644484 463263899 465799093 468332082 470805764 473064303 475134969 476980507 478733689
1772.4 478733689 480517149 481982052 482782632 482842892 482299626 481119722 479305416 477041662 474130094
$$ packed form
1654.1B75722682L924519L461391L550857L884673M084349L762335L830582M317253
1670.4C06538641M122228M132211M455358M167735L795773L891766M846603M846275
1686.7C40796590M237920M267067M044562M146427M432231M409015M941106M538775
1703C75813693M056036M193217L950864L634006L390044L279596L640712L838926L428638
1721.4D09225732L220707L286630L212154L065109K861321L118128L474742L098101
1737.7D34562624K980828L083288L010393K865791K749324K874732L059357K834201
1754D58020538K623946K619415K535194K532989K473682K258539K070666J845538J753182
1772.4D78733689J783460J464903Q00580O0260n43266j179904j814306k263754k911568
$$ plain form
1790.7 474130094 470812470 468138009 466159999 464609683 463835865 464068025 465159297 467078686 469888955
1809.1 469888955 473549783 477820694 482489854 487496853 492626339 497554153 502298713 507004917
1825.4 507004917 511334181 515372097 519405842 523147702 526485622 529565752 532428682 534983814
1841.7 534983814 537403703 539961576 542522848 544936419 547171235 549249113 551319540 553397477
1858 553397477 555367768 557219446 559029162 560744762 562385142 564209640 566159606 568023264 569726646
1876.4 569726646 571314514 572889209 574494839 576066434 577531457 578986406 580544412 582079351
1892.7 582079351 583485007 584922671 586413443 587822735 589139283 590483487 591852844 593149662
1909 593149662 594420433 595717907 596972525 598108768 599247932 600459635 601756036 603088379 604295492
$$ packed form
1790.7D74130094l317624k674461j978010j550316p73818K32160J091272J919389K810269
1809.1D69888955L660828M270911M669160N006999N129486M927814M744560M706204
1825.4E07004917M329264M037916M033745L741860L337920L080130K862930K555132
1841.7E34983814K419889K557873K561272K413571K234816K077878K070427K077937
1858E53397477J970291J851678J809716J715600J640380J824498J949966J863658J703382
1876.4E69726646J587868J574695J605630J571595J465023J454949J558006J534939
1892.7E82079351J405656J437664J490772J409292J316548J344204J369357J296818
1909E93149662J270771J297474J254618J136243J139164J211703J296401J332343J207113
$$ plain form
1927.4 604295492 605395436 606509268 607649922 608742177 609807491 610862792 611873686 612893045
1943.7 612893045 613988340 615089595 616096318 617004395 617910624 618840933 619687080 620467067 621259570
1962.1 621259570 622073710 622911155 623843670 624863625 625896513 626921773 627881289 628768861 629674375
1980.4 629674375 630624294 631507337 632306695 633087575 633879006 634696126 635524988 636352301 637155652 637909412
2000.8 637909412 638641536 639403462 640171230 640910923 641602457 642282426 642995536 643709600 644395351 645091116
2021.2 645091116 645819306 646485806 647069156 647687256 648396373 649100900 649750054 650389135 651054978 651723325
2041.6 651723325 652342141 652968824 653648078 654314280 654923201 655547023 656226158 656895220 657508850 658101320
2062 658101320 658729494 659353137 659921944 660507679 661158741 661773205 662332118 662929475 663576007 664190054
$$ packed form
1927.4F04295492J099944J113832J140654J092255J065314J055301J010894J019359
1943.7F12893045J095295J101255J006723R08077R06229R30309Q46147P79987P92503
1962.1F21259570Q14140Q37445R32515J019955J032888J025260R59516Q87572R05514
1980.4F29674375R49919Q83043P99358P80880P91431Q17120Q28862Q27313Q03351P53760
2000.8F37909412P32124P61926P67768P39693O91534O79969P13110P14064O85751O95765
2021.2F45091116P28190O66500N83350O18100P09117P04527O49154O39081O65843O68347
2041.6F51723325O18816O26683O79254O66202O08921O23822O79135O69062O13630N92470
2062F58101320O28174O23643N68807N85735O51062O14464N58913N97357O46532O14047
$$ plain form
2082.4 664190054 664726496 665272474 665878296 666470945 667002261 667528927 668092012 668636262 669096887 669523358
2102.8 669523358 670004070 670485556 670905113 671311021 671743810 672169983 672585249 673018217 673441589 673815429
2123.2 673815429 674164593 674535930 674921036 675297916 675650001 676016629 676429927 676822186 677159369 677508116
2143.6 677508116 677926481 678362489 678759456 679170310 679654896 680164456 680643857 681141555 681698978 682238102
2164 682238102 682735562 683281422 683898330 684527397 685104668 685665309 686272204 686875880 687448025 688040912
2184.4 688040912 688639402 689213336 689784467 690350115 690911949 691454053 691954195 692432106 692924976 693421543
2204.8 693421543 693880439 694327652 694800138 695292890 695788264 696255505 696680903 697101593 697526395 697944164
2225.2 697944164 698369145 698808014 699234962 699638367 700048566 700478792 700929284 701366186 701784074 702225864
$$ packed form
2082.4F64190054N36442N45978O05822N92649N31316N26666N63085N44250M60625M26471
2102.8F69523358M80712M81486M19557M05908M32789M26173M15266M32968M23372L73840
2123.2F73815429L49164L71337L85106L76880L52085L66628M13298L92259L37183L48747
2143.6F77508116M18365M36008L96967M10854M84586N09560M79401M97698N57423N39124
2164F82238102M97460N45860O16908O29067N77271N60641O06895O03676N72145N92887
2184.4F88040912N98490N73934N71131N65648N61834N42104N00142M77911M92870M96567
2204.8F93421543M58896M47213M72486M92752M95374M67241M25398M20690M24802M17769
2225.2F97944164M24981M38869M26948M03405M10199M30226M50492M36902M17888M41790
$$ plain form
2245.6 702225864 702680588 703089476 703467727 703898907 704348862 704759300 705165565 705598295 706041634 706475377
2265.9 706475377 706889093 707302511 707737803 708165765 708551168 708915412 709299564 709660470 709974051 710286438
2286.3 710286438 710610032 710893393 711119354 711356640 711631894 711889088 712060988 712189019 712348580 712487817
2306.7 712487817 712557375 712655365 712812722 712893367 712878168 712854385 712856948 712880850 712882578 712876320 712960720 713149190
2331.2 713149190 713396370 713652134 713864505 714016676 714180052 714577496 715323150 716059327 716337621 716126800
2351.6 716126800 715683341 715233624 714896381 714829266 715150774 715723813 716392040 717214227 718163431 719058394
2372 719058394 719902873 720818818 721740842 722547233 723228991 723810434 724250913 724524140 724687159 724823296
2392.4 724823296 724972725 725121856 725253820 725374460 725487947 725575745 725642264 725707710 725773513 725828707
$$ packed form
2245.6G02225864M54724M08888L78251M31180M49955M10438M06265M32730M43339M33743
2265.9G06475377M13716M13418M35292M27962L85403L64244L84152L60906L13581L12387
2286.3G10286438L23594K83361K25961K37286K75254K57194J71900J28031J59561J39237
2306.7G12487817O9558R7990J57357Q0645j5199k3783K563K3902J728o258Q4400J88470
2331.2G13149190K47180K55764K12371J52171J63376L97444P45654P36177K78294k10821
2351.6G16126800m43459m49717l37243o7115L21508N73039O68227Q22187R49204Q94963
2372G19058394Q44479R15945R22024Q06391O81758N81443M40479K73227J63019J36137
2392.4G24823296J49429J49131J31964J20640J13487Q7798O6519O5446O5803N5194
$$ plain form
2412.8 725828707 725844920 725813687 725769043 725725055 725654006 725554764 725451052 725332797 725153267 724929392 724727929
2435.2 724727929 724499345 724165618 723765850 723332942 722824216 722234607 721604407 720926940 720135450 719201863
2455.6 719201863 718162596 717033327 715746462 714253306 712634087 710909247 708966076 706752121
2471.9 706752121 704332113 701757431 698982835 695960879 692720890 689322472 685795784 682174444
2488.3 682174444 678556502 675048172 671675086 668458283 665474534 662752092 660214663 657797039
2504.6 657797039 655497193 653311193 651196182 649099350 647093415 645303965 643756092 642467678
2520.9 642467678 641495228 640873671 640645981 640843868 641450346 642473817 643925369 645765781 647920966
2539.2 647920966 650328815 652933598 655646026 658404112 661148787 663781106 666236520 668506622
$$ packed form
2412.8G25828707J6213l1233m4644m3988p1049r9242j03712j18255j79530k23875k01463
2435.2G24727929k28584l33727l99768m32908n08726n89609o30200o77467p91490r33587
2455.6G19201863j039267j129269j286865j493156j619219j724840j943171k213955
2471.9G06752121k420008k574682k774596l021956l239989l398418l526688l621340
2488.3F82174444l617942l508330l373086l216803k983749k722442k537429k417624
2504.6F57797039k299846k186000k115011k096832k005935j789450j547873j288414
2520.9F42467678r72450o21557k27690J97887O06478J023471J451552J840412K155185
2539.2F47920966K407849K604783K712428K758086K744675K632319K455414K270102
$$ plain form
2555.6 668506622 670616984 672573745 674330592 675878167 677255034 678486943 679552317 680437863
2571.9 680437863 681227386 681962550 682602823 683149755 683630824 684046030 684385180 684654713 684884727 685128033
2592.3 685128033 685389221 685652852 685970247 686339915 686665118 686983049 687418997 687947094 688500881 689093769
2612.7 689093769 689768016 690551281 691464424 692489803 693575501 694702804 695849001 696995139 698156297
2631 698156297 699309766 700435340 701564193 702675283 703741968 704771638 705741346 706646860 707469881
2649.4 707469881 708160520 708718717 709193826 709614158 709938228 710115731 710196912 710283101 710350275 710302651
2669.8 710302651 710174561 710043311 709886491 709668338 709435165 709282637 709148109 708890915 708597720 708375573
2690.2 708375573 708128989 707797706 707451999 707132518 706828654 706510484 706168532 705834031 705493748 705109417
$$ packed form
2555.6F68506622K110362J956761J756847J547575J376867J231909J065374Q85546
2571.9F80437863P89523P35164O40273N46932M81069M15206L39150K69533K30014K43306
2592.3F85128033K61188K63631L17395L69668L25203L17931M35948N28097N53787N92888
2612.7F89093769O74247P83265R13143J025379J085698J127303J146197J146138J161158
2631F98156297J153469J125574J128853J111090J066685J029670R69708R05514Q23021
2649.4G07469881O90639N58197M75109M20332L24070J77503Q1181Q6189O7174m7624
2669.8G10302651j28090j31250j56820k18153k33173j52528j34528k57194k93195k22147
2690.2G08375573k46584l31283l45707l19481l03864l18170l41952l34501l40283l84331
$$ plain form
2710.6 705109417 704714894 704349220 703992665 703573704 703067720 702573895 702129364 701720476 701354802 700980783
2731 700980783 700561047 700101852 699641109 699211955 698773682 698271573 697732329 697221220 696752191 696276307
2751.4 696276307 695766628 695255160 694732785 694163918 693564773 692979336 692409337 691802025 691116869 690386474
2771.8 690386474 689682186 689018548 688338459 687610626 686855376 686058044 685180008 684258759 683382511 682510018
2792.2 682510018 681532919 680481374 679449916 678425908 677327394 676160634 674934745 673622012
2808.5 673622012 672309339 671049118 669729114 668274641 666736603 665183783 663612366 661974847
2824.8 661974847 660258651 658473611 656588197 654549778 652373552 650078237 647687018 645207584
2841.1 645207584 642463267 639299631 635890901 632665098 629962981 627820611 626047969 624398291
$$ packed form
2710.6G05109417l94523l65674l56555m18961n05984m93825m44531m08888l65674l74019
2731G00980783m19736m59195m60743m29154m38273n02109n39244n11109m69029m75884
2751.4F96276307n09679n11468n22375n68867n99145n85437n69999o07312o85156p30395
2771.8F90386474p04288o63638o80089p27833p55250p97332q78036r21249q76248q72493
2792.2F82510018r77099j051545j031458j024008j098514j166760j225889j312733
2808.5F73622012j312673j260221j320004j454473j538038j552820j571417j637519
2824.8F61974847j716196j785040j885414k038419k176226k295315k391219k479434
2841.1F45207584k744317l163636l408730l225803k702117k142370j772642j649678
$$ plain form
2857.4 624398291 622741818 621054292 619254768 617263973 615153193 613000989 610833943 608825147
2873.7 608825147 607112110 605588436 604148209 602751791 601384938 600097656 598890185 597745538
2890.1 597745538 596684992 595686793 594763994 593985856 593284547 592537761 591751337 590912461 589861393
2908.4 589861393 588472426 586803138 585037529 583424151 582138419 581193149 580513120 580048501 579779923
2926.8 579779923 579717577 579935610 580393195 580929518 581518292 582221091 582949996 583595753 584219337 584845424
2947.2 584845424 585328460 585561156 585642099 585678697 585690737 585745871 585916817 586233497 586696088 587292075
2967.6 587292075 587975800 588648319 589307249 589985967 590569317 591014922 591471493 591972947 592362702 592562377
2987.9 592562377 592616975 592645884 592772067 592940211 593109190 593324363 593529344 593718648 593949139 594130456
$$ packed form
2857.4F24398291j656473j687526j799524j990795k110780k152204k167046k008796
2873.7F08825147j713037j523674j440227j396418j366853j287282j207471j144647
2890.1E97745538j060546r98199r22799p78138p01309p46786p86424q38876j051068
2908.4E89861393j388967j669288j765609j613378j285732r45270o80029m64619k68578
2926.8E79779923o2346K18033M57585N36323N88774P02799P28905O45757O23584O26087
2947.2E84845424M83036K32696Q0943L6598J2040N5134J70946L16680M62591N95987
2967.6E87292075O83725O72519O58930O78718N83350M45605M56571N01454L89755J99675
2987.9E92562377N4598K8909J26183J68144J68979K15173K04981J89304K30491J81317
$$ plain form
3008.3 594130456 594195366 594286263 594514847 594791353 594972849 595004082 594891906 594671011 594357669 593920946
3028.7 593920946 593375862 592768729 592140198 591483414 590710759 589844108 589002907 588197529 587359488 586411297
3049.1 586411297 585374177 584360540 583361924 582350612 581338704 580280840 579170465 578023612
3065.5 578023612 576899111 575894415 574938834 573879421 572661281 571367919 570183694 569120884
3081.8 569120884 568043172 566932619 565805733 564671099 563553870 562446892 561315656 560089171
3098.1 560089171 558786750 557530522 556297719 554966390 553608954 552350760 551060677 549571514
3114.4 549571514 547989368 546508968 545171201 543879986 542495728 540980756 539437711 537945926
3130.7 537945926 536447883 534868062 533218563 531539977 529861152 528210819 526581466 524901569
$$ packed form
3008.3E94130456O4910R0897K28584K76506J81496L1233j12176k20895l13342m36723
3028.7E93920946n45084o07133o28531o56784p72655q66651q41201q05378q38041r48191
3049.1E86411297j037120j013637r98616j011312j011908j057864j110375j146853
3065.5E78023612j124501j004696r55581j059413j218140j293362j184225j062810
3081.8E69120884j077712j110553j126886j134634j117229j106978j131236j226485
3098.1E60089171j302421j256228j232803j331329j357436j258194j290083j489163
3114.4E49571514j582146j480400j337767j291215j384258j514972j543045j491785
3130.7E37945926j498043j579821j649499j678586j678825j650333j629353j679897
$$ plain form
3147 524901569 523098528 521207571 519402027 517707407 515924692 514033794 512184262 510387421 508557320
3165.4 508557320 506653607 504699886 502726614 500726402 498723835 496760160 494806498 492818117
3181.7 492818117 490790308 488731802 486659199 484594733 482554734 480522335 478475302 476419032
3198 476419032 474357218 472321093 470304161 468276232 466267139 464285791 462287366 460244030 458211511
3216.4 458211511 456254154 454334795 452379197 450385571 448397070 446417749 444421947 442445159
3232.7 442445159 440554023 438720226 436870754 435005218 433126271 431202084 429285467 427426308
3249 427426308 425601125 423784375 421961576 420150012 418340206 416518897 414711028 412916094 411146224
3267.4 411146224 409426242 407732606 406059116 404404610 402758121 401150554 399564058 397929579
$$ packed form
3147E24901569j803041j890957j805544j694620j782715j890898j849532j796841j830101
3165.4E08557320j903713j953721j973272k000212k002567j963675j953662j988381
3181.7D92818117k027809k058506k072603k064466k039999k032399k047033k056270
3198D76419032k061814k036125k016932k027929k009093j981348j998425k043336k032519
3216.4D58211511j957357j919359j955598j993626j988501j979321j995802j976788
3232.7D42445159j891136j833797j849472j865536j878947j924187j916617j859159
3249D27426308j825183j816750j822799j811564j809806j821309j807869j794934j769870
3267.4D11146224j719982j693636j673490j654506j646489j607567j586496j634479
$$ plain form
3283.7 397929579 396275192 394663244 393070549 391497910 389969319 388476908 386999249 385477185
3300 385477185 383877069 382234156 380615622 379022360 377383322 375685275 373956621 372191757 370380610
3318.4 370380610 368537813 366662949 364705086 362664670 360651940 358671099 356595933 354447663
3334.7 354447663 352360398 350325584 348260105 346194476 344174802 342186153 340225697 338315904
3351 338315904 336454093 334609717 332759887 330889076 329025507 327214539 325479180 323793888 322143316
3369.3 322143316 320536613 318937451 317407608 316039145 314754635 313434064 312128901 310971528
3385.7 310971528 309966862 309029937 308123469 307244599 306389481 305611044 304931313 304277986 303605795
3404 303605795 302966505 302416414 301969707 301607698 301311523 301070213 300855190 300667465 300555706 300604016
$$ packed form
3283.7C97929579j654387j611948j592695j572639j528591j492411j477659j522064
3300C85477185j600116j642913j618534j593262j639038j698047j728654j764864j811147
3318.4C70380610j842797j874864j957863k040416k012730j980841k075166k148270
3334.7C54447663k087265k034814k065479k065629k019674j988649j960456j909793
3351C38315904j861811j844376j849830j870811j863569j810968j735359j685292j650572
3369.3C22143316j606703j599162j529843j368463j284510j320571j305163j157373
3385.7C10971528j004666r36925r06468q78870q55118p78437o79731o53327o72191
3404C03605795o39290n50091m46707l62009k96175k41310k15023j87725j11759M8310
$$ plain form
3424.4 300604016 300831795 301124454 301409751 301812798 302347958 302871078 303399652 304048628 304829240 305682719
3444.8 305682719 306578755 307539612 308639735 309831768 311067343 312425971 313897759 315367222 316806346
3463.2 316806346 318337381 320026457 321724713 323351979 325040638 326835155 328722686 330615908
3479.5 330615908 332438439 334297150 336292773 338413656 340604246 342822671 345011741 347177178
3495.8 347177178 349385977 351706743 354117423 356516123 358873188 361298800 363877177 366565198
3512.1 366565198 369254410 371885955 374555409 377300054 380107194 382941633 385792375 388767570
3528.4 388767570 391914457 395102084 398280710 401510656 404766440 408063382 411415160 414865911
3544.7 414865911 418431878 422021002 425614953 429329991 433175802 437063992 440991282 444912225
$$ packed form
3424.4C00604016K27779K92659K85297M03047N35160N23120N28574O48976P80612Q53479
3444.8C05682719Q96036R60857J100123J192033J235575J358628J471788J469463J439124
3463.2C16806346J531035J689076J698256J627266J688659J794517J887531J893222
3479.5C30615908J822531J858711J995623K120883K190590K218425K189070K165437
3495.8C47177178K208799K320766K410680K398700K357065K425612K578377K688021
3512.1C66565198K689212K631545K669454K744645K807140K834439K850742K975195
3528.4C88767570L146887L187627L178626L229946L255784L296942L351778L450751
3544.7D14865911L565967L589124L593951L715038L845811L888190L927290L920943
$$ plain form
3561.1 444912225 448740661 452660799 457127780 461874276 466397345 470886946 475511789 480163962
3577.4 480163962 484840006 489556640 494195223 498936176 504153013 509515703 514528632 519514799
3593.7 519514799 524711311 529955328 535225153 540494919 545574009 550568223 555864811 561261058
3610 561261058 566459656 571530998 576397896 581451297 586892366 591905236 596271098 600624502 605908394
3628.4 605908394 611501455 616152942 620536208 624933124 629193604 633325279 637126744 640506268
3644.7 640506268 643906772 648029089 652291119 655614495 658620834 661929667 665002346 667689621
3661 667689621 670185447 672345638 674268365 676362038 678424299 680147350 682094276 684079707 685661256
3679.4 685661256 687097311 688384593 689521730 690805435 692244112 693479896 694505990 695434511
$$ packed form
3561.1D44912225L828436L920138M466981M746496M523069M489601M624843M652173
3577.4D80163962M676044M716634M638583M740953N216837N362690N012929M986167
3593.7E19514799N196512N244017N269825N269766N079090M994214N296588N396247
3610E61261058N198598N071342M866898N053401N441069N012870M365862M353404N283892
3628.4F05908394N593061M651487M383266M396916M260480M131675L801465L379524
3644.7F40506268L400504M122317M262030L323376L006339L308833L072679K687275
3661F67689621K495826K160191J922727K093673K062261J723051J946926J985431J581549
3679.4F85661256J436055J287282J137137J283705J438677J235784J026094R28521
$$ plain form
3695.7 695434511 696302295 697214603 698272407 699237764 699929774 700549841 701342106 702292144 703083038
3714 703083038 703632116 704031765 704336941 704656601 705066621 705467939 705766022 706020057 706275225 706605494
3734.4 706605494 707082748 707374215 707331061 707348824 707690537 707960963 708132744 708537877 708936691 709169686
3754.8 709169686 709433675 709770858 710006773 710108817 710195959 710293412 710503161 710772574 710891545 710907638
3775.2 710907638 710980713 711092830 711126685 711185098 711337507 711473346 711559951 711551547 711384118 711144328 710909903
3797.7 710909903 710821152 710924029 710962594 711057127 711288810 711321950 711147130 711041152 711009145 710812390
3818 710812390 710681796 710780740 710901499 711030185 711096883 711045563 710963190 710865676 710767686 710736454 710781574
3840.5 710781574 710884035 710965931 710886061 710571706 710174203 710155249 710441291 710411847 710228920 710119605
$$ packed form
3695.7F95434511Q67784R12308J057804R65357O92010O20067P92265R50038P90894
3714G03083038N49078L99649L05176L19660M10020M01318K98083K54035K55168L30269
3734.4G06605494M77254K91467m3154J7763L41713K70426J71781M05133L98814K32995
3754.8G09169686K63989L37183K35915J02044Q7142R7453K09749K69413J18971J6093
3775.2G10907638P3075J12117L3855N8413J52409J35839Q6605q404j67429k39790k34425
3797.7G10909903q8751J02877L8565R4533K31683L3140j74820j05978l2007j96755
3818G10812390j30594R8944J20759J28686O6698n1320q2373r7514r7990l1232M5120
3840.5G10781574J02461Q1896p9870l14355l97503j8954K86042k9444j82927j09315
$$ plain form
3860.9 710119605 710107565 710092664 709923923 709756494 709740937 709768653 709811091 709783435 709647954 709438503 709271073
3883.3 709271073 709298432 709332466 709272742 709249854 709141433 708827138 708456457 708188713 708108008 708263159
3903.7 708263159 708463311 708532989 708517432 708404422 708208442 708063006 707991183 707846642 707640767 707534611
3924.1 707534611 707496822 707387567 707255006 707227111 707265556 707235157 707060754 706842661 706726909 706638157
3944.5 706638157 706517041 706457436 706442535 706369758 706263661 706203938 706171393 706100285 706021070 705961943 705864608
3966.9 705864608 705766141 705719531 705680907 705655217 705639899 705586135 705542386 705507994 705408752 705304146 705263376
3989.4 705263376 705231667 705181539 705190837 705216289
3997.5 705216289
$$ packed form
3860.9G10119605j2040j4901j68741j67429j5557K7716M2438k7656j35481k09451j67430
3883.3G09271073K7359L4034n9724k2888j08421l14295l70681k67744q0705J55151
3903.7G08263159K00152O9678j5557j13010j95980j45436p1823j44541k05875j06156
3924.1G07534611l7789j09255j32561k7895L8445l0399j74403k18093j15752q8752
3944.5G06638157j21116n9605j4901p2777j06097n9723l2545p1108p9215n9127r7335
3966.9G05864608r8467m6610l8624k5690j5318n3764m3749l4392r9242j04606m0770
3989.4G05263376l1709n0128R298K5452
3997.5G05216289
##END=$$ End of the data block
