##TITLE=AP-75 $$ Begin of the data block
##JCAMP-DX=5.00 $$ ACD/SpecManager v 10.08
##SPECTROMETER/DATA SYSTEM=Alpha
##DATE=01 Apr 2014 10:23:56
##DATA TYPE=INFRARED SPECTRUM
##DATA CLASS=XYDATA
##ORIGIN=
##OWNER=
##NPOINTS=1667
##FIRSTX=599.63549805
##LASTX=3997.56909180
##MAXX=3997.56909180
##MINX=599.63549805
##MAXY=1.09489548
##MINY=0.71610790
##XFACTOR=1.0000000000
##YFACTOR=0.000000010000000
##FIRSTY=1.04461157
##DELTAX=2.03957605
##XUNITS=1/CM
##YUNITS=ARBITRARY UNITS
##XYDATA=(X++(Y..Y))
599.6A04461157l3879l5858q655J7155L9374O2466P2885O5743M5705K2972J2612J0169
$$ 104461157 104427278 104391420 104382765 104399920 104439294 104501760 104574645 104640388 104686093 104709065 104721677 104731846
624.1A04731846J6391K9123J0169j9050j67L2246L6264J6999o676j1611K802J6939
$$ 104731846 104748237 104777360 104787529 104768479 104768312 104800558 104836822 104853821 104847145 104835534 104838336 104855275
648.6A04855275P379k5975q0848j41192j63483j15359l2127M065l195J5652L7301J0002
$$ 104855275 104862654 104836679 104755831 104614639 104451156 104335797 104303670 104307735 104304540 104320192 104357493 104367495
673.1A04367495k8468l5727k4080k6810l0792l3974l5847j9490L469J7201J717k8586
$$ 104367495 104339027 104303300 104279220 104252410 104221618 104187644 104151797 104132307 104135776 104152977 104154694 104126108
697.5A04126108l0840r417P629J4627M0627Q5938J02198P3313J7703m6825r0707q2314
$$ 104126108 104095268 104085851 104093480 104108107 104148734 104234672 104336870 104410183 104427886 104381061 104290354 104208040
722A04208040k6119L7122P7248R0861P6425M4418K8646M1341N7459N5647M3500L7682
$$ 104208040 104181921 104219043 104296291 104387152 104463577 104507995 104536641 104577982 104635441 104691088 104734588 104772270
746.5A04772270K9027J0646j08q22j776j455q702l7384o3789q4376j18494j52696j89745
$$ 104772270 104801297 104811943 104811835 104811013 104809237 104807782 104799080 104761696 104697907 104613531 104495037 104342341 104152596
773A04152596k47407l37076m59254o08599p92098r81152j115632j155132j084125r36866
$$ 104152596 103905189 103568113 103108859 102500260 101708162 100727010 99611378 98456246 97372121 96435255
793.4I6435255p67833o04755m47702k82657j01215J00332L01159M60929N39666N17166
$$ 96435255 95667422 95062667 94614965 94332308 94231093 94331425 94632584 95093513 95633179 96150345
813.8I6150345M24373L72851M75508P14463R47964J034194R41980P51948N56624L97587
$$ 96150345 96574718 96947569 97423077 98137540 99085504 100119698 101061678 101813626 102370250 102767837
834.2A02767837K86365K03132J38164J18065J25861J21784R2530M3512j538l9697p7033
$$ 102767837 103054202 103257334 103395498 103513563 103639424 103761208 103853738 103897250 103895712 103856015 103778982
856.6A03778982j01375j05143q0323k7764K2328M8017O1691P8643J03104J27148J36411
$$ 103778982 103677607 103572464 103492141 103464377 103486705 103534722 103596413 103675056 103778160 103905308 104041719
879.1A04041719J43111J50645J31822J03378R7990R9456R2352Q4650P2825N4825M3237
$$ 104041719 104184830 104335475 104467297 104570675 104668665 104768121 104860473 104945123 105017948 105072773 105116010
901.5A05116010L6561K6548J7452J6749J6010O628K575J5295L8266M9865L7742J5819
$$ 105116010 105152571 105179119 105196571 105213320 105229330 105235958 105238533 105253828 105292094 105341959 105379701 105395520
926A05395520N853R835Q022Q11k14l22J382P391N877k050n60M101m852k0671l2413
$$ 105395520 105401373 105411208 105419230 105420041 105419827 105419505 105420887 105428278 105434155 105432105 105431545 105435646 105430794 105410123 105377710
956.6A05377710m5085o4731p8320o9583n1796l7325k6965k8622l9160n4884p7999j01864
$$ 105377710 105332625 105267894 105189574 105119991 105068195 105030870 105003905 104975283 104936123 104881239 104803240 104701376
981A04701376j20950j40905j66989j98519k38299k90549l54063m29523n22459o36148
$$ 104701376 104580426 104439521 104272532 104074013 103835714 103545165 103191102 102761579 102239120 101602972
1001.4A01602972p63703q85689r69327r75263q85170p09826m90481k78812j03862K9427
$$ 101602972 100839269 99953580 98984253 98008990 97123820 96413994 95923513 95644701 95540839 95570266
1021.8I5570266J23227J71941J83875J85418J90306J99920K10213K12646K08503J97929
$$ 95570266 95693493 95865434 96049309 96234727 96425033 96624953 96835166 97047812 97256315 97454244
1042.2I7454244J77830J55980J30599R2799N1135J8894q499l4642n5039p4035r2030
$$ 97454244 97632074 97788054 97918653 98011452 98062587 98081481 98072982 98038340 97983301 97909266 97817236
1064.7I7817236j12003j37257j55968j67441j81097j91105j93357j99145k13194k23696
$$ 97817236 97705233 97567976 97412008 97244567 97063470 96872365 96679008 96479863 96266669 96042973
1085I6042973k24889k19351k02643j71441j22655m5997O4767J98185L34609M54712
$$ 96042973 95818084 95598733 95396090 95224649 95101994 95055997 95120764 95318949 95653558 96108270
1105.4I6108270N45531O05869O32471O29056O10161N79029N40441N01323M55558M06504
$$ 96108270 96653801 97259670 97892141 98521197 99131358 99710387 100250828 100752151 101207709 101614213
1125.8A01614213L58856L09288K66469K31933K01488J76084J52898J31666J08684R0754
$$ 101614213 101973069 102282357 102548826 102780759 102982247 103158331 103311229 103442895 103551579 103642333
1146.2A03642333Q5818P7343O1274N1296M7361M5765M9055N1462M3702L3665L6240
$$ 103642333 103728151 103805494 103866768 103918064 103965425 104011190 104060245 104111707 104155409 104189074 104225314
1168.7A04225314N9092Q7702R2661P7963O4266N3728M6730M6253M4429L7038K9612
$$ 104225314 104284406 104372108 104464769 104542732 104606998 104660726 104707456 104753709 104798138 104835176 104864788
1191.1A04864788K3508K0254J6534O795j430K276P809M756M411Q118Q810Q463O175
$$ 104864788 104888296 104908550 104925084 104931879 104930449 104932725 104940534 104945290 104949701 104957819 104966629 104975092 104981267
1217.6A04981267L314O509Q154L970L69l850j2732l0362m7970o1238q6856j28030j83702
$$ 104981267 104984581 104991090 104999244 105003214 105003583 104999733 104987001 104956639 104908669 104847431 104760575 104632545 104448843
1244.1A04448843k75886m27711o91080j172435j851106k348864k117187r15676Q20046
$$ 104448843 104172957 103745246 103054166 101881731 100030625 97681761 95564574 94648898 95468944
1262.5I5468944K088619K290344J763493J128685O75166M14693K77329J94263J35636
$$ 95468944 97557563 99847907 101611400 102740085 103415251 103829944 104107273 104301536 104437172
1280.8A04437172J01626Q4138P0429N0080K7752J8537J7357J1420O664J2874J9908
$$ 104437172 104538798 104622936 104693365 104743445 104771197 104789734 104807091 104818511 104825175 104838049 104857957
1303.3A04857957K3079L1019L7491L7932L6705L1996K7620K4259J3841L230k813j2958
$$ 104857957 104881036 104912055 104949546 104987478 105024183 105056179 105083799 105108058 105121899 105125129 105122316 105109358
1327.8A05109358k7394m5038o0522n9521m8411n5957o6459m7076k4951j8930j7428
$$ 105109358 105081964 105036926 104976404 104916883 104868472 104812515 104746056 104698980 104674029 104655099 104637671
1350.2A04637671j3888j6582m2653q4222j53649k97975l89075k76936j73878l03519
$$ 104637671 104623783 104607201 104564548 104480326 104326677 104028702 103639627 103362691 103188813 102885294
1370.6A02885294n95915p98560n75196L2091N71167P37858P02465O52730M49813J94323
$$ 102885294 102289379 101490819 100915623 100947714 101518881 102256739 102959204 103611934 104061747 104256070
1391A04256070Q9609K6465m7958p6580p2038l9721k0611m2510l8564l338L9720J08302
$$ 104256070 104345679 104372144 104324186 104247606 104175568 104135847 104115236 104072726 104034162 104030824 104070544 104178846
1415.5A04178846J89221J70731N2107O652k0230o2359j29938k37548k88904l63171
$$ 104178846 104368067 104538798 104590905 104597557 104577327 104514968 104385030 104147482 103858578 103495407
1435.9A03495407n61643o79004p39455p97927p56139o50805n74148n82474n50807l82870
$$ 103495407 102933764 102254760 101515305 100717378 99961239 99310434 98736286 98153812 97603005 97220135
1456.2I7220135j73998l5685J35570L62021O05613R43828J418698J715219J258277
$$ 97220135 97046137 97010452 97146022 97508043 98113656 99057484 100476182 102191401 103449678
1474.6A03449678O25885L77035L05832K55417K22755K39265K23160R9730J8680Q2147
$$ 103449678 104075563 104452598 104758430 105013847 105236602 105475867 105699027 105798757 105817437 105899584
1495A05899584J36197M5085j7381O6972K52008K51091n9819j24455l0279M2534M1425
$$ 105899584 106035781 106080866 106063485 106130457 106382465 106633556 106573737 106449282 106419003 106461537 106502962
1517.4A06502962K5296J3733p3755j08122r4676p8237j0860L731l9995N5611J53232
$$ 106502962 106528258 106541991 106468236 106360114 106265438 106187201 106176341 106180072 106140077 106195688 106348920
1539.9A06348920o1011k41566k25306j48248q0371m1604J3005J11354J71363j15943
$$ 106348920 106287909 106046343 105821037 105672789 105592418 105550814 105563819 105675173 105846536 105730593
1560.3A05730593k73549j22118J0407Q9609O7389J1003R4760J38771J1254j1862N2166
$$ 105730593 105457044 105334926 105345333 105434942 105502331 105513334 105608094 105746865 105758119 105746257 105798423
1582.7A05798423P7796P8762Q1324Q4949Q5604Q1682P3362P6318Q5473P2169N0700
$$ 105798423 105876219 105954981 106036305 106121254 106206858 106288540 106361902 106438220 106523693 106595862 106646562
1605.1A06646562M7445L8946J5091L5835J02198N9855n1677q703M6719K634k5618l4511
$$ 106646562 106694007 106732953 106748044 106783879 106886077 106945932 106894255 106885552 106932271 106934905 106909287 106874776
1629.6A06874776k825J15358J41335o2931j37412n4443N8341J51467N8830k6977J10436
$$ 106874776 106871951 106987309 107128644 107065713 106928301 106873858 106932199 107083666 107142496 107115519 107225955
1652A07225955M4083k13921j50800j549O5887J1003n961P5269N6648l2854k0790l1018
$$ 107225955 107270038 107056117 106905317 106903768 106969655 106980658 106974697 107049966 107106614 107073760 107052970 107021952
1676.5A07021952n2297K4533J34218O6745j43802j38617o6638n925Q9097R9385L5370
$$ 107021952 106969655 106994188 107128406 107195151 107051349 106912732 106846094 106840169 106929266 107028651 107064021
1699A07064021p4125j73461j47998j57595j74439j00875K1243J45805J66488K753q2111
$$ 107064021 106989896 106816435 106668437 106510842 106336403 106235528 106256771 106402576 106569064 106571817 106489706
1721.4A06489706k8110R954K1577M5586P8678P2098p1812j11770l3367j7345j1337
$$ 106489706 106461596 106471550 106493127 106538713 106617391 106689489 106617677 106505907 106472540 106455195 106443858
1743.8A06443858M6516J11305J36865R5570P1847J10662J20664J03008P7928J8286
$$ 106443858 106490374 106601679 106738544 106834114 106905961 107016623 107137287 107240295 107318223 107336509
1764.2A07336509K4784P9918J10745P3874m6110q1503k0588J5855N376j454n400J7559
$$ 107336509 107361293 107441211 107551956 107625830 107579720 107498217 107477629 107493484 107498860 107497406 107492006 107509565
1788.7A07509565P9203O0332l5775l9625J0633J4186j7690k3532J943K5833J4817j6260
$$ 107509565 107588768 107649100 107613325 107573700 107584333 107598519 107580829 107557297 107559240 107585073 107599890 107583630
1813.2A07583630j3721N555N400J0729L7921M5502L4857K4509l0768n6135j3614Q726
$$ 107583630 107569909 107575464 107580864 107591593 107629514 107675016 107709873 107734382 107703614 107647479 107633865 107642591
1837.6A07642591O270M0710O7997l814o1024l8051j0753J407M768N782K169l695J1098
$$ 107642591 107648861 107689571 107757568 107753754 107692730 107654679 107643926 107645333 107650101 107655883 107658052 107654357 107665455
1864.2A07665455N1511N9938j0371n7745l3641p534K563P653L863q23J0967K7943Q130
$$ 107665455 107716966 107776904 107766533 107708788 107675147 107667613 107670176 107677829 107681692 107680869 107691836 107719779 107727909
1890.7A07727909j6189p379n376q786J419O211M518R203Q607n424j1599O949K5738
$$ 107727909 107711720 107704341 107698965 107690179 107691598 107697809 107702327 107711530 107720137 107714713 107703114 107710063 107735801
1917.2A07735801R024q953p856j3983j2374K15L660m876q667j418J1098K4963J2338
$$ 107735801 107744825 107735872 107728016 107714033 107701659 107701874 107705534 107700658 107691991 107690573 107701671 107726634 107738972
1943.7A07738972j4842j9288p677N484J1849R346M542M435M458R203J8728R739l123
$$ 107738972 107724130 107704842 107697165 107702649 107714498 107723844 107728386 107732821 107737279 107746482 107765210 107774949 107771826
1970.2A07771826L361P916L815L969O819N913j55j144N292J0324O211n794o556M315
$$ 107771826 107775187 107783103 107786918 107790887 107797706 107803619 107803464 107802320 107807612 107817936 107824147 107818353 107811797 107816112
1998.8A07816112R155O819M172J562K027P450J0133R346P331J812k396k122J979K706
$$ 107816112 107825267 107832086 107836258 107837820 107839847 107847297 107857430 107866776 107874107 107875919 107873523 107871401 107873380 107876086
2027.3A07876086k527j884J085J312J263k634n424n448n889j168O771R679Q655L338
$$ 107876086 107873559 107871675 107872760 107874072 107875335 107872701 107867277 107861829 107855940 107854772 107861543 107871222 107879877 107883215
2055.9A07883215k325p1N591P200N019N126N841K336M65K420L672L648J108k527n24
$$ 107883215 107880890 107880819 107886410 107893610 107898629 107903755 107909596 107911932 107912397 107914817 107918489 107922137 107923245 107920718 107920194
2086.5A07920194L743M661M125J895l10K4R77L660O712L147j645j860j359n96J526
$$ 107920194 107923937 107928598 107932723 107934618 107934308 107934332 107935309 107938969 107945681 107948828 107947183 107945323 107943964 107943368 107944894
2117.1A07944894N007L290n329o449P1K516L898O521M446j025l648J168O354M232J097
$$ 107944894 107949901 107953191 107947862 107941413 107941484 107944000 107947898 107954419 107958865 107957840 107954192 107955360 107961714 107965946 107967043
2147.7A07967043K861L433M29J20m77k289K432J0442Q381j299n496m900J514J2351
$$ 107967043 107969904 107973337 107973766 107973886 107973409 107971120 107973552 107983994 107992375 107991076 107985580 107980680 107982194 107994545
2176.2A07994545J1777J681k086O0K229J216l469l088L004O140N233j07p117m828N495
$$ 107994545 108006322 108008003 108005917 108005977 108008206 108009422 108005953 108002865 108005869 108012009 108017242 108017135 108010018 108005190 108010685
2206.8A08010685Q631L70m769L183J2517J0312O20k647K528K276m839n985P15M244
$$ 108010685 108019316 108019686 108014917 108018100 108030617 108040929 108041549 108038902 108041430 108043706 108038867 108032882 108033597 108037841
2235.4A08037841L82k182j991j704J693J621j073L385Q393K539n484m255j836l386
$$ 108037841 108038223 108036041 108034050 108032346 108034039 108035660 108034587 108037972 108046365 108048904 108043420 108039165 108037329 108033943
2263.9A08033943r77L910k98n901l958l636j704L504J884m077o819o354m208j836o43
$$ 108033943 108032966 108036876 108036578 108030677 108026719 108023083 108021379 108024883 108026767 108022690 108015871 108009517 108005309 108003473 108002830
2294.5A08002830j181m875j0312j5557j8644j9193j5998o830k4m292j4186j3983p75
$$ 108002830 108001649 107996774 107986462 107970905 107952261 107933068 107917070 107910240 107910216 107905924 107891738 107877755 107876980
2321A07876980Q190P03j2278j1647K933J1849Q607N936N413M363J0299J3984j2148
$$ 107876980 107885170 107885873 107873595 107861948 107864881 107876730 107885337 107891273 107896686 107901049 107911348 107925332 107913184
2347.5A07913184l8946l0112o974O0K718Q166J5688K2864K0278J3256J0717J2326J1444
$$ 107913184 107874238 107844126 107837152 107837212 107839930 107848096 107863784 107886648 107906926 107920182 107930899 107943225 107954669
2374A07954669P939J3006K5249K6512J4543M363j454k432L374O401J717m208l493J442
$$ 107954669 107962608 107975614 108000863 108027375 108041918 108046281 108044827 108042395 108045769 108052170 108053887 108049679 108046186 108047628
2402.6A08047628L529K742J395j538m971k241M708M542l457l373M077M720K098k622
$$ 108047628 108051157 108053899 108055294 108053756 108048785 108046544 108051252 108055794 108052337 108048964 108053041 108057761 108059859 108057237
2431.2A08057237j0097p451J645O449R835N984l409l982J109J764j037j275q70j050
$$ 108057237 108047140 108039689 108041334 108047783 108057618 108063602 108060193 108056211 108057320 108059084 108058047 108056772 108055902 108054852
2459.7A08054852K122L469k38j931j168j526J931L230n281j0979r501o163K51L886
$$ 108054852 108056974 108060443 108060205 108058274 108057106 108055580 108057511 108060741 108055460 108044481 108034980 108028817 108029068 108032954
2488.3A08032954n031j5223r155L636N793R42j812l6O557Q213M471O175P140K170l302
$$ 108032954 108027923 108012700 108003545 108007181 108012974 108013916 108012104 108012068 108018625 108026838 108031309 108037484 108044624 108046794 108043492
2518.9A08043492m959k980k075l946j1849j8370j1456k480m518p081l338l039p856
$$ 108043492 108038533 108035553 108033478 108029532 108017683 107999313 107987857 107985377 107980859 107973778 107970440 107967401 107959545
2545.4A07959545j1027q321r78Q59p999j3566p284m673q726p105m268j0407j9335j9741
$$ 107959545 107948518 107940197 107939219 107940078 107932079 107918513 107911229 107906556 107897830 107890725 107886457 107876050 107856715 107836974
2573.9A07836974j4723j0907j1528j0490m149o830j5104j4127j0526j3435j5795j3232
$$ 107836974 107822251 107811344 107799816 107789326 107785177 107778347 107763243 107749116 107738590 107725155 107709360 107696128
2598.4A07696128j0026n757l040m041o533j0193j2278j0443q642p451l803l981r478
$$ 107696128 107686102 107680345 107677305 107673264 107666731 107656538 107644260 107633817 107625175 107617724 107613921 107609940 107600462
2624.9A07600462j2707q881k802j919j586o79m172r144j2684j1015n459p713j6773
$$ 107600462 107587755 107578874 107576072 107574153 107572567 107571888 107567716 107558572 107545888 107534873 107529414 107521701 107504928
2651.4A07504928k2232k2078j7464j4305j5402j2219o306n019n24R024J2159O759k86
$$ 107504928 107482696 107460618 107443154 107428849 107413447 107401228 107394922 107389903 107389379 107398403 107410562 107417321 107417035
2677.9A07417035j55Q953J5127J4007R919M160J288L230K802m363j0014p331n258r429
$$ 107417035 107416880 107425833 107440960 107454967 107464886 107469046 107470334 107473564 107476366 107472003 107461989 107454658 107449400 107439971
2706.5A07439971j6105k2197k6453k7918k9910l6097l1995j4890l361N328J5200K0039
$$ 107439971 107423866 107401669 107375216 107347298 107317388 107281291 107249296 107234406 107231045 107236373 107251573 107271612
2731A07271612K2912K6166K6632K2208J8728J6272O378n25R024J8049J0585j990j1599
$$ 107271612 107294524 107320690 107347322 107369530 107388258 107404530 107410908 107410383 107419407 107437456 107448041 107446051 107434452
2757.5A07434452j6892j7834k1243k2018k3091l3081m2259m6480m2582l8897m8948
$$ 107434452 107417560 107399726 107378483 107356465 107333374 107300293 107258034 107211554 107168972 107130075 107081127
2779.9A07081127o0141o6268p5555q6498q5271p1716o6996p4005p5436o5767o5875
$$ 107081127 107020986 106954718 106879163 106792665 106707394 106635678 106568682 106494677 106419241 106353474 106287599
2802.4A06287599q3685r7418j04761j11342j19209j39546j68324j91164k11537k49648
$$ 106287599 106203914 106106496 106001735 105890393 105771184 105631638 105463314 105272150 105060613 104810965
2822.7A04810965l10731l96991n29265p09879r17602j130784j352667j598895j821893
$$ 104810965 104500234 104103243 103573978 102864099 101946497 100815713 99463046 97864151 96042258
2841.1I6042258j925058j905334j864397j805455j559603r96935k57647L59696P01815
$$ 96042258 94117200 92211866 90347469 88542014 86982411 85985476 85727829 86087525 86789340
2859.5H6789340P73591O07341K98447K3865m9507J60241N80239R48632J005631P47210
$$ 86789340 87562931 88170272 88468719 88492584 88443077 88603318 89183557 90132189 91137820 91885030
2879.9I1885030L61896j9211l54480o17874q07709r36246j022726j086193j133114
$$ 91885030 92246926 92227715 91873235 91255361 90447652 89511406 88488680 87402487 86269373
2898.2H6269373j174891j212943j232970j230681j223689j241577j298636j364344
$$ 86269373 85094482 83881539 82648569 81417888 80194199 78952622 77653986 76289642
2914.5G6289642j379490j297140j088005p19196j95021M08894R66406J364184J612192
$$ 76289642 74910152 73613012 72525007 71805811 71610790 72019684 72986090 74350274 75962466
2932.9G5962466J760882J786554J623762J215654N83256j34230p42906j109577j192790
$$ 75962466 77723348 79509902 81133664 82349318 82932574 82798344 82055438 80945861 79753071
2951.2G9753071j000065n67400J6886O21593J193643J752668K289981K733219K933210
$$ 79753071 78753006 78185606 78202492 78824085 80017728 81770396 84060377 86793596 89726806
2969.6H9726806K812051K482272K101957J738155J402128J122511R09245P34055N86438
$$ 89726806 92538857 95021129 97123086 98861241 100263369 101385880 102295125 103029180 103615618
2987.9A03615618M59802L55291K84350K24483J66738J27232R5678P1037N9688M8422
$$ 103615618 104075420 104430711 104715061 104939544 105106282 105233514 105329192 105400229 105459917 105508339
3008.3A05508339M9854Q1515J22356J48130J47593J23143R3210P7200P2968N8472L6681
$$ 105508339 105558193 105639708 105762064 105910194 106057787 106180930 106274140 106351340 106424308 106482780 106519461
3030.8A06519461K4998L1650M1294K4891L004O175K3794L0399J9145J5127K2543J8382
$$ 106519461 106544459 106576109 106617403 106642294 106645298 106651473 106675267 106705666 106724811 106739938 106762481 106780863
3055.3A06780863J3053K1446K1958M697j3625j0753J1265K3842J2898j6713l2210n388
$$ 106780863 106793916 106815362 106837320 106842017 106828392 106817639 106828904 106852746 106865644 106848931 106816721 106811333
3079.7A06811333K1708J4662R144R703L362J1778K1708J3351j490m696L552r78j7702
$$ 106811333 106833041 106847703 106856847 106866550 106869912 106881690 106903398 106916749 106915259 106910563 106914115 106913137 106895435
3106.2A06895435j8215K730L075k9325m1533j7750J9658M9459M4442Q607j4389m625
$$ 106895435 106877220 106879950 106883025 106853700 106812167 106794417 106814075 106863534 106907976 106916583 106902194 106897569
3130.7A06897569M148j0812k9004k0504J3686K9385J0776j1468l1960m3857j4079K8825
$$ 106897569 106901717 106890905 106861901 106841397 106855083 106884468 106895244 106883776 106851816 106807959 106793880 106822705
3155.2A06822705L2997J4258K02o270m101K599J729r573j4746n794n48p558j1039m101
$$ 106822705 106855702 106869960 106870162 106863892 106859791 106862390 106864119 106854546 106839800 106834006 106833458 106825900 106814861 106810760
3183.7A06810760L708O306O616L731j478L529J2302L851j1075j2660m744M947J2088
$$ 106810760 106814468 106820774 106827390 106831121 106829643 106833172 106845474 106849325 106838250 106825590 106820846 106825793 106837881
3210.3A06837881Q332n614j0634q94R751J2768N376j967R06n257j9884o676J8811J4997
$$ 106837881 106846213 106840599 106829965 106829071 106838822 106851590 106856966 106854999 106855905 106850648 106830764 106824088 106842899 106857896
3238.8A06857896l588r895j2541j3816K599J9979Q417q774M410J4782n9m530j276j7905
$$ 106857896 106854308 106844413 106831872 106818056 106820655 106840634 106849051 106840277 106844687 106859469 106859410 106854880 106853604 106835699
3267.4A06835699m0448k4366J8978L4571K4736J0299p15m17K229n281k3389k6488j0359
$$ 106835699 106795251 106770885 106789863 106824434 106849170 106859469 106858754 106858337 106860566 106855285 106831896 106805408 106795049
3293.9A06795049L123J9622K2757j2136m8291l2389K3889N5957L5739P15k837J0586
$$ 106795049 106798172 106817794 106840551 106828415 106780124 106747735 106771624 106827581 106863320 106864035 106861198 106871784
3318.4A06871784N018j1622j8454l469J8084J9133Q082n531k0313j8215L22J3375J7333
$$ 106871784 106876802 106865180 106846726 106843257 106861341 106880474 106888556 106883025 106862712 106844497 106844819 106858194 106875527
3344.9A06875527R489j4412r776K7395L2544Q643l720N329J1945r048k6083j1015K0027
$$ 106875527 106885016 106870604 106860828 106888223 106920767 106929410 106925690 106931019 106942964 106933916 106907833 106896818 106916845
3371.4A06916845L7014K8062R990K074J3006K2972J3017j0419l0875j2779L3867M0376
$$ 106916845 106953859 106981921 106991911 106993985 107006991 107029963 107042980 107032561 107001686 106988907 107022774 107063150
3395.9A07063150m482k8801J1897N7781M2415K753l159J2184K5594L1507K3496J8442
$$ 107063150 107058668 107029867 107041764 107099545 107141960 107144713 107141554 107153738 107179332 107210839 107234335 107252777
3420.3A07252777K1278J4616j050r226m268m911j1087J1194N7924P2908M6158J8465
$$ 107252777 107274055 107288671 107287621 107278395 107274127 107269216 107258129 107269323 107327247 107400155 107446313 107464778
3444.8A07464778O617O461J2004K0719K5355J0920q070J418J4389m912k1100Q643N1248
$$ 107464778 107471395 107477856 107489860 107510579 107535934 107546854 107538784 107540202 107554591 107549679 107528579 107537222 107588470
3471.3A07588470N0986K3424O0L052L5596M3499J9872J2100J8096K1553K0599Q798
$$ 107588470 107639456 107662880 107662940 107665992 107701588 107745087 107764959 107777059 107795155 107816708 107837307 107846105
3495.8A07846105O187K1756L4439L4416K3878J5700M410j1873L6L0505L9804L2998
$$ 107846105 107852292 107874048 107908487 107942903 107966781 107982481 107986891 107975018 107975054 108005559 108045363 108078361
3520.3A08078361K0217P034J5616K9969J5247r894r191J4877K8348J1802K873K6107
$$ 108078361 108098578 108105612 108121228 108151197 108166444 108156550 108147359 108162236 108190584 108202386 108205259 108231366
3544.7A08231366L9529K6906K7716K9934J621j5164L338K5583N3966R1684O6089l1304
$$ 108231366 108270895 108297801 108325517 108355451 108357072 108341908 108345246 108370829 108424795 108516479 108582568 108551264
3569.2A08551264n9831j4413J0920O223l94k909K0481P6067Q0323j0884m0555J4425
$$ 108551264 108491433 108477020 108487940 108494163 108493769 108490860 108511341 108587408 108667731 108656847 108616292 108630717
3593.7A08630717J8680k1625j5986o43k635M2248R5594O1464R859j848Q190L3641j0419
$$ 108630717 108649397 108627772 108611786 108611143 108608508 108650756 108746350 108807814 108817673 108815825 108824015 108857656 108847237
3620.2A08847237p3612l1054P3397J31059K3389q4961p6210l8422n328P164J0121N9426
$$ 108847237 108773625 108742571 108815968 108947027 108970416 108885455 108809245 108770823 108765495 108772659 108782780 108842206
3644.7A08842206J51718J46687l2401j28603o5935l3510o5970l9268J5319N1367J08981
$$ 108842206 108993924 109140611 109108210 108979607 108913672 108880162 108814192 108774924 108790243 108841610 108950591
3667.1A08950591J33658L6847J2255N1534p7808j51121q6523k2792L9470R8324P7974
$$ 108950591 109084249 109121096 109133351 109184885 109107077 108955956 108869433 108846641 108886111 108984435 109062409
3689.6A09062409l0267r2256p0071r954M0877L1948k6775k2685N9152J19435N4860
$$ 109062409 109032142 108939886 108869815 108859861 108900738 108932686 108905911 108883226 108942378 109061813 109116673
3712A09116673o6649p8810j4805M1329M7279K4116Q22p414M1282J00195O9177m3881
$$ 109116673 109050024 108971214 108956409 108997738 109045017 109069133 109069955 109062541 109103823 109204018 109273195 109229314
3736.5A09229314j06907l2675J18196J42813n472k169L4356r9922j49643n8269n13
$$ 109229314 109122407 109089732 109207928 109350741 109345269 109343100 109377456 109277534 109127891 109069622 109069109
3758.9A09069109m0126n1927L743K9683J4067k6119m9019j8537J9967K2853O294J1850
$$ 109069109 109028983 108977056 108980799 109010482 109024549 108998430 108949411 108930874 108950841 108973694 108979988 108991838
3783.4A08991838O103k2006k8884r90N6195R7061Q0490O8676L8636m6396n0485n5147
$$ 108991838 108997941 108975935 108947051 108946061 109002256 109099317 109179807 109248483 109287119 109240723 109190238 109135091
3807.8A09135091r4175l3414Q3696J14346N0783L2842l0589j00934m0245J6892K6059
$$ 109135091 109040916 109007502 109091198 109205544 109256327 109289169 109258580 109157646 109117401 109134293 109160352
3830.3A09160352L9243M6385O0642M3106l4655p2801p5829n9807J7011J40846K05374
$$ 109160352 109199595 109245980 109306622 109349728 109315073 109242272 109166443 109106636 109123647 109264493 109469867
3852.7A09469867J9681j64604j28055k4187N1224M1008J5223L9196N972o4694p4697
$$ 109469867 109489548 109324944 109196889 109172702 109223926 109264934 109280157 109319353 109325325 109260631 109185934
3875.2A09185934k5415M4322K3794k5332j3101k5714j2207J6642l1436l5846N1761
$$ 109185934 109160519 109204841 109228635 109203303 109190202 109164488 109152281 109168923 109137487 109101641 109153402
3897.6A09153402J06132P2050p474r2018j06847m6170O151K6941L4654J6177q702q977
$$ 109153402 109259534 109331584 109324110 109232092 109125245 109079075 109085226 109112167 109146821 109162998 109154296 109145319
3922.1A09145319l218j0085r215K467k110j6021j5009L171K2638J3983o377l446J562
$$ 109145319 109142101 109132016 109122801 109125268 109123158 109107137 109092128 109095299 109117937 109131920 109125543 109122097 109123659
3948.6A09123659r036j8477q655M327l135j3351k969J6320J5926k753j6511j3292j442
$$ 109123659 109114623 109096146 109087491 109091818 109088683 109075332 109072363 109088683 109104609 109101856 109085345 109072053 109070611
3975.1A09070611N341Q344O485k336m351L683O724p99j2458j7488q618
$$ 109070611 109075952 109084296 109090781 109088445 109084094 109087777 109094501 109093702 109081244 109063756 109055138
3997.5A09055138
$$ 109055138
##END=$$ End of the data block
