##TITLE=$$ Begin of the data block
##JCAMP-DX=5.00 $$ ACD/SpecManager v 10.08
##SPECTROMETER/DATA SYSTEM=Alpha
##DATE=29 Dec 2014 15:06:02
##DATA TYPE=INFRARED SPECTRUM
##DATA CLASS=XYDATA
##ORIGIN=
##OWNER=
##NPOINTS=1765
##FIRSTX=399.76428223
##LASTX=3997.64306641
##MAXX=3997.64306641
##MINX=399.76428223
##MAXY=0.82838678
##MINY=0.22726214
##XFACTOR=1.0000000000
##YFACTOR=1.000000000000000e-9
##FIRSTY=0.53098017
##DELTAX=2.03961372
##XUNITS=1/CM
##YUNITS=ARBITRARY UNITS
##XYDATA=(X++(Y..Y))
399.8 530980170 526337385 520843089 515804768 514098346 516380131 520498931 523499131 524050236 523079336
418.1 523079336 522299409 521662176 519521475 515325844 510816038 507715702 505615115 503123224 500316739
436.5 500316739 499387801 502049565 507442296 512818515 516530156 519261718 522097290 524783492 526058614
454.8 526058614 525272667 522998333 520948112 519461334 517284453 513451338 508830607 505191267 502651572
473.2 502651572 500165462 497379750 494891703 493693858 493929178 494447947 494210869 493419439 492786258
491.5 492786258 492294759 491171569 488973379 486095458 483325869 480974495 478508353 475291282 471329421
509.9 471329421 467122436 463100642 459058315 454509199 449858814 446158230 443984687 443119168 442863464
528.3 442863464 442783892 443339318 445547521 449900746 455775857 461864859 467040986 470833689 473137558
546.6 473137558 473864913 473107666 471152574 468509793 465553075 461953700 457257688 451408356 444743335
565 444743335 437717766 430898786 425160617 421400189 420263767 422031373 426603824 433273882 440785944
583.3 440785944 448124141 454804033 460433930 464478970 466502190 466954470 466829419 466755241 466787040
601.7 466787040 466619045 466265321 466249526 467119753 468812555 470758349 472798079 475367218 478869557
620 478869557 483239114 487812877 491766125 494987816 497975916 500986099 503650725 505581439 506911039
638.4 506911039 508081377 509476304 511051297 512351871 513212800 514021754 515236914 516838431 518271744
656.8 518271744 519203305 519864917 520713747 521882355 523388326 525019884 526073158 527272999 529324412
675.1 529324412 531767190 533692896 534884691 535862446 537143350 538603306 539443672 539090753 537872136
693.5 537872136 536395848 534700811 532222152 528629422 524739981 521962643 520984948 521471560 522835314
711.8 522835314 525067329 528672576 533912838 540277123 546628714 552421629 558199108 564472854
728.1 564472854 570756733 575868905 579300582 581810474 584402442 587012410 588355899 587461948 584862351
746.5 584862351 581773400 578511417 574368298 568896830 562816381 557470977 553721488 551433325
762.8 551433325 550069451 549977422 552425504 558105588 566191673 575127721 583955944 592767537 601886630
781.2 601886630 610747993 618031859 623060763 626847923 631040692 636101544 641024113 644885182
797.5 644885182 648217380 652311027 657374859 661850929 664231062 664987564 665839195 667668700 669602513
815.8 669602513 670017779 668640792 666955292 666100621 665118277 662058055 656519771 650142372 644625604
834.2 644625604 639890969 634629071 628277719 621903718 616958797 613505065 610058427 605258465
850.5 605258465 599370897 593638718 588634431 584201932 581253171 582248807 588845193 600277841
866.8 600277841 614194453 627861738 639421999 648734808 656171620 660913587 661421239 657571197
883.2 657571197 651446164 645317733 639540613 633061111 625430346 617819428 611677527 606815696
899.5 606815696 601574659 594610810 586184800 577448845 568702161 558989763 547496080 534976125
915.8 534976125 523455024 514604867 508602023 504526913 501752675 500558019 501306236 503609061
932.1 503609061 506539106 509585798 513297439 518497348 524594843 529028893 529055595 524049938 515260458
950.5 515260458 503742039 489666611 473282635 455553532 437568039 419625193 401230603
964.7 401230603 381900012 361864060 341921568 322687298 304291040 286844820 270880401
979 270880401 257220507 246460378 238598436 233191982 229705572 227789029 227262139 227888063 229206637
997.4 229206637 230659366 231962174 233152658 234199345 234842151 234868839 234422907 234081522 234459847
1015.7 234459847 235712349 237552255 239758119 242435694 245789140 249702588 253668547 257243246
1032 257243246 260229081 262529284 264101624 264991581 265336096 265468836 265915871 267200917 269693196
1050.4 269693196 273525983 278646111 284996599 292695582 301822603 312026024 322210312 330245703
1066.7 330245703 333195418 329145640 319532663 308661878 300431341 296223611 295565188 297363281
1083 297363281 300586015 304636955 309507370 315401763 321960688 328187764 333141714 336475611 338419288
1101.4 338419288 339527994 340484738 342009127 344650298 348495930 353114605 357672811 361335278
1117.7 361335278 363873512 365749151 367635638 370038033 373212725 377234995 381789625 385909349
1134 385909349 388120383 387117207 382639557 375638843 367570192 359518379 352013588 345377266 339994013
1152.4 339994013 336272001 334326386 333891213 334683955 336829036 340812325 347070605 355606616 365951061
1170.7 365951061 377571434 390206873 403699934 417748034 431816906 445317388 457946599
1185 457946599 469610959 480054796 488726109 495173424 499553323 502597451 505100787 507422924
1201.3 507422924 509534419 511567712 514102221 517776191 522661924 528165519 533617377 538702786
1217.7 538702786 543241441 546872377 549088538 549608827 548783660 547353923 545796990 544150412 542275727
1236 542275727 540231526 538485229 537603378 537722111 538560629 539873779 541662872 543961704 546483994
1254.4 546483994 548643172 550062954 550934255 551820517 553224862 555241406 557575107 559864461 561890602
1272.7 561890602 563520849 564528465 564655304 563981175 563039660 562345445 561914980 561320782 560186863
1291.1 560186863 558553934 556697786 554755211 552615166 550174952 547580600 545097351 542904198
1307.4 542904198 541023493 539313078 537691414 536295414 535164595 533975780 532137215 529103398
1323.7 529103398 524720550 519351661 513582289 507876635 502631843 498338759 495407999 493900090
1340 493900090 493461996 493564039 493870378 494228423 494487464 494509161 494121194 493237138 492122471 491148680
1360.4 491148680 490348250 489580572 488836408 488252342 488182843 488913894 490212828 491377473 492220730
1378.8 492220730 493145645 494740456 497585148 501829207 506334782 509869039 512524307 514261961
1395.1 514261961 514650583 513775110 512280464 510707557 509037793 507137299 504900575 502412379 500177622
1413.5 500177622 498625934 497560591 496539414 495761603 495639175 496209025 497316301 498693138 500047088
1431.8 500047088 501479566 503533185 506029665 508038580 509662032 510994494 511982858 512482584 512171984
1450.2 512171984 511083841 509590149 507579625 505376875 504513741 504988194 506771207 509952188 514451921
1468.5 514451921 521119595 531034231 541465104 550238132 558342040 566456616 574379385 581400633
1484.9 581400633 587960124 594789505 601413131 606711626 611404777 616276503 620689452 624562502
1501.2 624562502 628298342 632472038 636846602 639600992 641837656 644543946 647446513 650120437
1517.5 650120437 652457952 655014098 657491386 659503639 661189079 662564099 664176404 666182756
1533.8 666182756 667998433 669627905 671143711 671742678 672027349 672488987 672865868 672894001 672702670
1552.2 672702670 672832489 673352122 673137963 671011865 669210494 667993426 667004287 665803850 663791358
1570.5 663791358 661755800 659972608 657780409 655561447 653514087 651206791 648807347 646624625
1586.8 646624625 644630671 642452240 639932632 637256384 634727418 632409394 629941463 627044082
1603.2 627044082 623898983 620813191 617730737 614563048 611352801 607609034 603103876 599614263
1619.5 599614263 596932888 593675971 590143740 586839736 583931625 581967294 580688477 579117298
1635.8 579117298 577514112 576778829 576931298 577771842 579155385 580773532 582314491 584868789 588822722
1654.1 588822722 591625631 594077468 597310543 601547539 606101990 610185266 614633560 619704187
1670.5 619704187 624304175 629207432 634561539 639239728 643607855 648748517 655282199 660643995
1686.8 660643995 664760768 668852448 672681749 676972568 681629658 685487390 688672960 691013217
1703.1 691013217 693163872 695458770 697440088 699218690 701087236 703235388 705644965 707680225
1719.4 707680225 709228933 710732520 712471664 714525044 716825426 719008625 720954359 722574055
1735.7 722574055 724175751 726270556 728512466 730552495 732725084 735364437 738477111 741544962
1752 741544962 744125783 746590912 749227345 751958609 754693210 756911755 758672774 760479271 762491405
1770.4 762491405 764482737 765951753 766958356 767973959 769252717 770691156 771984875 772982538
1786.7 772982538 773899078 775007129 776304662 777429044 778283656 779021502 779832900 780852437 781961143
1805.1 781961143 782914400 783603668 784219503 785022140 786027968 786933362 787516832 788010478 788763702
1823.4 788763702 789770126 790683329 791158080 791255116 791554272 792259574 793050230 793564320 793807805 794020236
1843.8 794020236 794435859 794939101 795200825 795153737 795112789 795441568 796046555 796500862 796606183 796657860
1864.2 796657860 797020078 797610998 797993481 798019648 797933817 798054695 798578262 799278855 799716413 799828589
1884.6 799828589 800044775 800642490 801344156 801717639 801686406 801581979 801818490 802378178 802802026 802809298
1905 802809298 802633762 802696586 803094625 803489327 803584814 803442240 803451002 803842545 804306865 804402292 804181457
1927.5 804181457 804082215 804390669 804890573 805114210 804960191 804807246 805019617 805491269 805798233 805726767
1947.9 805726767 805530488 805670083 806231260 806786239 806910098 806718767 806712270 807165563 807768285 807987750
1968.3 807987750 807776630 807623386 807912529 808454096 808728755 808547914 808315754 808485925 808977187 809308350
1988.7 809308350 809186578 808835745 808770716 809146643 809503615 809369266 808913231 808663845 808809102 809016347
2009 809016347 808814883 808195055 807632923 807450891 807404220 806972504 805981517 804989874 804771245 805123806
2029.4 805123806 805158973 804568350 803786576 803360581 803362787 803342998 802910507 802236557 801812530 801862597
2049.8 801862597 802073002 801974952 801549435 801266789 801487923 801979303 802185118 801932216 801655293 801802993
2070.2 801802993 802287698 802598119 802431464 802075505 802055001 802493513 802939296 802938700 802631319 802566350
2090.6 802566350 802976549 803509712 803679228 803459823 803342283 803710818 804342628 804672062 804500818 804249287
2111 804249287 804427922 804977179 805360436 805242598 804900348 804879069 805275500 805628598 805541575 805175364
2131.4 805175364 805038333 805362284 805796504 805848598 805508256 805258214 805475116 805947900 806152344 805901051
2151.8 805901051 805624485 805836797 806454360 806946337 807005405 806935191 807238996 807942450 808649600 809026957
2172.2 809026957 809159577 809494734 810268819 811175108 811716080 811831295 812013924 812680542 813602328 814187050
2192.6 814187050 814262569 814293265 814767122 815570951 816173971 816309154 816307485 816698015 817525446 818293869
2213 818293869 818588197 818568170 818766475 819416225 820164025 820535541 820505321 820555389 821053386 821742296
2233.4 821742296 822100937 822004259 821890950 822213650 822851062 823282063 823238552 823031366 823194087 823793828
2253.8 823793828 824324965 824376643 824150264 824186623 824668884 825227261 825435460 825329602 825344741 825765848
2274.2 825765848 826369941 826693237 826609135 826500356 826781154 827338874 827679217 827548265 827261209 827329516
2294.6 827329516 827795684 828198850 828166842 827846467 827688396 827913761 828260660 828298628 827996194 827777386
2315 827777386 827955008 828315675 828386784 828061640 827721775 827688754 827898502 827987254 827649593 827080250
2335.4 827080250 826790392 826914668 826996684 826643109 826144934 826010466 826164365 826265991 826043725 825504005
2355.8 825504005 825060725 825037956 825177312 825044811 824633896 824254453 824165165 824244320 824165642 823883832
2376.2 823883832 823629320 823617160 823803365 823900580 823684573 823260188 822959125 822919786 822915137 822685659
2396.6 822685659 822259665 821874082 821665168 821533859 821265042 820759475 820183158 819759846 819484890 819146156
2417 819146156 818597555 817939162 817365050 816930532 816495895 815895021 815172851 814511597 813969374 813437939
2437.4 813437939 812791646 812052965 811362028 810793638 810280621 809694707 808973789 808187485 807512581 806998074
2457.8 806998074 806488097 805871010 805195630 804587901 804086268 803589404 803022861 802406609 801785171 801216245
2478.1 801216245 800719619 800232053 799689233 799143434 798708797 798378348 798040211 797617972 797133327 796678782
2498.5 796678782 796331763 796066701 795779288 795404553 795000255 794660866 794367075 794034243 793602407 793081701
2518.9 793081701 792560816 792120278 791744232 791300893 790699244 790014505 789370835 788787127 788187623 787492156
2539.3 787492156 786689699 785908401 785269260 784670472 783958077 783167601 782440543 781847715 781320214 780707836
2559.7 780707836 779942453 779136062 778461397 777931929 777377188 776652098 775828958 775129318 774609387 774088979
2580.1 774088979 773406267 772590280 771872401 771416366 771091223 770661175 770062268 769485950 769117057 768853843
2600.5 768853843 768466115 767843723 767093718 766440094 765916586 765320241 764480472 763473332 762544215
2618.9 762544215 761766791 760928214 759807050 758447170 757130563 756058574 755091012 753931224 752517343
2637.2 752517343 751091182 749894857 748864532 747719526 746314049 744856834 743661463 742692053
2653.5 742692053 741623819 740297556 738897383 737697184 736741900 735807955 734673083 733363628 732146263
2671.9 732146263 731233358 730468810 729535937 728378594 727246046 726376593 725665271 724800646 723668694
2690.3 723668694 722441673 721375287 720503628 719564080 718332827 716916263 715634406 714601576 713575840
2708.6 713575840 712320387 710922539 709644318 708631098 707749426 706704557 705460966 704295397
2724.9 704295397 703434229 702779949 702001035 700943351 699846923 699045241 698500991 697864830 696929514
2743.3 696929514 695867062 695032716 694523036 694031000 693251431 692287683 691499174 691019595 690609336
2761.6 690609336 689989924 689158380 688374341 687819421 687337220 686635256 685616434 684477508 683490872
2780 683490872 682664931 681731761 680509806 679147542 677896142 676753283 675463557 673835993 671997011
2798.4 671997011 670232415 668636858 667033494 665185094 663052201 660840333 658768713 656794906
2814.7 656794906 654659390 652229965 649680078 647253573 644921184 642425299 639652133 636737227
2831 636737227 633861482 631075025 628204703 624966681 621317267 617519319 613730848 609827220 605723739
2849.3 605723739 601659000 598013997 594946980 592262089 589500546 586307943 582655668 578631818
2865.7 578631818 574201941 569257438 563854396 558227122 552653611 547365844 542486846 538119674
2882 538119674 534401238 531457245 529350221 527947903 526949525 526138008 525457561 524884045 524298847
2900.3 524298847 523456872 522191644 520601571 518820584 516733527 514087558 510753095 506872416
2916.6 506872416 502826750 498956144 495400131 492263317 489783168 488263845 487881809 488709033 490776479
2935 490776479 493991971 498178899 503161490 508727491 514577985 520451307 526335299 532360315 538475394
2953.4 538475394 544495463 550358951 556076407 561597288 566814125 571588278 575847924 579693377
2969.7 579693377 583403289 587186098 590978801 594686627 598267198 601613939 604698896 607556880
2986 607556880 610092998 612250745 614073932 615560710 616784573 617739618 618281960 618459105 618429363
3004.4 618429363 618249536 617869020 617175877 616094530 614685297 613095701 611369669 609425962 607275963
3022.7 607275963 605033159 602754235 600461841 598145366 595731020 593105912 590332508 587672830
3039 587672830 585109651 582375407 579410195 576379836 573474407 570670128 567785144 564796388 561758161
3057.4 561758161 558724403 555792749 552944660 550076962 547122359 544114351 541179061 538342774
3073.7 538342774 535555243 532776713 529907167 526940823 523978829 521002948 518011928 515086651
3090 515086651 512183428 509248257 506358683 503584385 500824928 497958064 495109111 492420077 489776105
3108.4 489776105 487028360 484330535 481865734 479447186 476830691 473953873 470942289 468082964
3124.7 468082964 465511799 463074058 460554987 457946986 455440611 453136444 450857460 448351264
3141 448351264 445714474 443227798 440926790 438762844 436661452 434417427 431977302 429553181 427269667
3159.4 427269667 425066322 422912061 420783490 418672055 416634470 414642215 412631720 410657167
3175.7 410657167 408772945 406947851 405087590 403157234 401253015 399441808 397685409 395912290
3192 395912290 394107729 392341256 390674084 389078379 387486786 385872304 384255975 382668227 381120831
3210.3 381120831 379631937 378216803 376838952 375444651 374059647 372729391 371394038 370039642
3226.7 370039642 368759781 367627084 366590858 365396738 363981336 362614334 361427277 360378057
3243 360378057 359411120 358406723 357277453 356121063 355089456 354164749 353216529 352240324 351314992
3261.3 351314992 350436658 349600703 348900527 348326921 347627997 346712589 345733792 344794035 343939900 343136191
3281.7 343136191 342343509 341606349 340948075 340383589 339833230 339120865 338217914 337230235 336340249 335696369
3302.1 335696369 335206747 334594131 333667248 332517177 331362218 330301851 329306394 328374475 327532023
3320.5 327532023 326734185 325887561 324905127 323828220 322791785 321833223 320943832 320119143 319205821
3338.8 319205821 318126321 317029625 315940231 314905196 314050317 313151926 311981320 310714990 309606373
3357.2 309606373 308679968 307737440 306758612 305978507 305291384 304333836 303056180 301803142 300835490
3375.5 300835490 299993217 299108773 298227608 297427058 296754271 296299905 296063781 295708209 294995010 294281632
3395.9 294281632 293992043 293883055 293353260 292439938 291764379 291473716 291269153 291018218 290679753 290282339
3416.3 290282339 289993078 289800733 289584935 289449960 289543867 289807409 290008694 290185362 290493548 290701836
3436.7 290701836 290644348 290570498 290702879 291033298 291437268 291796505 292211056 292752326 293344051 294033319
3457.1 294033319 294857979 295605898 296290785 297239333 298338234 299098343 299431056 299771518 300452888
3475.5 300452888 301480055 302531153 303317398 304084241 305006802 305815637 306528270 307466775 308609515
3493.8 308609515 309763372 310799390 311778784 312827736 313772529 314512879 315273911 316277862 317559361
3512.2 317559361 318818122 319813579 320767611 321939290 323332012 324652135 325676054 326602608 327678144
3530.6 327678144 328965455 330453455 331898510 333139420 334522694 336195230 337838829 339217603
3546.9 339217603 340484560 341827929 343288809 344912291 346750408 348801970 350911945 352839917
3563.2 352839917 354712814 357086718 359810114 362273246 364567578 367061257 369811207 372784555
3579.5 372784555 375982583 379171848 382159561 385213703 388587266 391895682 395064294 398412883
3595.8 398412883 402039230 405772001 409524679 413204044 416714489 420368791 424319416 428323150
3612.1 428323150 432314992 436115950 439908504 444153786 448336273 452109426 455640823 459493369
3628.5 459493369 463952422 468141437 472078681 475970626 479810238 483751327 487803727 491731852
3644.8 491731852 495477229 499494344 503854513 507798016 511351049 515195608 519150794 522684336
3661.1 522684336 526026309 529462576 532706618 535820961 539354682 542640448 545447290 548460841
3677.4 548460841 551477194 554408789 557448566 560521781 563482642 566055596 568298161 570608556
3693.7 570608556 573026061 575353801 577379107 579244256 581368208 583649695 585703254 587358415
3710 587358415 588973165 590971172 592991948 594806671 596448183 597943068 599327683 600824237 602605283
3728.4 602605283 604417205 606059134 607412815 608787358 610496938 611989677 612675846 613239169 614687383
3746.7 614687383 615933359 616651177 617850959 619417429 620711684 621765137 622963130 624213576
3763.1 624213576 625336587 626353085 627222538 628198326 629396379 630620241 631776035 632796228 633727729
3781.4 633727729 634524226 635229647 636091113 637142122 638221264 639165521 640065253 641110539 641914904
3799.8 641914904 642504096 643436253 644169509 644703269 645633698 646722972 647484303 648082495 648970723
3818.1 648970723 649644017 650239706 651120842 651896536 652558088 653196454 653998554 655015469 655682862
3836.5 655682862 655910850 656296015 656898379 657647550 658543587 659454763 659970582 659701765 659828186 660831511
3856.9 660831511 661739886 662380576 662826955 663339674 663951278 664322197 664721429 665290713 665926516 666601479
3877.3 666601479 667057693 667514563 668065012 668478251 668976068 669426620 669702888 670181453 670840144 671326339
3897.7 671326339 671546817 671653688 671797216 672157943 672677577 673173904 673666060 674096644 674317896 674444675
3918.1 674444675 674656212 674888432 675138235 675522029 675974548 676286697 676496565 676804900 677144170 677397728
3938.5 677397728 677548647 677666128 677905917 678241432 678544521 678811610 679098606 679396451 679668367 679908931
3958.9 679908931 680085480 680222690 680393279 680609107 680889189 681252062 681578279 681772053 681949556 682171464
3979.3 682171464 682404041 682646632 682855725 683007956 683202207 683456063 683652222 683803678 683965921
3997.6 683965921
##END=$$ End of the data block
