##TITLE=$$ Begin of the data block
##JCAMP-DX=5.00 $$ ACD/SpecManager v 10.08
##SPECTROMETER/DATA SYSTEM=Alpha
##DATE=29 Dec 2014 15:06:02
##DATA TYPE=INFRARED SPECTRUM
##DATA CLASS=XYDATA
##ORIGIN=
##OWNER=
##NPOINTS=1765
##FIRSTX=399.76428223
##LASTX=3997.64306641
##MAXX=3997.64306641
##MINX=399.76428223
##MAXY=0.82953244
##MINY=0.22747475
##XFACTOR=1.0000000000
##YFACTOR=1.000000000000000e-9
##FIRSTY=0.53147125
##DELTAX=2.03961372
##XUNITS=1/CM
##YUNITS=ARBITRARY UNITS
##XYDATA=(X++(Y..Y))
399.8E31471252m060566m846156m838466k004802J777350L610135K632439P78794k62857
418.1E24257123p07864j137197k833903m642427m023552k199709j583100k621770l271937
436.5E01235664j170993K740324N827784N940974L823757K435565K611578K710640
452.8E26155293J331389r21249k548099k368033j768231k215267l570556m417062l769755
471.2E05908430k679170k419531k792567k607256j341045J0639M27396j54257p68930
489.5D93583709o19471m46975j146734k188683k735197k763659k459168k356381l072440
507.9D75795001l952354m170299l909618l903120m475981m842401m018813k191395
524.2D44331020o87003k40713j8418P43925K204448M170716N751252O092728N222499
$$ plain form
399.8 531471252 527410686 522564530 517726064 515721262 517498612 521108747 523741186 524519980 524257123
418.1 524257123 523549259 522412062 519578159 514935732 510912180 508712471 507129371 504507601 501235664
436.5 501235664 500064671 502804995 508632779 514573753 518397510 520833075 523444653 526155293
452.8 526155293 527486682 526565433 524017334 521649301 519881070 517665803 514095247 509678185 505908430
471.2 505908430 503229260 500809729 498017162 495409906 494068861 494079500 494506896 494352639 493583709
489.5 493583709 492964238 492517263 491370529 489181846 486446649 483682990 481223822 478867441 475795001
507.9 475795001 471842647 467672348 463762730 459859610 455383629 450541228 446522415 444331020
524.2 444331020 443644017 443403304 443384886 444128811 446333259 450503975 456255227 462347955 467570454
542.5D67570454L786832K301246P41541q35955k018124k632618k904474l351003m379124
560.9D58278775n761534o856620p323533o988079n752146l769785j130134J868874
577.2D22565818M600197O577074P480026P423162O837636N767256M042775J907647
593.5D67201591K94506k48134k0683J15276k56718m48107L5703R48161J735806K005965
613.9D71363366K035409K496660L491610M406661M597693M040122L358275K995223
630.2D98785019K918541K677143K006888J279116J046181J324773J618087J443684
646.6E13099432Q99255O74069J108706J649499J558960R79423N98431P98285J249730
664.9E22615790J738310J760543R94980J164198J938820K273082J853407J213670J046180
$$ plain form
542.5 467570454 471357286 473658532 474400073 473564118 471545994 468913376 466008902 462657899 458278775
560.9 458278775 452517241 445660621 438337088 431349009 425596863 421827078 420696944 422565818
577.2 422565818 427166015 433743089 441223115 448646277 455483913 461251169 465293944 467201591
593.5 467201591 467496097 467247963 467227280 467342556 467085838 466637731 466673434 467621595 469357401 471363366
613.9 471363366 473398775 475895435 479387045 483793706 488391399 492431521 495789796 498785019
630.2 498785019 501703560 504380703 506387591 507666707 508712888 510037661 511655748 513099432
646.6 513099432 513998687 514672756 515781462 517430961 518989921 519969344 520567775 521366060 522615790
664.9 522615790 524354100 526114643 527109623 528273821 530212641 532485723 534339130 535552800 536598980
683.3E36598980J347065J462579P93696m15802j280964j452267j634121k491772l613234
701.6E29314160l860592k777875j066923M01795J367628K329410L751277N295694O325603
720E41080177O383180N892098N787671O144583O145239N084336L522038K656818K660990
738.3E85357130K546727J257062q97646k586424l126085l279567m096210n433023o165504
756.7E63576460n457401l777624k326071j404345p9512K449274N657732Q094549R000302
775.1E75733364Q971095Q956253R176910Q869648P234514M901886L659427M102171
791.4F31605268M998981M944265L948748L385127M113853N099893M520178K364575
807.7F64980888O36459P55667J879335K045035M84944j378119j738608r23693j046539
$$ plain form
683.3 536598980 537946045 539408624 540202320 539786518 538505554 537053287 535419166 532927394 529314160
701.6 529314160 525453568 522675693 521608770 522010565 523378193 525707603 529458880 534754574 541080177
720 541080177 547463357 553355455 559143126 565287709 571432948 576517284 580039322 582696140 585357130
738.3 585357130 587903857 589160919 588263273 585676849 582550764 579271197 575174987 569741964 563576460
756.7 563576460 558119059 554341435 552015364 550611019 550531507 552980781 558638513 566733062 575733364
775.1 575733364 584704459 593660712 602837622 611707270 618941784 623843670 627503097 631605268
791.4 631605268 636604249 641548514 645497262 648882389 652996242 658096135 662616313 664980888
807.7 664980888 665617347 666373014 668252349 670297384 670782328 669404209 667665601 666741908 665695369
826F65695369l092766n511403o349623n578220m831493n312919o335438o311118m873336
844.4F17499053l437042l522575m863560n879462n695283m990459m436969k935350
860.7E81738353R92238O605506J1466265J3880312J3594449J1525869R272039P383526
877F56458557M714906N07533l826677o127954o210148n899966o563962p599115p518887
895.4F17934287o106854m867315n288363p036566q435965q720160q796274r789765
911.7E58893025j1500955j2436151j1390388q766890o011009m095197k768337j181484
928E00742614P97272K346635K875864K950609L687203N228341O083071M380762k384
946.4E29089987n018413q808255j1547089j4110386j6408622j7747194j7998546j7941922
$$ plain form
826 665695369 662602603 657091200 650741577 645163357 640331864 635018945 628683507 622372389 617499053
844.4 617499053 614062011 610539436 605675876 599796414 594101131 589110672 584673703 581738353
860.7 581738353 582730591 589336097 600802362 614682674 628277123 639802992 649075031 656458557
877 656458557 661173463 661680996 657854319 651726365 645516217 639616251 633052289 625453174 617934287
895.4 617934287 611827433 606960118 601671755 594635189 586199224 577479064 568682790 558893025
911.7 558893025 547392070 534955919 523565531 514798641 508787632 504692435 501924098 500742614
928 500742614 501539886 503886521 506762385 509712994 513400197 518628538 524711609 529092371 529089987
946.4 529089987 524071574 515263319 503716230 489605844 473197222 455450028 437451482 419509560
962.7D19509560j8404335j9344240k0002395j9882560j9202620j8372178j7404735
977B86896497j5920639j3622314j0747716p869482n413994l492489j889870m65244
993.3B27474749O41793J251459J396597J330793J257285J100227O55562J2338m27291
1011.6B34693512l19823L31267J189143J845389K250985K707243L350466L885865L993452
1030B53927499L629983K932786K196759J560748R65983M21494J53065M34428J267523
1048.4B67490268K455741L796548N119443O394654P746160R103149J0141701J0180950
1064.7C22428614Q052647K917528m092574r621590j0840297q176297m169077o58214
1081B95840740J764357L177375M053056M927844N933046O558389O227761M968077L334850
$$ plain form
962.7 419509560 401105225 381760985 361758590 341876030 322673410 304301232 286896497
977 286896497 270975858 257353544 246605828 238736346 233322352 229829863 227939993 227474749
993.3 227474749 228116542 229368001 230764598 232095391 233352676 234452903 235108465 235120803 234693512
1011.6 234693512 234373689 234704956 235894099 237739488 239990473 242697716 246048182 249934047 253927499
1030 253927499 257557482 260490268 262687027 264247775 265213758 265635252 265788317 266222745 267490268
1048.4 267490268 269946009 273742557 278862000 285256654 293002814 302105963 312247664 322428614
1064.7 322428614 330481261 333398789 329306215 319684625 308844328 300668031 296498954 295840740
1081 295840740 297605097 300782472 304835528 309763372 315696418 322254807 328482568 333450645 336785495
1099.4C36785495J931936J108289R62346J511366K621680L866017M649222M546851
1115.7C57983202L624946K509474J888693J914769K385467L136784M003763M548938
1132C81996036M126548K221406j007229m490376o998807q046657q018136p485449o647051
1150.3C45650285n376726l693670j943290m52817P96140K164870L999531O275207Q527279
1168.7C55946809J0326892J1625618J2633502J3489396J4054984J4079004J3493657
1183D45649862J2596995J1668891J0484606Q679747O417781M341603L040433K533912
1199.3E05413830K330601K090633K022565K544999L676176M887164N536854N487323
1215.6E33990145N083680M513204L597498K189457N18620q41260j464843j539052j594245
$$ plain form
1099.4 336785495 338717431 339825720 340788066 342299432 344921112 348787129 353436351 357983202
1115.7 357983202 361608148 364117622 366006315 367921084 370306551 373443335 377447098 381996036
1132 381996036 386122584 388343990 387336761 382846385 375847578 367800921 359782785 352297336 345650285
1150.3 345650285 340273559 336579889 334636599 334183782 334979922 337144792 341144323 347419530 355946809
1168.7 355946809 366273701 377899319 390532821 404022217 418077201 432156205 445649862
1183 445649862 458246857 469915748 480400354 489080101 495497882 499839485 502879918 505413830
1199.3 505413830 507744431 509835064 511857629 514402628 518078804 522965968 528502822 533990145
1215.6 533990145 539073825 543587029 547184527 549373984 549892604 549051344 547586501 546047449 544453204
1234E44453204j857698k054155j754701q77321J44601Q66294J308799J751542K260446
1252.3E44241011K521634K198518J453757Q83102Q92163J388609J978099K301216K271355
1270.7E60129464K028286J646876J023353J46448o60062r47833p06851m37856n98609
1289E61623216j123965j600146j837552j970649k178013k449334k564430k434373k180219
1307.4E43284535j894593j701832j605153j413703j176715j211166j818717l016650
1323.7E29446006m378379n341470n736768n693615n247712m309743k939403j505226
1340D94293690m43965J02251K99573L40522K74986M4345l91334q91626j135051j003206
1360.4D91490185p98940p34061p30634n91964n6713P51107J311422J172691Q18521
$$ plain form
1234 544453204 542595506 540541351 538786650 537909329 538053930 538920224 540229023 541980565 544241011
1252.3 544241011 546762645 548961163 550414920 551298022 552190185 553578794 555556893 557858109 560129464
1270.7 560129464 562157750 563804626 564827979 564974427 564314365 563366532 562659681 562221825 561623216
1289 561623216 560499251 558899105 557061553 555090904 552912891 550463557 547899127 545464754 543284535
1307.4 543284535 541389942 539688110 538082957 536669254 535492539 534281373 532462656 529446006
1323.7 529446006 525067627 519726157 513989389 508295774 503048062 498738319 495798916 494293690
1340 494293690 493849725 493951976 494251549 494592071 494867057 494911402 494520068 493628442 492493391 491490185
1360.4 491490185 490691245 489957184 489226550 488634586 488577873 489328980 490640402 491813093 492631614
1378.8D92631614Q78155J585752K891481M289836M480064L474235K632141J742363
1395.1E14605641L72589r20534j532912j549066j602649j868069k241493k494275k206445
1413.5E00562787j474887r98885j049101q51571j49996N93991J153439J412988J359611
1431.8E00558376J410008K013981K464473K007008J624286J335859J018346N09023
1448.1E12941360l30388j070321j439690j994610k263367r01580M60744J786172L221572
1466.5E10409892M535734O666720R886563J0412276Q762836Q094549Q111418P914483
1482.8E74794471P027865O595969O855845O631196N308211M691601M861891M432559
1499.1F21199608L889441L696621M110277M364490K770543K240062K712488K898753
$$ plain form
1378.8 492631614 493509769 495095521 497987002 502276838 506756902 510231137 512863278 514605641
1395.1 514605641 514978230 514057696 512524784 510975718 509373069 507505000 505263507 502769232 500562787
1413.5 500562787 499087900 498089015 497039914 496188343 496038347 496632338 497785777 499198765 500558376
1431.8 500558376 501968384 503982365 506446838 508453846 510078132 511413991 512432337 512941360
1448.1 512941360 512610972 511540651 510100961 508106351 505842984 504941404 505402148 507188320 510409892
1466.5 510409892 514945626 521612346 531498909 541911185 550674021 558768570 566879988 574794471
1482.8 574794471 581822336 588418305 595274150 601905346 607213557 611905158 616767049 621199608
1499.1 621199608 625089049 628785670 632895947 637260437 640030980 642271042 644983530 647882283
1515.4F47882283K667010K326905K538622K508342K053201J683712J370311J612842
1531.8F64643228K014101J878261J724661J564920N59449K30908M22001L51429K9564
1550.1F73418522j45316J82807N49555k18034k215743j846611j184821r47476j200974
1568.5F66391909k048135k053320j762509k151192k223074k109051k360761k377093
1584.8F49306774k127468j992166k214909k548516k699792k532840k296507k454698
1601.1F30439878k895535l141582l095507l108502l189563l215611l711403m451394
1617.4F03630781l483951k699554l264546l530324l299296k895355j943409j271665
1633.7E81242681j580656j583278p03931J61827Q59975J413763J621783J561045K586127
$$ plain form
1515.4 647882283 650549293 652876198 655414820 657923162 659976363 661660075 663030386 664643228
1531.8 664643228 666657329 668535590 670260251 671825171 672384620 672615528 673037529 673388958 673418522
1550.1 673418522 673273206 673456013 674005568 673787534 671571791 669725180 668540359 667592883 666391909
1568.5 666391909 664343774 662290454 660527945 658376753 656153679 654044628 651683867 649306774
1584.8 649306774 647179306 645187140 642972231 640423715 637723923 635191083 632894576 630439878
1601.1 630439878 627544343 624402761 621307254 618198752 615009189 611793578 608082175 603630781
1617.4 603630781 600146830 597447276 594182730 590652406 587353110 584457755 582514346 581242681
1633.7 581242681 579662025 578078747 577374816 577536643 578396618 579810381 581432164 582993209 585579336
1652.1E85579336L937900K779305K442777L236294M265129M585564M110516M478037
1668.4F15414858N080402M613280M926443N346060M666328M389227N172491O534815
1684.7F56143904N320191M051268M056692L860832M327714M643798L821373L130793
1701.1F89356565K279521K125322K321363K018690J791418J881003K210259K469898
1717.4G06454039K006411J513601J488864J726210K058148K324641K212644J933932
1733.7G21718490J574159J607477K105415K211809K010525K181828K678633L132104
1750G39220440L072083K591670K476215K634049K704918K723754K248764J794278J815141
1768.4G61281312J997351J975775J477003J002729R94921J279771J440287J270413
$$ plain form
1652.1 585579336 589517236 592296541 594739318 597975612 602240741 606826305 610936821 615414858
1668.4 615414858 620495260 625108540 630034983 635381043 640047371 644436598 649609089 656143904
1684.7 656143904 661464095 665515363 669572055 673432887 677760601 682404399 686225772 689356565
1701.1 689356565 691636086 693761408 696082771 698101461 699892879 701773882 703984141 706454039
1717.4 706454039 708460450 709974051 711462915 713189125 715247273 717571914 719784558 721718490
1733.7 721718490 723292649 724900126 727005541 729217350 731227875 733409703 736088336 739220440
1750 739220440 742292523 744884193 747360408 749994457 752699375 755423129 757671893 759466171 761281312
1768.4 761281312 763278663 765254438 766731441 767734170 768729091 770008862 771449149 772719562
1784.7G72719562R70006R05633J111865J310170J156211Q97228P55549P91371R98795
1803G81616390J115203R66608O79732O02185Q00729J000106Q98421N86391N05924P62939
1823.4G89534628J012326R22620M78625Q7440K98024P12931P68482M73082K31922K39432
1843.8G94759512M45783N04136K53320m6790m1783L41058O29485M51624P8142L9995
1864.2G97414482L67462N81086L61562J5914q3506J41978N41330O78301M12583J25050
1884.6H00556242K37942O04332O92308L62396l4273r5844K58684N71609M07755j3888
1905H03547263j56820J09554M16219L74734O2585j69277q643L70980M59790J32978
1925.4H05139363j74940q6605K79784M55558J98245j37508r1791K78592N00441K90274
$$ plain form
1784.7 772719562 773689568 774595201 775707066 777017236 778173447 779070675 779826224 780617595 781616390
1803 781616390 782731593 783698201 784377933 784980118 785780847 786780953 787679374 788265765 788771689 789534628
1823.4 789534628 790546954 791469574 791948199 792035639 792333663 793046594 793815076 794288158 794520080 794759512
1843.8 794759512 795205295 795709431 795962751 795915961 795874178 796215236 796844721 797296345 797374487 797414482
1864.2 797414482 797781944 798363030 798724592 798740506 798657000 798798978 799340308 800018609 800431192 800556242
1884.6 800556242 800794184 801398516 802090824 802453220 802418947 802323103 802581787 803153396 803561151 803547263
1905 803547263 803390443 803499997 803916216 804290950 804353535 804184258 804175615 804546595 805006385 805139363
1925.4 805139363 804964423 804877818 805157602 805613160 805811405 805673897 805582106 805860698 806361139 806651413
1945.8H06651413j16467k23935J46270N72026N51343J09374j94490J2935M67836N82994
1966.2H08559299J87993k07901j15335L26693N51819K48015k20596k38002J86801M79579
1986.6H09758365L03328j35422l43382l8505L83199L55005r7156m26232k56062J35660
2007H09638798J86265k39611o34015n36263j47998l2425m51207j017928r82583j98304
2027.4H05584729L44276K2411n82456p70509m28319j5796l7372m41551o90400m47870
2047.8H02537143L9459K25782o8247m03881k80321K19464M96745K03967k67624k79606
2068.2H02422881J78814N18322L14117j65940l26633R715M22895M03345k4319k94983
2088.6H03458214l5763M03821M95434J53125j93954p1406M02748O33955K95818j89185
$$ plain form
1945.8 806651413 806534946 806311011 806457281 807029307 807580650 807690024 807495534 807508469 807976305 808559299
1966.2 808559299 808747292 808539391 808424056 808750749 809302568 809550583 809329987 809091985 809278786 809758365
1986.6 809758365 810061693 809926271 809582889 809544384 809927583 810282588 810185432 809759200 809503138 809638798
2007 809638798 809825063 809585452 808951437 808415174 808267176 808234751 807783544 806765616 805783033 805584729
2027.4 805584729 805929005 805951416 805368960 804598451 804170132 804154336 804116964 803675413 802985013 802537143
2047.8 802537143 802576602 802802384 802734137 802330256 802049935 802269399 802766144 802970111 802702487 802422881
2068.2 802422881 802601695 803120017 803434134 803268194 802941561 802951276 803374171 803777516 803753197 803458214
2088.6 803458214 803422451 803826272 804321706 804474831 804280877 804209471 804612219 805246174 805541992 805352807
2109H05352807k12431K13444N21660L25084j48356l17335K0504L95179L20792j13249
2129.4H06358099l88205j56283L33368M81963R0778l31640k23994K53081M70460J76549
2149.8H07064176k54572k37048K55764O25908M62592K9206q7797K81453P12693P49707
2170.2H09602082L90112J19925L49164P96616Q91208N01693J03891K15232O87718Q85487
2190.6H14543128N46277R6023O1333M81546Q04484N85794J19329L576L95059Q31247
2211H18467796P78615K91765j4961K28405O73294P36356L30746n6684L7372M81487
2231.4H21954191O89566L76880q1837j11282L11196O17027M22299k4736j75774J81794
2251.8H24159324N86689M83811L9935j68979O5922M48525N42104K44618p0691J4484
$$ plain form
2109 805352807 805140376 805353820 805875480 806200564 806052208 805734873 805755377 806150556 806471348 806358099
2129.4 806358099 805969894 805813611 806146979 806628942 806719720 806388080 806164086 806417167 806887627 807064176
2149.8 807064176 806809604 806572556 806828320 807454228 807916820 807946026 807858229 808139682 808852375 809602082
2170.2 809602082 809992194 810112119 810461283 811257899 812149107 812650800 812754691 812969923 813657641 814543128
2190.6 814543128 815089405 815185428 815246761 815728307 816532791 817118585 817237914 817241490 817636549 818467796
2211 818467796 819246411 819538176 819523215 819751620 820424914 821161270 821492016 821435332 821472704 821954191
2231.4 821954191 822643757 823020637 822938800 822827518 823138714 823755741 824178040 824153304 823977530 824159324
2251.8 824159324 824746013 825229824 825269759 825100780 825166702 825615227 826157331 826401949 826331258 826345742
2272.2H26345742M09364N87523K94447r7572r9659K74658N42462L37958j28508k66313
2292.5H28200102J08063M82202L76880p1585l23594j10090K66910L42786L6061k46584
2312.9H29061151j34290K08438L42667N4478l34262l07143M6909K34663J073l78609
2333.3H28795075m64916k04265J14679P3851l77477n93960k21074J37330J64270r7275
2353.7H27326238m46856m18722J8715J51098k64227n70238m23729o3300J01506j11699
2374.1H25298786l60012k76506L5882K09153O2883k40624m10915l06308p2420k1934
2394.5H23917985k20537m13656l92676k15828j27197k71082n09023n80549m22776k59996
2414.9H20504665l43859n74767o46592n31315m24028m55141o16550p44224o83963n21958
$$ plain form
2272.2 826345742 826755106 827342629 827637076 827539504 827439845 827714503 828256965 828594923 828466415 828200102
2292.5 828200102 828308165 828790367 829167247 829095662 828772068 828661978 828928888 829271674 829307735 829061151
2312.9 829061151 828926861 829135299 829477966 829532444 829198182 828891039 828937948 829172611 829173684 828795075
2333.3 828795075 828330159 828125894 828240573 828314424 827936947 827342987 827121913 827259243 827423513 827326238
2353.7 827326238 826879382 826460660 826479375 826630473 826366246 825796008 825372279 825308979 825410485 825298786
2374.1 825298786 824938774 824662268 824698150 824907303 824970186 824729562 824318647 824012339 823939919 823917985
2394.5 823917985 823697448 823283792 822891116 822675288 822548091 822277009 821767986 821187437 820764661 820504665
2414.9 820504665 820160806 819586039 818939447 818408132 817984104 817528963 816912413 816168189 815484226 814962268
2435.3H14962268m86195o44922p79510p16388n67079n06580n75959o98209p47562o51478
2455.7H08588386n42820n59449o34194o57439n96821m87626m46021n34654o25312o32346
2476.1H02871704n66900m79757m78030n57184n75900m62234l36111l30507m08471m52757
2496.5G98223853m23312l51727k95162l02375l63052l96847l49939k93493l13640m06086
2516.9G94728220m93169n22554m78387m16279m71711o10709o62089o07013n61774n96106
2537.3G89308429p13229q24154p88033o40213n82934o74486p53701p08937o08981n86152
2557.7G82427609o78360p92981p92861o40690n05388n66304p25507p77662o77645n39005
2578.1G75731206n33104o80029p97332o97314m60804l69310m85003o13392n60045l58045
$$ plain form
2435.3 814962268 814476073 813831151 813051641 812335253 811768174 811261594 810685635 809987426 809239864 808588386
2455.7 808588386 808045566 807486117 806851923 806194484 805597663 805110037 804664016 804129362 803504050 802871704
2476.1 802871704 802304804 801825047 801347017 800789833 800213933 799751699 799415588 799085081 798676610 798223853
2496.5 798223853 797800541 797448814 797153652 796851277 796488225 796091378 795741439 795447946 795134306 794728220
2516.9 794728220 794235051 793712497 793234110 792817831 792346120 791735411 791073322 790466309 789904535 789308429
2537.3 789308429 788595200 787771046 786983013 786342800 785759866 785085380 784331679 783622742 783013761 782427609
2557.7 782427609 781749249 780956268 780163407 779522717 779017329 778451025 777725518 776947856 776270211 775731206
2578.1 775731206 775198102 774518073 773720741 773023427 772562623 772193313 771708310 771094918 770534873 770176828
2598.5G70176828k63870m08947o34730p13289o18756n24878o04689q53479j023293
2616.8G64530897r21070p46191q13603j122356j354635j274764j062334j018166j213312
2635.2G55004466j430035j390159j144827j013040j173914j432001j453459j200140
2651.5G44766891r72867j047969j304507j395285j209557r55403r33051j171053j349807
2669.9G34427392j211762q98242p58529r19640j160502j136959q50260o95467q77798
2688.2G25918233j160562j216828j020134q50737r44674j229465j391709j250803j026035
2706.6G15827286j049280j305163j446724j260161r51588q68619j070142j274228j198232
2724.9G05403149q65757o40393p82430j065910j095712q02517n36859o15179r11236
$$ plain form
2598.5 770176828 769912958 769504011 768869281 768155992 767537236 767012358 766407669 765554190 764530897
2616.8 764530897 763609827 762863636 762050033 760927677 759573042 758298278 757235944 756217778 755004466
2635.2 755004466 753574431 752184272 751039445 750026405 748852491 747420490 745967031 744766891
2651.5 744766891 743794024 742746055 741441548 740046263 738836706 737881303 736948252 735777199 734427392
2669.9 734427392 733215630 732317388 731558859 730639219 729478717 728341758 727491498 726796031 725918233
2688.2 725918233 724757671 723540843 722520709 721669972 720725298 719495833 718104124 716853321 715827286
2706.6 715827286 714778006 713472843 712026119 710765958 709814370 708945751 707875609 706601381 705403149
2724.9 705403149 704537392 703896999 703114569 702048659 700952947 700150430 699613571 698998392 698087156
2743.3F98087156j045466q46743n57125n28216p68841r30309p62462m62771l93510
2761.6F91791713o02722q27849p93457n60462n00620p41064j026154j096248r42827
2780F84700310q09431r44316j252949j383603j258314j151442j285911j608193j846492
2798.4F73159659j788795j582027j587450j874328k160132k181291j991809j932919
2814.7F58060908k170205k469778k565145k445460k349794k512037k806843k926647
2831F37814999k816379k742529k927959l302217l648043l779292l765761l867805m115046
2849.3F06849968m147291l701687l052234k681792k781212l185749l642619m032254
2865.7E79625130m448712m962146n405605n631745n620182n356431m913151m377604
$$ plain form
2743.3 698087156 697041690 696194947 695637822 695109606 694340765 693410456 692647994 692185223 691791713
2761.6 691791713 691188991 690361142 689567685 689007223 688506603 687765539 686739385 685643137 684700310
2780 684700310 683890879 682946563 681693614 680310011 679051697 677900255 676614344 675006151 673159659
2798.4 673159659 671370864 669788837 668201387 666327059 664166927 661985636 659993827 658060908
2814.7 658060908 655890703 653420925 650855780 648410320 646060526 643548489 640741646 637814999
2831 637814999 634998620 632256091 629328132 626025915 622377872 618598580 614832819 610965014 606849968
2849.3 606849968 602702677 599000990 595948756 593266964 590485752 587300003 583657384 579625130
2865.7 579625130 575176418 570214272 564808667 559176922 553556740 548200309 543287158 538909554
2882E38909554l715455k914965k092421j435340j029432p98225o44386n66482o39975
2900.3E25072873q74818j208901j537919j800478k134502k682507l338635l834903
2916.6E07660210m009724l903269l600806l144771k444267j466603l72648Q07405K047419
2935D91572946L180266M160166M990607N562484N837024N896270N899906O013751O131411
2953.4E39244831O084144N919695N717337N509794N234003M783034M254341L873229
2969.7E80620408L762424L829360L827453L708720L573716L381133L128230K880156
2986F08711600K560079K162993J812399J519322J264334R67264N79178K27094k1934
3004.4F19782329k11239m17531p03335j065194j395703j599431j729965j908600k119243
$$ plain form
2882 538909554 535194099 532279134 530186713 528751373 527721941 526923716 526279330 525712848 525072873
2900.3 525072873 524198055 522989154 521451235 519650757 517516255 514833748 511495113 507660210
2916.6 507660210 503650486 499747217 496146411 493001640 490557373 489090770 488718122 489525527 491572946
2935 491572946 494753212 498913378 503903985 509466469 515303493 521199763 527099669 533113420 539244831
2953.4 539244831 545328975 551248670 556966007 562475801 567709804 572492838 576747179 580620408
2969.7 580620408 584382832 588212192 592039645 595748365 599322081 602703214 605831444 608711600
2986 608711600 611271679 613434672 615247071 616766393 618030727 618997991 619577169 619804263 619782329
3004.4 619782329 619571090 619153559 618450224 617385030 615989327 614389896 612659931 610751331 608632088
3022.7F08632088k242029k280712k275944k301812k429068k637804k764344k645492
3039E89054883k547086k717376k956330l013492k864897k785802k919376l036678l057122
3057.4E63156724l036797k973557k895355k833485k888561l019273l009975k860427
3073.7E39639294k742886k773822k924919k986014k916217k941727l019572k993762
3090E16340375k945006k905428k856374k800167k800464k873034k817660k661914k675474
3108.4D91004854k809375k722561k456964k402573k597779k864212k997279k846182
3124.7D69307929k614617k508134k541303k613902k516211k306491k291947k514690
3141D49400634k640367k527654k364218k206117k113313k229243k414286k407760k296388
$$ plain form
3022.7 608632088 606390059 604109347 601833403 599531591 597102523 594464719 591700375 589054883
3039 589054883 586507797 583790421 580834091 577820599 574955702 572169900 569250524 566213846 563156724
3057.4 563156724 560119927 557146370 554251015 551417530 548528969 545509696 542499721 539639294
3073.7 539639294 536896408 534122586 531197667 528211653 525295436 522353709 519334137 516340375
3090 516340375 513395369 510489941 507633567 504833400 502032936 499159902 496342242 493680328 491004854
3108.4 491004854 488195479 485472918 483015954 480613381 478015602 475151390 472154111 469307929
3124.7 469307929 466693312 464185178 461643875 459029973 456513762 454207271 451915324 449400634
3141 449400634 446760267 444232613 441868395 439662278 437548965 435319722 432905436 430497676 428201288
3159.4D28201288k234429k180785k142161k113372k059549k040387k040088j973659
3175.7D11416858j888245j849532j864374j910180j920610j861632j804054j785308
3192C96532923j758903j729071j685054j626729j588643j575828j572072j570732j558989
3210.3C81866902j508176j448006j419395j416981j387745j325608j321166j367301
3226.7C70672524j342654j194686j081735j210749j355261j271903j175970j133680
3243C60905886j045764j044899j149952j124144r80049r32455r74298r94533r77695
3261.3C51682097r22740q11845o54071n68778p43568r76085r93729r33766q76248q13961
3281.7C43387306p85023p47115o54548n44488n54771p00831q33273r21011r21935p20918
$$ plain form
3159.4 428201288 425966859 423786074 421643913 419530541 417470992 415430605 413390517 411416858
3175.7 411416858 409528613 407679081 405814707 403904527 401983917 400122285 398318231 396532923
3192 396532923 394774020 393044949 391359895 389733166 388144523 386568695 384996623 383425891 381866902
3210.3 381866902 380358726 378910720 377491325 376074344 374686599 373360991 372039825 370672524
3226.7 370672524 369329870 368135184 367053449 365842700 364487439 363215536 362039566 360905886
3243 360905886 359860122 358815223 357665271 356541127 355561078 354628623 353654325 352659792 351682097
3261.3 351682097 350759357 349947512 349293441 348724663 347981095 347005010 346011281 345077515 344201267 343387306
3281.7 343387306 342602283 341855168 341200620 340656132 340101361 339400530 338567257 337646246 336724311 336003393
3302.1C36003393m94003n76645r26018j185566j176477j041293r65655r16541q57532
3320.5C27863663q37951q71808r93430j097471j079291r99630q70734p84278q90970
3338.8C19438100j082033j136333j095146j008183q47309q87692j163930j260072j107574
3357.2C09849828r74982r91613j004785q10951o74904r16421j257569j257866j009942
3375.5C00950795q69989q72642r05007q36283o59108m36485k32339l25650o49512o70254
3395.9B94493526l26931j74344n16534q72940p15285l56287k07573k27869l61830m33296
3416.3B90300637k98738k12610k37494j19597J40160L13401K26796J75953L17872K39014
3436.7B90845394l0577o7174R8198K89351M13150L85403M01378N02556N60016O78092
$$ plain form
3302.1 336003393 335509390 334932745 334006727 332821161 331644684 330603391 329637736 328721195 327863663
3320.5 327863663 327025712 326153904 325160474 324063003 322983712 321984082 321113348 320329070 319438100
3338.8 319438100 318356067 317219734 316124588 315116405 314269096 313381404 312217474 310957402 309849828
3357.2 309849828 308874846 307883233 306878448 306067497 305392593 304476172 303218603 301960737 300950795
3375.5 300950795 300080806 299208164 298303157 297466874 296807766 296371281 296138942 295813292 295163780 294493526
3395.9 294493526 294166595 293992251 293475717 292602777 291887492 291531205 291323632 291095763 290733933 290300637
3416.3 290300637 290001899 289789289 289551795 289432198 289572358 289885759 290112555 290288508 290606380 290845394
3436.7 290845394 290814817 290747643 290845841 291135192 291548342 291933745 292335123 292837679 293397695 294075787
3457.1B94075787Q29786P35790O62177R51350J136154Q05289L53783L63857O82622
3475.5C00596595R49859R71675P68423P53701R39578Q98153P66277R20892J114517
3493.8C08679670J129359J040518J000643J031935R07779P47651Q18163J076043J326769
3512.2C17758530J250327R84550R78976J200765J400620J281232R80258R43184J118689
3530.6C27897131J287759J449048J458824J312077J444548J738877J700699J367718
3546.9C39656681J235902J348108J481116J653224J876891K071768K107054J934647
3563.2C53365391J842499K274066K689481K538115K384991K525091K770126K999931
3579.5C73389691L162116L176302L043353L053725L315747L305912L248006L456116
$$ plain form
3457.1 294075787 294905573 295641363 296303540 297254890 298391044 299196333 299550116 299913973 300596595
3475.5 300596595 301546454 302518129 303286552 304040253 304979831 305877984 306644261 307565153 308679670
3493.8 308679670 309809029 310849547 311850190 312882125 313789904 314537555 315355718 316431761 317758530
3512.2 317758530 319008857 319993407 320972383 322173148 323573768 324855000 325835258 326778442 327897131
3530.6 327897131 329184890 330633938 332092762 333404839 334849387 336588264 338288963 339656681
3546.9 339656681 340892583 342240691 343721807 345375031 347251922 349323690 351430744 353365391
3563.2 353365391 355207890 357481956 360171437 362709552 365094543 367619634 370389760 373389691
3579.5 373389691 376551807 379728109 382771462 385825187 389140934 392446846 395694852 399150968
3595.8C99150968L676742L748417L825337L773093L540635L607839L862024L987014
3612.1D29172069M089296L892243L826201M280805M211217L730446L417910L761470
3628.5D60381657M468232M194290L891021L888994L917396M027277M116327L997684
3644.8D92882878L802925M028439M349888L939271L567695L856481L960013L549635
3661.1E23937225L362358L485858L312827L118574L479898L278256K842307L012240
3677.4E49829543K977669K944052L120720L117145K909183K495229K212763K321303
3693.7E71927607K449215K358973K056598J884937K080322K179801K003312J714468
3710E88655233J618624J966179K090394J874745J618504J479090J430034J519442J730740
$$ plain form
3595.8 399150968 402827710 406576127 410401464 414174557 417715192 421323031 425185055 429172069
3612.1 429172069 433261365 437153608 440979809 445260614 449471831 453202277 456620187 460381657
3628.5 460381657 464849889 469044179 472935200 476824194 480741590 484768867 488885194 492882878
3644.8 492882878 496685803 500714242 505064130 509003401 512571096 516427577 520387590 523937225
3661.1 523937225 527299583 530785441 534098268 537216842 540696740 543974996 546817303 549829543
3677.4 549829543 552807212 555751264 558871984 561989129 564898312 567393541 569606304 571927607
3693.7 571927607 574376822 576735795 578792393 580677330 582757652 584937453 586940765 588655233
3710 588655233 590273857 592240036 594330430 596205175 597823679 599302769 600732803 602252245 603982985
3728.4F03982985J766741J683295J411140J309276J660585J590610Q36670O11007J403272
3746.7F16255581J169682N85318J154243J682461J442790J107514J164436J194298
3763.1F25756323J050234R90272R01162R68933J191915J281380J186371R63628Q61466
3781.4F35151684P74622P56204R35197J058877J036763Q95917Q59797J022399Q04901
3799.8F43296361O19411R30489P17341N44906R24826J106500Q16048O47366R06586
3818.1F50509834O31392N47588Q76844P79271O96242P39575Q92937R82701N27978J35839
3838.5F57320201M48823O96838P30217Q58068R75013O10352l03686j1861R79840R74298
3858.9F63278103O50585L74376N06401O78242M20868M41432O02543O19650O02186L99470
$$ plain form
3728.4 603982985 605749726 607433021 608844161 610153437 611814022 613404632 614241302 614852309 616255581
3746.7 616255581 617425263 618010581 619164824 620847285 622290075 623397589 624562025 625756323
3763.1 625756323 626806557 627796829 628697991 629666924 630858839 632140219 633326590 634290218 635151684
3781.4 635151684 635926306 636682510 637617707 638676584 639713347 640609264 641469061 642491460 643296361
3799.8 643296361 643915772 644846261 645563602 646108508 647033334 648139834 648955882 649603248 650509834
3818.1 650509834 651141226 651688814 652565658 653344929 654041171 654780746 655673683 656656384 657184362 657320201
3838.5 657320201 657769024 658465862 659196079 660054147 661029160 661639512 661335826 661323965 662303805 663278103
3858.9 663278103 663928688 664303064 664809465 665487707 665908575 666350007 666952550 667572200 668174386 668573856
3879.3F68573856N08130O39677M00782M36842M12643K33114M86016P24375N50449K72632
3899.7F73238516J07944O5267L04103N05984M68909M88937M76659K75194J37925K04146
3920.1F76273584K57969K63632L70800M39525K86281J86205L01897L27170K43128J70528
3940.5F79120719J65105K95520L64304L03566K66433K53141K40385K63036K92480K24530
3960.9F81789219J61529K25842K59936K57492K88546K18749J26958J77622K26557K71142
3981.3F84003592L14235K00987J02997J76370K42412K07424J77563J87397
3997.6F85612977
$$ plain form
3879.3 668573856 669081986 669721663 670122445 670559287 670971930 671205044 671691060 672415435 672965884 673238516
3899.7 673238516 673346460 673411727 673715830 674221814 674690723 675179660 675656319 675931513 676069438 676273584
3920.1 676273584 676531553 676795185 677165985 677605510 677891791 678077996 678379893 678707063 678950191 679120719
3940.5 679120719 679285824 679581344 679945648 680249214 680515647 680768788 681009173 681272209 681564689 681789219
3960.9 681789219 681950748 682176590 682436526 682694018 682982564 683201313 683328271 683505893 683732450 684003592
3981.3 684003592 684317827 684518814 684621811 684798181 685040593 685248017 685425580 685612977
3997.6 685612977
##END=$$ End of the data block
