##TITLE=$$ Begin of the data block
##JCAMP-DX=5.00 $$ ACD/SpecManager v 10.08
##SPECTROMETER/DATA SYSTEM=Alpha
##DATE=29 Dec 2014 15:06:02
##DATA TYPE=INFRARED SPECTRUM
##DATA CLASS=XYDATA
##ORIGIN=
##OWNER=
##NPOINTS=1765
##FIRSTX=399.76428223
##LASTX=3997.64306641
##MAXX=3997.64306641
##MINX=399.76428223
##MAXY=0.83085054
##MINY=0.22737868
##XFACTOR=1.0000000000
##YFACTOR=1.000000000000000e-9
##FIRSTY=0.53271323
##DELTAX=2.03961372
##XUNITS=1/CM
##YUNITS=ARBITRARY UNITS
##XYDATA=(X++(Y..Y))
399.8E32713234m788935n075454m738093j787543K060413L698051K604365Q05319j52469
418.1E25338888o69837j265824k528965m157901m228651k769590j888156k722621l155112
436.5E01952231r28283K636075N291343N334079L473938K660989L123045K703846R16600
454.8E27163863j139164k471447k086401j434743k155245l719389m325569l505826
471.2E06326079k808570k873421k825588k194196j024544J11252M19616j44779p12365
489.5D94273484o97017o68108j265854k151579k717107k807737k488345k370566l169238
507.9D75937933m145891m181415l696709l877372m681289m928082l968388k191961
524.2D44266826o82116k06291r9212P24762K386809M307061N735040N956829N013406
$$ y = [532713234, 527924299, 522848845, 518110752, 516323209, 518383622, 522081673, 524686038, 525491357, 525338888, 524669051, 523403227, 520874262, 516716361, 512487710, 509718120, 507829964, 505107343, 501952231, 501023948, 503660023, 508951366, 514285445, 517759383, 520420372, 523543417, 526247263, 527163863, 526024699, 523553252, 521466851, 520032108, 517876863, 514157474, 509831905, 506326079, 503517509, 500644088, 497818500, 495624304, 494599760, 494711012, 495130628, 494985849, 494273484, 493576467, 492908359, 491642505, 489490926, 486773819, 483966082, 481477737, 479107171, 475937933, 471792042, 467610627, 463913918, 460036546, 455355257, 450427175, 446458787, 444266826, 443584710, 443378419, 443279207, 444003969, 446390778, 450697839, 456432879, 462389708, 467403114]
542.5D67403114L695160K406895R37730p36356k086103k703279k932578l372103m366666
560.9D58245814n732238o806165p305563p073611n796343l648698j054407J828313
577.2D22657102M543156O387561P308990P536471O973177N732417M101426K056867
593.5D67297167L61204k52426j18315L5405j68681l38107l0250Q05378J677752K059132
613.9D71328259K193957K680272L548741M295737M522264M076302L349364K966910
630.2D98961806L009975K826095J999259J124561R87351J491725J840055J430452P06971
648.6E14378250N99920J156450J664161J540482R84729O59168Q92639J302898J659095
667E24837792J580775R25481J223445K109408K371848J771688J133204J091540J416862
$$ y = [467403114, 471098274, 473505169, 474442899, 473706543, 471620440, 468917161, 465984583, 462612480, 458245814, 452513576, 445707411, 438401848, 431328237, 425531894, 421883196, 420828789, 422657102, 427200258, 433587819, 440896809, 448433280, 455406457, 461138874, 465240300, 467297167, 467658371, 467405945, 467287630, 467323035, 467154354, 466816247, 466785997, 467591375, 469269127, 471328259, 473522216, 476202488, 479751229, 484046966, 488569230, 492645532, 495994896, 498961806, 501971781, 504797876, 506797135, 507921696, 508909047, 510400772, 512240827, 513671279, 514378250, 514978170, 516134620, 517798781, 519339263, 520323992, 520983160, 521875799, 523178697, 524837792, 526418567, 527344048, 528567493, 530676901, 533048749, 534820437, 535953641, 537045181, 538462043]
685.3E38462043J445949P76172l80993j284540j535952j771271k601147l599823l778457
703.7E25731981k680242r01580N38170J380325K240955L615857N268812O409049O390810
722E47994137N813777N795002O297887O243527M999220L359377K541125K675951K646744
740.4E88366747J307487r54866k671003l140092l268957m146040n529880o199003n372166
758.7E58392227l638804k250970j447320j17600K509416N742192Q131861Q966744Q859933
777.1E85147679Q875847R216487Q931935P256508M898906L650307M183531N141497
793.4F37302697M955470L815234L258347M073799N110026M532933K409577O83248P37369
811.8F66878700J819670J945019L71814j354754j558363q24929j160800l256381n591452
$$ y = [538462043, 539907992, 540684164, 540303171, 539018631, 537482679, 535711408, 533110261, 529510438, 525731981, 523051739, 522150159, 522688329, 524068654, 526309609, 529925466, 535194278, 541603327, 547994137, 553807914, 559602916, 565900803, 572144330, 577143550, 580502927, 583044052, 585720003, 588366747, 589674234, 588719368, 586048365, 582908273, 579639316, 575493276, 569963396, 563764393, 558392227, 554753423, 552502453, 551055133, 550937533, 553446949, 559189141, 567321002, 576287746, 585147679, 594023526, 603240013, 612171948, 619428456, 624327362, 627977669, 632161200, 637302697, 642258167, 646073401, 649331748, 653405547, 658515573, 663048506, 665458083, 666141331, 666878700, 668698370, 670643389, 671015203, 669660449, 668102086, 667277157, 666116357, 662859976, 657268524]
830.1F57268524o317913n478979m833102n421698o393909o289780m870594l515303
846.4F14147246l623664m910887n850792n609572m877925m352390k926946R47952O548286
864.8E89491308J1462927J3956606J3640344J1506200R231269P294059M588366L81112
881.1F61552191l924191o130040o139636n867302o593287p655681p556080o085217
897.4F11600757m861653n333662p062435q418620q691013q803427r828389j1515915
913.7E47085643j2416303j1358738q738697o028056m158258k789379j152277P93279
930.1E01237214K324879K902388K976001L648221N178511O094396M421711j549n040109
948.4E23741663q794129j1522115j4123052j6446114j7783194j7998994j7935902j8443226
$$ y = [657268524, 650950611, 645471632, 640638530, 635216832, 628822923, 622533143, 617662549, 614147246, 610523582, 605612695, 599761903, 594152331, 589274406, 584922016, 581995070, 582943022, 589491308, 600954235, 614910841, 628551185, 640057385, 649288654, 656582713, 661171079, 661552191, 657628000, 651497960, 645358324, 639491022, 632897735, 625242054, 617685974, 611600757, 606739104, 601405442, 594343007, 585924387, 577233374, 568429947, 558601558, 547085643, 534669340, 523310602, 514571905, 508543849, 504385591, 501596212, 500443935, 501237214, 503562093, 506464481, 509440482, 513088703, 518267214, 524361610, 528783321, 528781772, 523741663, 514947534, 503425419, 489302367, 472856253, 455073059, 437074065, 419138163, 400694937]
964.7D00694937j9364924j9964128j9833714j9160748j8353939j7415255j5911281
979B70690948j3566643j0653869p800757n404741l486916j893893n05448O24165J314119
997.4B29316965J493081J358450J207351J037315O36756L3438m19527l11881L54826
1015.7B34706774J206085J856074K246201K675474L334805L940910M042805L598094
1032B57607222K886265K163977J512557R19282M15296J89125M67241J295745K498925
1050.4B69955635L816903N120873O392807P702947R051561J0110140J0117680P998883
1066.7C30267429K939791m035801r583771j0832191q162498m138529o35893J793057
1083B97611594L203273M030675M873216N906701O556034O215155M965127L364116J972317
$$ y = [400694937, 381330013, 361365885, 341532171, 322371423, 304017484, 286602229, 270690948, 257124305, 246470436, 238669679, 233264938, 229778022, 227884129, 227378681, 228002846, 229316965, 230810046, 232168496, 233375847, 234413162, 235049918, 235083356, 234663829, 234351948, 234706774, 235912859, 237768933, 240015134, 242690608, 246025413, 249966323, 254009128, 257607222, 260493487, 262657464, 264170021, 265089303, 265504599, 265693724, 266160965, 267456710, 269955635, 273772538, 278893411, 285286218, 292989165, 302040726, 312150866, 322268546, 330267429, 333207220, 329171419, 319587648, 308755457, 300592959, 296454430, 295818537, 297611594, 300814867, 304845542, 309718758, 315625459, 322181493, 328396648, 333361775, 336725891, 338698208]
1101.4C38698208J127363R59038J508087K616942L842116M605948M521072L666729
1117.7C61545503K578259J897096J858473K335370L141343M038871M567295M102439
1134C86064649K170354j061708m512250o958217p988840p986337p477909o642372n376726
1152.4C40230644l705204j938134m46677P88927K187431M046946O281734Q495152J0307103
1170.7C66247922J1623472J2646318J3497084J4045954J4066398J3478458J2607306
1185D58212912J1705816J0503590Q669168O392419M312754L031581K564431K370357
1201.3E07763028K100766K013445K545833L672004M848182N503118N502105N103290
1217.7E39051771M505217L584981K184332N32031q15392j461029j556575j605511j853824
$$ y = [338698208, 339825571, 340784609, 342292696, 344909638, 348751754, 353357702, 357878774, 361545503, 364123762, 366020858, 367879331, 370214701, 373356044, 377394915, 381962210, 386064649, 388235003, 387173295, 382661045, 375702828, 367713988, 359727651, 352249742, 345607370, 340230644, 336525440, 334587306, 334140629, 334929556, 337116987, 341163933, 347445667, 355940819, 366247922, 377871394, 390517712, 404014796, 418060750, 432127148, 445605606, 458212912, 469918728, 480422318, 489091486, 495483905, 499796659, 502828240, 505392671, 507763028, 509863794, 511877239, 514423072, 518095076, 522943258, 528446376, 533948481, 539051771, 543556988, 547141969, 549326301, 549858332, 549042940, 547581911, 546025336, 544419825, 542566001]
1236E42566001k022266j697898q57234J04964Q26716J309872J786649K300024K530456
1254.4E46847284K174437J424551Q66532Q93176J411140J987636K268910K249480K046763
1272.7E62169909J663685J011432J09791o90698r30131o51836l94404n92649j155436
1291.1E60539663j643717j844466j928985k142072k438188k556026k422869k167225
1307.4E43396115j893222j711309j620650j413703j154125j222849j858294l031134
1323.7E29490829m361928n303204n717754n716503n254567m281461k923548j511306
1340D94420558m51326J05947L26395L61413K53260J4573l92854q69572j111597r95964
1360.4D91660833q07196p69376p65056o00248o7234P46578J318186J169831Q22037
$$ y = [542566001, 540543735, 538845837, 537988603, 538093567, 538920283, 540230155, 542016804, 544316828, 546847284, 549021721, 550446272, 551312804, 552205980, 553617120, 555604756, 557873666, 560123146, 562169909, 563833594, 564845026, 564954817, 564264119, 563333988, 562682152, 562287748, 561695099, 560539663, 558895946, 557051480, 555122495, 552980423, 550542235, 547986209, 545563340, 543396115, 541502893, 539791584, 538170934, 536757231, 535603106, 534380257, 532521963, 529490829, 525128901, 519825697, 514107943, 508391440, 503136873, 498855412, 495931864, 494420558, 493969232, 494075179, 494401574, 494762987, 495016247, 495030820, 494637966, 493768394, 492656797, 491660833, 490853637, 490084261, 489319205, 488718957, 488651723, 489398301, 490716487, 491886318, 492708355]
1378.8D92708355Q92073J597732K882362M255563M471004L494203K625525J705050
1395.1E14631867L48688r23574j520336j537621j613021j886606k252042k470375k160906
1413.5E00616074j478702j039297j026541p92265j45494N68091J127392J372874J350403
1431.8E00552535J461625K088308K516270K010226J611591J329481J005471N00202
1448.1E13075709l37720j086711j451076j993715k239466q64387M98116J794100L178001
1466.5E10572851M503369O665587R886981J0434687Q830964Q146048Q105337P907510
1482.8E75053334P052243O613016O837726O591499N287110M692555M875123M435540
1499.1F21438146L896355L744602M180491M392326K742529K218843K719640K901733
$$ y = [492708355, 493600428, 495198160, 498080522, 502336085, 506807089, 510301292, 512926817, 514631867, 514980555, 514056981, 512536645, 510999024, 509386003, 507499397, 505247355, 502776980, 500616074, 499137372, 498098075, 497071534, 496279269, 496133775, 496701866, 497829258, 499202132, 500552535, 502014160, 504102468, 506618738, 508628964, 510240555, 511570036, 512575507, 513075709, 512737989, 511651278, 510200202, 508206487, 505967021, 505102634, 505600750, 507394850, 510572851, 515076220, 521741807, 531628788, 542063475, 550894439, 559040487, 567145824, 575053334, 582105577, 588718593, 595556319, 602147818, 607434928, 612127483, 617002606, 621438146, 625334501, 629079103, 633259594, 637651920, 640394449, 642613292, 645332932, 648234665]
1515.4F48234665K633512K322913K594947K532542K045512J674712J344740J608193
1531.8F64991736K032519J842975J634896J514375O52194L35217M52995L44813K5988
1550.1F73827708j59145J41323N08130k53916k199650j788676j156509r65595j245499
1568.5F66708171k066433k031505j737178k131998k200365k113164k400636k420664
1584.8F49606228k161741k009035k204835k530694k692044k546370k328098k478122
1601.1F30655289k914012l163695l108978l102303l149211l175140l718912m477621
1617.4F03845417l489792k703667l246963l504335l301502k910793j962184j269818
1633.7E81456363j522660j517475o65366J95324R09865J514733J720130J592458K600073
$$ y = [648234665, 650868177, 653191090, 655786037, 658318579, 660364091, 662038803, 663383543, 664991736, 667024255, 668867230, 670502126, 672016501, 672668695, 673003912, 673456907, 673801720, 673827708, 673668563, 673809886, 674318016, 674064100, 671864450, 670075774, 668919265, 667953670, 666708171, 664641738, 662610233, 660873055, 658741057, 656540692, 654427528, 652026892, 649606228, 647444487, 645435452, 643230617, 640699923, 638007879, 635461509, 633133411, 630655289, 627741277, 624577582, 621468604, 618366301, 615217090, 612041950, 608323038, 603845417, 600355625, 597651958, 594404995, 590900660, 587599158, 584688365, 582726181, 581456363, 579933703, 578416228, 577750862, 577946186, 578856051, 580370784, 582090914, 583683372, 586283445]
1652.1E86283445L931523K763808K457618L277838M318238M654050M175722M499197
1668.4F16361439N071879M606783M924178N356014M676878M406095N189121O507635
1684.7F57100022N294323M060983M055143L828227M291952M628062L813327L142655
1701.1F90214694K303123K102554K252936J963198J772941J882493K175331K408505
1717.4G07075775K009868J534879J507998J775980K097785K300859K148867J905143
1733.7G22357154J599729J622081K111494K218962K001226K156377K655744L126920
1750G39849687L058076K567589K478003K671361K743662K719819K209008J758337J813352
1768.4G61868894K029777J991331J456261J005709J042187J316905J432896J237631
$$ y = [586283445, 590214968, 592978776, 595436394, 598714232, 603032470, 607686520, 611862242, 616361439, 621433318, 626040101, 630964279, 636320293, 640997171, 645403266, 650592387, 657100022, 662394345, 666455328, 670510471, 674338698, 678630650, 683258712, 687072039, 690214694, 692517817, 694620371, 696873307, 698836505, 700609446, 702491939, 704667270, 707075775, 709085643, 710620522, 712128520, 713904500, 716002285, 718303144, 720452011, 722357154, 723956883, 725578964, 727690458, 729909420, 731910646, 734067023, 736722767, 739849687, 742907763, 745475352, 747953355, 750624716, 753368378, 756088197, 758297205, 760055542, 761868894, 763898671, 765890002, 767346263, 768351972, 769394159, 770711064, 772143960, 773381591]
1784.7G73381591R39429R06825J152634J354754J153410Q58307P19964P99000J037121
1803G82303035J121104R36925O58393O02782Q17597J028359R14097N69701M88222P77781
1823.4G90217996J041770R18924M24684L8027K93255P31647P92146M90427K59876K77341
1843.8G95486093M52220M87804K18213r3222l9935L84331O37650M17710N7399N8055
1864.2G98066318M15325O19471L47615k6882j12534J59622N96940P15613M07339R2089
1884.6H01280916J96695N85675P06971L60489n8651q7321K91586N74887L77774m2021
1905H04187000j71304J15454M33982L87966P9036j50502K4021M02451M37855P9394
1925.4H05825353j98126n7399L42071M89354J74463j88053j20044K98321N20468K70784
$$ y = [773381591, 774321020, 775227845, 776380479, 777735233, 778888643, 779746950, 780466914, 781265914, 782303035, 783424139, 784361064, 785019457, 785622239, 786439836, 787468195, 788382292, 788951993, 789440215, 790217996, 791259766, 792178690, 792603374, 792641401, 792934656, 793666303, 794458449, 794948876, 795208752, 795486093, 795938313, 796426117, 796644330, 796551108, 796511173, 796895504, 797533154, 797950864, 798008263, 798066318, 798481643, 799101114, 799448729, 799421847, 799309313, 799468935, 800065875, 800781488, 801188827, 801280916, 801477611, 802063286, 802770257, 803130746, 803072095, 802984774, 803276360, 803851247, 804229021, 804187000, 804015696, 804131150, 804565132, 804953098, 805032134, 804881632, 804905653, 805308104, 805745959, 805825353, 805627227, 805569828, 805911899, 806401253, 806575716, 806387663, 806267619, 806565940, 807086408, 807357192]
1945.8H07357192j22070j74403K02477N87105N34773P4327k26140L2187N23746N87523
1966.2H09376717J31726k38717q7738L66748N52535K27332k06769j99496K16066M98176
1986.6H10636580K88367j63018l32714k4437L62932L13401j35958m25935k11298J82092
2007H10490012K00212k52425o41525n14448j20819m9889m95851j049399r89080j57713
2027.4H06419075L91781P152o36279p87556l89874K4378l7849m51684o70612m11451
2047.8H03457081O3658K16484r3460l93987k35378K50101M85360J68205k78592k49982
2068.2H03389490J95861M93407K68817k12610l46303M3929M87983M34875m6372l35395
2088.6H04373682o3360M17054N35726J73867k03312p2121M15265O28352K85447j89304
$$ y = [807357192, 807235122, 807060719, 807263196, 807850301, 808385074, 808459401, 808233261, 808265448, 808789194, 809376717, 809508443, 809269726, 809181988, 809548736, 810101271, 810328603, 810121834, 809922338, 810138404, 810636580, 810924947, 810761929, 810429215, 810404778, 810767710, 811081111, 810945153, 810519218, 810307920, 810490012, 810690224, 810437799, 809796274, 809281826, 809161007, 809111118, 808615267, 807565868, 806576788, 806419075, 806810856, 806818008, 806181729, 805394173, 805004299, 805028677, 804990828, 804539144, 803868532, 803457081, 803520739, 803737223, 803643763, 803249776, 803014398, 803264499, 803749859, 803918064, 803639472, 803389490, 803585351, 804078758, 804347575, 804134965, 803788662, 803832591, 804320574, 804755449, 804709077, 804373682, 804310322, 804727376, 805263102, 805436969, 805233657, 805161536, 805576801, 806205153, 806490600, 806301296]
2109H06301296j91868K53499N55396L35813j59085l32356M173L82721L10063j15037
2129.4H07344615l36468p4982L59833M34518K5153l64423k20239K81632M90844J49310
2149.8H08089793k95341k43068K71976O35624M55797J5676p2301L39568P52985P36833
2170.2H10687542L78966J39356L58462P87497Q74281M82797J11103K38359O99878Q86262
2190.6H15644503N25891O9201P5519N19157Q22782N80907J07885K8074M50849Q42691
2211H19667459P22587K50995J728K60771O94334P32064K94626q8990O2943N37038O92189
2233.4H23827744L35335q3267o0261L61860O36160L89636p0453j53303K35915N88239
2253.8H26007605M57048J7881j75535R6321M86076N31256J93596r4712L8862M50433
$$ y = [806301296, 806109428, 806362927, 806918323, 807254136, 807095051, 806762695, 806766868, 807149589, 807459652, 807344615, 807008147, 806933165, 807292998, 807727516, 807752669, 807388246, 807168007, 807449639, 807940483, 808089793, 807794452, 807551384, 807823360, 808458984, 808914781, 808930457, 808858156, 809197724, 809950709, 810687542, 811066508, 811205864, 811564326, 812351823, 813226104, 813708901, 813820004, 814058363, 814758241, 815644503, 816170394, 816239595, 816315114, 816834271, 817657053, 818237960, 818345845, 818373919, 818824768, 819667459, 820390046, 820641041, 820642769, 820903540, 821597874, 822329938, 822624564, 822535574, 822598517, 823135555, 823827744, 824163079, 824079812, 824019551, 824381411, 825017571, 825407207, 825336754, 825183451, 825419366, 826007605, 826464653, 826482534, 826306999, 826403320, 826889396, 827420652, 827614248, 827519536, 827558398, 828008831]
2274.2H28008831N96106K55465j29998p8261L33667N76854L29256j25766k30908J22309
2294.6H29657555M53591L38376q3447k84433o1870K74003L33428L3200k64824j78873
2315H30216706J80185L65793Q7858l38972l15845P3254K72632J2457m18782n19335
2335.4H29615951k09988J10388P570m34041n60164j23382K35557J83523j71482m36068
2355.8H28217864k76804N9843J07825k06590n10573m72009j72794P212j14560l24488
2376.2H26314926l05056k7776J90377Q4817k54035m51743k75135J0609Q882k56896
2396.6H25038970m60148l92735j76311j06931k90095n21303n38647l79026k88367l92079
2417H21493328n83589o43015n11110l95179m62413o32644p32004o65248n26130n04553
$$ y = [828008831, 828604937, 828860402, 828730404, 828652143, 828985810, 829562664, 829891920, 829766154, 829535246, 829657555, 830111146, 830449522, 830366075, 830081642, 830019772, 830293775, 830627203, 830660403, 830395579, 830216706, 830396891, 830762684, 830850542, 830511570, 830195725, 830268979, 830541611, 830554068, 830135286, 829615951, 829405963, 829516351, 829523921, 829089880, 828529716, 828406334, 828641891, 828825414, 828653932, 828217864, 827941060, 828000903, 828108728, 827902138, 827391565, 826919556, 826746762, 826753974, 826639414, 826314926, 826009870, 825982094, 826172471, 826257288, 826003253, 825551510, 825276375, 825286984, 825295866, 825038970, 824578822, 824186087, 824009776, 823902845, 823612750, 823091447, 822552800, 822173774, 821885407, 821493328, 820909739, 820266724, 819755614, 819360435, 818898022, 818265378, 817533374, 816868126, 816341996, 815837443]
2437.4H15837443o49393p74681p02620n47290n02586o03974p39276p58529o30558n06758
2457.8H09421778n20110o24836o87420o11902m71830m57883n74112o46114o13034n19633
2478.1H03694904m43220m66109n60581n79179m53710l26872l30329m33385m90845m09901
2498.5G99200773k98559k56360k85804l90828m40121l56078k92718l27289m07040m84705
2518.9G95661271n00441m34160l96431m88162o25431o69182n99622n35965o00279p60674
2539.3G90050924q47638p57038n99385n70535o71685p53820p25806n92589n27859o65545
2559.7G83339024q43704q39710o53208n00977n50270p19428p88748o70552n18680n35786
2580.1G76717961p05958q07404o67453m02212l21746m75228o17444n71549l82841k76327
$$ y = [815837443, 815188050, 814413369, 813710749, 813163459, 812660873, 812056899, 811317623, 810559094, 809928536, 809421778, 808901668, 808276832, 807589412, 806977510, 806505680, 806047797, 805473685, 804827571, 804214537, 803694904, 803251684, 802785575, 802224994, 801645815, 801192105, 800865233, 800534904, 800101519, 799610674, 799200773, 798902214, 798645854, 798360050, 797969222, 797529101, 797173023, 796880305, 796553016, 796145976, 795661271, 795160830, 794726670, 794330239, 793842077, 793216646, 792547464, 791947842, 791411877, 790811598, 790050924, 789203286, 788446248, 787846863, 787276328, 786604643, 785850823, 785125017, 784532428, 784004569, 783339024, 782495320, 781655610, 781002402, 780501425, 779951155, 779231727, 778442979, 777772427, 777253747, 776717961, 776012003, 775204599, 774537146, 774134934, 773813188, 773337960, 772720516, 772148967, 771766126, 771489799]
2600.5G71489799m11212o54340p27475n93305m99725o22332q81612j015187q90791
2618.9G65193820p36117q27551j123250j328170j253665j042127r97603j212299j434922
2637.2G55238116j399040j154542j018882j180887j433135j451551j208485r85562
2653.5G45406032j055181j330495j423180j203359r52422r37104j143933j309156j194656
2671.9G34856546q96454p72178r54270j163602j099229q31366p12693q96036j158238
2690.3G26372480j202821j012206q55327r59992j255274j407206j229704r90569j020790
2708.6G16438591j277029j430213j272083r81569r00209j094818j258731j120448q19087
2727G06284404o90878q37683j058162j050531p72000n51224o36220q96155j004219
$$ y = [771489799, 771078587, 770424247, 769696772, 769103467, 768603742, 767981410, 767099798, 766084611, 765193820, 764457703, 763630152, 762506902, 761178732, 759925067, 758882940, 757885337, 756673038, 755238116, 753839076, 752684534, 751665652, 750484765, 749051630, 747600079, 746391594, 745406032, 744350851, 743020356, 741597176, 740393817, 739441395, 738504291, 737360358, 736051202, 734856546, 733960092, 733187914, 732233644, 731070042, 729970813, 729139447, 728426754, 727530718, 726372480, 725169659, 724157453, 723302126, 722342134, 721086860, 719679654, 718449950, 717459381, 716438591, 715161562, 713731349, 712459266, 711477697, 710577488, 709482670, 708223939, 707103491, 706284404, 705593526, 704755843, 703697681, 702647150, 701875150, 701323926, 700687706, 699791551, 698787332]
2745.3F98787332q19326n66304n78940q31425r22262p10488m62770m06504n75423p91550
2765.7F92122340p90357n96345n25355p33078j023471j105011r25123p88927r63033
2784.1F84671640j274526j383304j235485j119674j286864j632333j850664j776815
2800.4F73111975j583159j608252j896024k138078k130449j994908j984417k199650
2816.7F57577038k462089k526224k395689k341807k536953k821684k938211k843797
2833F36710584k778292k949655l301382l635525l756881l752589l910303m165888m132688
2851.4F04327381l678263l071308k705812k809644l224075l651201m029513m474640
2867.7E76682925n013525n459488n654931n609691n357206m952073m422009l742218
$$ y = [698787332, 697968006, 697401702, 696822762, 695991337, 695069075, 694358587, 693895817, 693489313, 692913890, 692122340, 691331983, 690735638, 690210283, 689477205, 688453734, 687348723, 686423600, 685634673, 684671640, 683397114, 682013810, 680778325, 679658651, 678371787, 676739454, 674888790, 673111975, 671528816, 669920564, 668024540, 665886462, 663756013, 661761105, 659776688, 657577038, 655114949, 652588725, 650193036, 647851229, 645314276, 642492592, 639554381, 636710584, 633932292, 630982637, 627681255, 624045730, 620288849, 616536260, 612625957, 608460069, 604327381, 600649118, 597577810, 594871998, 592062354, 588838279, 585187078, 581157565, 576682925, 571669400, 566209912, 560554981, 554945290, 549588084, 544636011, 540214002, 536471784]
2884E36471784k944708k124250j439750j018882p96258o50585n73158o16431q60274
2902.4E25447488j245022j549065j753807k092362k668738l347099l875792m055083
2918.7E04860520l923833l608882l146828k454608j470387l45677Q11249K007991L165692
2937D95895237M195839N048752N610525N829990N866468N936146O089568O161809O055892
2955.4E46690226N907714N774677N559504N226731M793823M309952L913343L763139
2971.7E85939109L822208L848552L764391L619671L394783L138542K900839K588630
2988F13016725K180039J820565J553714J316309J002192N86987K47300K9981j76609
3006.4F21577203m10676o99937j075625j408339j574636j711666j941681k149403k245605
$$ y = [536471784, 533527076, 531402826, 529963076, 528944194, 528147936, 527497351, 526924193, 526307762, 525447488, 524202466, 522653401, 520899594, 518807232, 516138494, 512791395, 508915603, 504860520, 500936687, 497327805, 494180977, 491726369, 490255982, 489910305, 490721554, 492729545, 495895237, 500091076, 505139828, 510750353, 516580343, 522446811, 528382957, 534472525, 540634334, 546690226, 552597940, 558372617, 563932121, 569158852, 573952675, 578262627, 582175970, 585939109, 589761317, 593609869, 597374260, 600993931, 604388714, 607527256, 610428095, 613016725, 615196764, 617017329, 618571043, 619887352, 620889544, 621476531, 621723831, 621753812, 621577203, 621166527, 620466590, 619390965, 617982626, 616407990, 614696324, 612754643, 610605240, 608359635]
3024.7F08359635k279937k274335k300024k433896k650976k781332k655029k542913
3041.1E88441193k711773k943873k973020k825618k788901k940774l052712l069699
3057.4E65134823l030121k947271k887666k865434k922356l015280k996921k895355
3073.7E41574419k797246k789736k897740k949476k946198l031909l051937k927721
3090E18182456k886950k929330k903164k828896k822816k893508k842426k682030k699197
3108.4D92694139k841085k732157k463729k441316k634883k859265l004819k902389
3124.7D70814496k643794k515465k570360k623767k498746k304256k334595k563119
3141D50760394k654105k540380k372712k184957k102584k271890k467186k414912k290576
$$ y = [608359635, 606079698, 603805363, 601505339, 599071443, 596420467, 593639135, 590984106, 588441193, 585729420, 582785547, 579812527, 576986909, 574198008, 571257234, 568204522, 565134823, 562104702, 559157431, 556269765, 553404331, 550481975, 547466695, 544469774, 541574419, 538777173, 535987437, 533089697, 530140221, 527194023, 524162114, 521110177, 518182456, 515295506, 512366176, 509463012, 506634116, 503811300, 500917792, 498075366, 495393336, 492694139, 489853054, 487120897, 484657168, 482215852, 479580969, 476721704, 473716885, 470814496, 468170702, 465655237, 463084877, 460461110, 457962364, 455658108, 453323513, 450760394, 448106289, 445565909, 443193197, 441008240, 438905656, 436633766, 434166580, 431751668, 429461092]
3159.4D29461092k247751k199233k154499k134144k083123k019584k007753j994550
3175.7D12620455j944661j912743j925290j948475j930178j852899j770527j750767
3192C97584915j763552j762867j717031j623988j568079j598895j635969j630515j590997
3210.3C82693022j506835j435935j417577j404822j382232j377404j383155j383007
3226.7C71402055j337647j173586j049817j213342j419663j365662j216590j087755
3243C61537993r74953j016647j174927j184940j018256r25749r83864r90123r22144
3261.3C52346390q75413q02100p15404o75679p59631r03904r62258r65178r07212q13425
3281.7C43966186p68959p22766o45519n82814o02335p21693q55744r37253q79437o84678
$$ y = [429461092, 427213341, 425014108, 422859609, 420725465, 418642342, 416622758, 414615005, 412620455, 410675794, 408763051, 406837761, 404889286, 402959108, 401106209, 399335682, 397584915, 395821363, 394058496, 392341465, 390717477, 389149398, 387550503, 385914534, 384284019, 382693022, 381186187, 379750252, 378332675, 376927853, 375545621, 374168217, 372785062, 371402055, 370064408, 368890822, 367841005, 366627663, 365208000, 363842338, 362625748, 361537993, 360563040, 359546393, 358371466, 357186526, 356168270, 355242521, 354258657, 353268534, 352346390, 351470977, 350668877, 349953473, 349277794, 348518163, 347614259, 346652001, 345686823, 344779611, 343966186, 343197227, 342474461, 341828942, 341246128, 340643793, 339922100, 339066356, 338129103, 337249666, 336564988]
3302.1C36564988n45591o33091r07302j149982j178771j049519r70334r64462r20296
3320.5C28245640q22693q18938j003057j128554j075924j019418r25630p97719q82030
3338.8C19771677j094341j163483j126021r87798q27998r57727j229167j249939j076162
3357.2C10059041r59754r96411r96172p75606o89924r93818j320392j276642r62496
3375.5C01087826p96049q70586r53078q81970o96331m43429k28465l46183o82831o96182
3395.9B94492722l05951j12563m99875q81642o61552k95400k24501k91556l99739m32432
3416.3B90387511k94596j97351k09927j08063J32203L08483K63244K11716K96593K15888
3436.7B91005701m4376j08599Q9854L04043L85523M01199N10394N74142N20736O22719
$$ y = [336564988, 336019397, 335386306, 334479004, 333329022, 332150251, 331100732, 330130398, 329165936, 328245640, 327422947, 326604009, 325600952, 324472398, 323396474, 322377056, 321451426, 320653707, 319771677, 318677336, 317513853, 316387832, 315400034, 314572036, 313614309, 312385142, 311135203, 310059041, 309099287, 308102876, 307106704, 306331098, 305641174, 304647356, 303326964, 302050322, 301087826, 300291777, 299421191, 298468113, 297586143, 296889812, 296446383, 296217918, 295871735, 295188904, 294492722, 294186771, 294074208, 293574333, 292692691, 292031139, 291735739, 291511238, 291219682, 290819943, 290387511, 290092915, 289895564, 289685637, 289577574, 289709777, 290018260, 290281504, 290493220, 290789813, 291005701, 290961325, 290852726, 290942580, 291246623, 291632146, 292033345, 292543739, 293117881, 293638617, 294261336]
3457.1B94261336Q31813P87675O95914R12875J053751P21693L22074L83824P26103
3475.5C00697058J014233J020879P52121O93261R01878R01640P95334R35048J133651
3493.8C08845103J182169J077920J018434J046837R25243P52330P83473J004189J253158
3512.2C17888856J232117J012922J012325J253605J482874J351416J014322R30965
3528.5C27179402J070947J293689J504361J465142J293421J431614J697630J683294
3544.8C38619500J414299J298815J407236J513899J646220J870454K089113K157271
3561.1C52016807K003938J931816K398968K744257K453268K273768K526969K851069
3577.5C71200860L074914L220677L193230L050178L067314L281832L282577L294855
$$ y = [294261336, 295093149, 295880824, 296576738, 297489613, 298543364, 299265057, 299587131, 299970955, 300697058, 301711291, 302732170, 303484291, 304177552, 305079430, 305981070, 306776404, 307711452, 308845103, 310027272, 311105192, 312123626, 313170463, 314095706, 314848036, 315631509, 316635698, 317888856, 319120973, 320133895, 321146220, 322399825, 323882699, 325234115, 326248437, 327179402, 328250349, 329544038, 331048399, 332513541, 333806962, 335238576, 336936206, 338619500, 340033799, 341332614, 342739850, 344253749, 345899969, 347770423, 349859536, 352016807, 354020745, 355952561, 358351529, 361095786, 363549054, 365822822, 368349791, 371200860, 374275774, 377496451, 380689681, 383739859, 386807173, 390089005, 393371582, 396666437]
3593.8C96666437L540874L782362L837049L838986L752142L550738L651351L905326
3610.1D26525265L991634M066169L942937L922343M268139M178524L812552L571331
3626.4D58278894L848345M427224M210114L992796L923595L865451L981590M084170
3642.7D90612179L976285L812522M057884M383982L921151L511667L849864L973544
3659E22099078L531038L360868L540158L410757L222883L519475L251791K811611K997815
3677.4E51745474K994001K959967L104091L121316K952874K518594K212763K298593
3693.7E73907673K374828K288759K086580J990258K143264K241016K132833J792073
3710E90957284J552582J855969K022326J886606J676500J496017J389384J444638J689554
$$ y = [396666437, 400207311, 403989673, 407826722, 411665708, 415417850, 418968588, 422619939, 426525265, 430516899, 434583068, 438526005, 442448348, 446716487, 450895011, 454707563, 458278894, 462127239, 466554463, 470764577, 474757373, 478680968, 482546419, 486528009, 490612179, 494588464, 498400986, 502458870, 506842852, 510764003, 514275670, 518125534, 522099078, 525630116, 528990984, 532531142, 535941899, 539164782, 542684257, 545936048, 548747659, 551745474, 554739475, 557699442, 560803533, 563924849, 566877723, 569396317, 571609080, 573907673, 576282501, 578571260, 580657840, 582648098, 584791362, 587032378, 589165211, 590957284, 592509866, 594365835, 596388161, 598274767, 599951267, 601447284, 602836668, 604281306, 605970860]
3728.4F05970860J790225J698434J437664J400114J717984J567066P57217N53370J415074
3746.7F18308008J224875O73175J155913J570523J335799J082182J181662J197398
3763.1F27729535J060665J015126R11594R85861J220882J269757J177431R94801Q62897
3781.4F37228549P53462P32183Q90315J013338J057566J004219R33766R98676P69675
3799.8F45381749O06060R26494P05600N45263R72391J130998P92801O57380R67085
3818.1F52685821O47724M77373Q41558Q29518P30038O82235Q02338R64999N94318J98781
3838.5F59454703M49419O87600P44104Q41558R19580N93841k83241K2590J073838R99510
3858.9F65503502O12199M10259N49853O66737M05074L94225N11169N87821O92904M80712
$$ y = [605970860, 607761085, 609459519, 610897183, 612297297, 614015281, 615582347, 616339564, 616892934, 618308008, 619532883, 620206058, 621361971, 622932494, 624268293, 625350475, 626532137, 627729535, 628790200, 629805326, 630716920, 631702781, 632923663, 634193420, 635370851, 636365652, 637228549, 637982011, 638714194, 639604509, 640617847, 641675413, 642679632, 643613398, 644612074, 645381749, 645987809, 646914303, 647619903, 648165166, 649137557, 650268555, 651061356, 651718736, 652685821, 653333545, 653810918, 654652476, 655481994, 656212032, 656894267, 657696605, 658661604, 659255922, 659454703, 659904122, 660591722, 661335826, 662177384, 663096964, 663690805, 663407564, 663430154, 664503992, 665503502, 666115701, 666525960, 667075813, 667742550, 668147624, 668541849, 669053018, 669640839, 670333743, 670814455]
3879.3F70814455M68671O07073M38094M39048L85463K34723N15759P38919N28097K32757
3899.7F75403059O4253Q9109L90053N56946M64737M65751M64499K37048R9837K42055
3920.1F78477347L03864K44558L35038M23849K59995J52767L07023L76761K97964J99497
3940.5F81378663J36792K42234L69429L26991K60413K59936K48193K27094K37942K16186
3960.9F83903873J77801K06291K50340K79128K95282K19881J19269J72734K64049K85625
3981.3F86174273K89441K22206J55985J90795K21669J95623J68264J70827
3997.6F87789083
$$ y = [670814455, 671283126, 671890199, 672328293, 672767341, 673152804, 673387527, 673903286, 674642205, 675170302, 675403059, 675467312, 675556421, 675946474, 676503420, 676968157, 677433908, 677898407, 678135455, 678235292, 678477347, 678781211, 679025769, 679360807, 679784656, 680044651, 680197418, 680504441, 680881202, 681179166, 681378663, 681515455, 681757689, 682127118, 682454109, 682714522, 682974458, 683222651, 683449745, 683687687, 683903873, 684081674, 684287965, 684538305, 684817433, 685112715, 685332596, 685451865, 685624599, 685888648, 686174273, 686463714, 686685920, 686841905, 687032700, 687254369, 687449992, 687618256, 687789083]
##END=$$ End of the data block
