##TITLE=$$ Begin of the data block
##JCAMP-DX=5.00 $$ ACD/SpecManager v 10.08
##SPECTROMETER/DATA SYSTEM=Alpha
##DATE=29 Dec 2014 15:06:02
##DATA TYPE=INFRARED SPECTRUM
##DATA CLASS=XYDATA
##ORIGIN=
##OWNER=
##NPOINTS=1765
##FIRSTX=399.76428223
##LASTX=3997.64306641
##MAXX=3997.64306641
##MINX=399.76428223
##MAXY=0.83175850
##MINY=0.22439355
##XFACTOR=1.0000000000
##YFACTOR=1.000000000000000e-9
##FIRSTY=0.55815458
##DELTAX=2.03961372
##XUNITS=1/CM
##YUNITS=ARBITRARY UNITS
##XYDATA=(X++(Y..Y))
399.8E58154583n891562n102396l847360j273811J402080K668738K372265J265466
416.1E49748003R3639j234173j686514k002597l090381l950298m346013m149795k908528
434.4E26473343j294791J38938J674116L489017N034149N382776M345894K674341J125872
452.8E49043655m1723m93526n39422j005531k082467l197908l785730l706514l246904
471.2E30943930k892136k787412k704501k284527j488804m91202K91705L17991m07339
489.5E18497705j254737j509964j310766j361013j915693k701163l182352l248214
505.8E02013803l287316l344208l677487m356981m908353n150109m796684l650874
522.1D68841791k363354j604467j134545m20958O50436K132326L971011N491107N948186
$$ y = [558154583, 552263021, 547160625, 543313265, 542039454, 543441534, 546110272, 548482537, 549748003, 549841642, 548607469, 546920955, 544918358, 541827977, 537877679, 533531666, 529381871, 526473343, 525178552, 525317490, 526991606, 530480623, 535514772, 540897548, 545243442, 547917783, 549043655, 549001932, 548508406, 547968984, 546963453, 544880986, 541683078, 537897348, 534190834, 530943930, 528051794, 525264382, 522559881, 520275354, 518786550, 518295348, 518587053, 518905044, 518497705, 517242968, 515733004, 514422238, 513061225, 511145532, 508444369, 505262017, 502013803, 498726487, 495382279, 491704792, 487347811, 482439458, 477289349, 472492665, 468841791, 466478437, 464873970, 463739425, 463318467, 463968903, 466101229, 470072240, 475563347, 481511533]
540.5D81511533N283714L981381K570600J084804m64797j812607k880812l505855l735602
558.9D82032359m232169n315780o609738p771999q116305o860256m212528j191437
575.2D37722147J406461L732144O012768P786035Q392543P587343N732954L561884
591.5D81934279J745403Q07673N24968K11745l02046o72162o24031j00046Q22753J663118
611.9D86011654J966059J949221K265066L168404M209578M785389M487038L550827
628.2E12393236K727091K485335K550543K417564J943708J319527Q36730P76589J159668
646.6E28609991J609445J662671J271010Q70645Q20696J162589J612365J673400J179219
664.9E40472031P10666R10938J424372J885712K328932K112687J362145R57727J191855
$$ y = [481511533, 486795247, 490776628, 493347228, 494432032, 493967235, 492154628, 489273816, 485767961, 482032359, 477800190, 472484410, 465874672, 458102673, 449986368, 443126112, 438913584, 437722147, 439128608, 442860752, 448873520, 456659555, 465052098, 472639441, 478372395, 481934279, 483679682, 484487355, 485012323, 485224068, 484922022, 484249860, 483625829, 483525783, 484348536, 486011654, 487977713, 489926934, 492192000, 495360404, 499569982, 504355371, 508842409, 512393236, 515120327, 517605662, 520156205, 522573769, 524517477, 525837004, 526673734, 527450323, 528609991, 530219436, 531882107, 533153117, 534023762, 534844458, 536007047, 537619412, 539292812, 540472031, 541182697, 542093635, 543518007, 545403719, 547732651, 549845338, 551207483, 552165210, 553357065]
683.3E53357065J589596J608491R57191k09749j309514j896202k101899k341091k874255
701.6E46779633l401280l284037k128363j56343J893282L298819L934563M306078N018174
720E56260526O089509O924450P013321O187081M888356L965080L763974L827691L394901
738.3F02314889K146662L80099j157880k013445k503038l200292m287839n488753o110549
756.7E80079854n585790m177690k612710j269161J39713K107561M648804P207692R184301
775.1E89722574J0093629R677589Q396387P157505O486833O112695N458056M353703
791.4F47458971L352582L224015M085481N102754N248129M316688K870142J748562
807.7F77407324J507342J863122J939595J286387K22087n96344q11219p55787j148880
$$ y = [553357065, 554946661, 556555152, 557512343, 557302594, 555993080, 554096878, 551994979, 549653888, 546779633, 543378353, 540094316, 537965953, 537809610, 539702892, 543001711, 546936274, 551242352, 556260526, 562350035, 569274485, 576287806, 582474887, 587363243, 591328323, 595092297, 598919988, 602314889, 604461551, 604841650, 603683770, 601670325, 599167287, 595966995, 591679156, 586190403, 580079854, 574494064, 570316374, 567703664, 566434503, 566574216, 568681777, 573330581, 580538273, 589722574, 599816203, 609493792, 617890179, 625047684, 631534517, 637647212, 643105268, 647458971, 650811553, 654035568, 658121049, 663223803, 668471932, 672788620, 675658762, 677407324, 678914666, 680777788, 682717383, 684003770, 684225857, 683629513, 682818294, 682062507, 680913627]
826F80913627k358317m032016n413234n908489n591631n054832m859149n060852n226910
844.4F37408197m948258m306555l860474m130423n165160o375074o344318l515602
860.7E98762333J899362P487535J1043430J2524545J2837112J2186825J0449589P700860
877F74891591M132092K85387k932250m859984n512178n493343n523265n812704n983591
895.4F43191755n682826n075097m756272n233467o488859q078397r428799j0211289
911.7E88236749j0626316j0955334j0970175j0048330p866025m940211k288282n56171
928E29985905M68671J373708K432466L660738N011082O195962O492496N015314J564860
946.4E62201202k857208o986916j0370315j3048291j5095949j6609132j7608375j8240034
$$ y = [680913627, 678555310, 674523294, 669110060, 663201571, 657609940, 652555108, 647695959, 642635107, 637408197, 632459939, 628153384, 624292910, 620162487, 614997327, 608622253, 602277935, 598762333, 600661695, 608149230, 619192660, 631717205, 644554317, 656741142, 667190731, 674891591, 679023683, 679309070, 676376820, 671516836, 666004658, 660511315, 654988050, 649175346, 643191755, 637508929, 632433832, 627677560, 622444093, 615955234, 607876837, 598448038, 588236749, 577610433, 566655099, 555684924, 545636594, 537770569, 532830358, 530542076, 529985905, 530454576, 531828284, 534260750, 537921488, 542932570, 549128532, 555621028, 560636342, 562201202, 559343994, 552357078, 541986763, 528938472, 513842523, 497233391, 479625016, 461384982]
962.7D61384982j8860370j9697249k0700961k1584154k2014647k1849662k1088451
977C15589488j9778312j7917007j5490413j2651771r680301o889880m523232k672270
993.3B25986302j299203k93552M53114R19521J019493O79537K1398n95107q84071o91921
1013.7B25315511l1978Q75756J733751K472564L193498L897711M410074M584461M439831
1032B50891179L865629K822042J643419P84785M38243N30094Q93116J513242K629012
1050.4B66010761M372537O406814Q163125R439617J0470301J1454254J1655927R271860
1066.7C37245196L015429n523086j1960238j3006061r527743m784048q80092J870721
1083B96450078L732175N024523O087392P029563P608295P385284O112188M094243K063393
$$ y = [461384982, 442524612, 422827363, 402126402, 380542248, 358527601, 336677939, 315589488, 295811176, 277894169, 262403756, 249751985, 240071684, 233181804, 228658572, 225986302, 224687099, 224393547, 224846661, 225766182, 226785675, 227465212, 227486610, 226891503, 226007432, 225315511, 225283533, 226159289, 227893040, 230365604, 233559102, 237456813, 241866887, 246451348, 250891179, 254756808, 257578850, 259222269, 260007054, 260445297, 260975391, 261868507, 263381749, 266010761, 270383298, 276790112, 284953237, 294392854, 304863155, 316317409, 327973336, 337245196, 340260625, 334737539, 322777301, 309771240, 300243497, 295459449, 294579357, 296450078, 300182253, 305206776, 311294168, 318323731, 325932026, 333317310, 339429498, 343523741, 345587134]
1101.4C45587134Q73655R88752K181739L673523M684478M944444M594773L924787L124505
1119.8C74577790K310962J806319K065152L205686M697204N426794M453808J742363
1136.1D00286078j943677n497575q022904r232939r343743q655876p396728n713999
1152.4C44478637l777742j784444J54018J997501L891527O078959Q566290J1066377
1168.7C70671123J3227880J4757365J5533984J5652806J5443027J5148729J4626622
1183D75061536J3651758J2098581J0011554P734418N707860M137098L004611K198756
1199.3E33606172J670777J553476J954198K778530L799618M736065N284727N327225
1215.6E60710788M938841M152059K984464J536847M6670j147926j861572k142966k161503
$$ y = [345587134, 346460789, 347449541, 349631280, 353304803, 357989281, 362933725, 367528498, 371453285, 374577790, 376888752, 378695071, 380760223, 383965909, 388663113, 394089907, 398543715, 400286078, 398342401, 392844826, 384821922, 375588983, 366245240, 357589364, 350192636, 344478637, 340700895, 338916451, 339070469, 341067970, 344959497, 351038456, 359604746, 370671123, 383899003, 398656368, 414190352, 429843158, 445286185, 460434914, 475061536, 488713294, 500811875, 510823429, 518557847, 524265707, 528402805, 531407416, 533606172, 535276949, 536830425, 538784623, 541563153, 545362771, 550098836, 555383563, 560710788, 565649629, 569801688, 572786152, 574322999, 574369669, 573221743, 571360171, 569217205, 567055702]
1234E67055702k094388k004981j789629j248837l42488O96063J549423K056300K216518
1252.3E66093683K055466J684249J293957R91643Q47578J021981J549184K130509K343058
1270.7E80011308K005160J282156M24444l58760q67188j049996j030027r67920r89974
1289E78459203j182198j568377k024174k333880k428054k402127k372027k418816k451777
1307.4E59277773k232969j778603j371502j189828j267851j603782k228558l213644
1323.7E44391036m466951n599141o196916o123841n429864m244685k837062j468301
1340E08024275l59654L07500N98848N87702L65019R9182k13683n79536q82506j014292
1360.4E06932855r45747o24717k73406o4313K12013O68228J128852J298428J275241
$$ y = [567055702, 564961314, 562956333, 561166704, 559917867, 559575379, 560271442, 561820865, 563877165, 566093683, 568149149, 569833398, 571127355, 572118998, 572966576, 573988557, 575537741, 577668250, 580011308, 582016468, 583298624, 583723068, 583364308, 582497120, 581447124, 580417097, 579449177, 578459203, 577277005, 575708628, 573684454, 571350574, 568922520, 566520393, 564148366, 561729550, 559277773, 557044804, 555266201, 553894699, 552704871, 551437020, 549833238, 547604680, 544391036, 539924085, 534324944, 528128028, 522004187, 516574323, 512329638, 509492576, 508024275, 507664621, 507972121, 508570969, 509158671, 509523690, 509622872, 509409189, 508829653, 507947147, 506932855, 505987108, 505362391, 505088985, 505024672, 505236685, 505904913, 507033765, 508332193, 509607434]
1378.8E09607434J258433J565039K572239M065811M635573L725350K461850J036942
1395.1E30928671l45528j272857j580298j635134j955211k223134k380610k474129
1411.4E17061770k157569j524031j088798q64983l58283K87234Q32141J303911J726091
1429.8E15217483J951695J968920K144515K225638J991689K021015J858830J185536
1446.1E30565321J65284p29382j116156j215160j787961k103984n79834R32872K522886
1464.5E26653886M197240N378425P242381J0326446J0905861R266496Q396328Q166194
1480.8E90533257P907509P040799O473660O425024O046116M967093M627884M888952
1497.1F38910294M245281L356993K987981L429353M190147L025293K038956J954794
$$ y = [509607434, 510865867, 512430906, 515003145, 519068956, 523704529, 527429879, 529891729, 530928671, 530583143, 529310286, 527729988, 526094854, 524139643, 521916509, 519535899, 517061770, 514904201, 513380170, 512291372, 511426389, 511068106, 511355340, 512187481, 513491392, 515217483, 517169178, 519138098, 521282613, 523508251, 525499940, 527520955, 529379785, 530565321, 530730605, 530001223, 528885067, 527669907, 525881946, 523777962, 523198128, 524131000, 526653886, 530851126, 536229551, 543471932, 553798378, 564704239, 573970735, 582367063, 590533257, 598440766, 605481565, 611955225, 618380249, 624426365, 629393458, 634021342, 638910294, 643155575, 646512568, 649500549, 652929902, 657120049, 660145342, 662184298, 664139092]
1513.4F64139092K084076K367139K459407K449393J967609J442671J388908J486241
1529.7F79784536J713336J688957J269698J081646R93609L98874J93239K67565J49727
1548.1F87541187j78933m38512l81231k08974p95603k026260j547515j397073j546026
1566.4F79021060j660883j878679j541555j603424k595663k606452j999557j935303
1582.8F63199544j980245k150119k458751k692520k676070k590299k541959k626717
1599.1F43482864k956450l255665l286124l236591l357530l383994l269792l820121
1615.4F16916597m684448l599465k671242l034174l163577l111302k914787j984477
1631.7E91753125j166820j058996q24034k90811J79827P50244J562297K192855K043724
$$ y = [664139092, 666223168, 668590307, 671049714, 673499107, 675466716, 676909387, 678298295, 679784536, 681497872, 683186829, 684456527, 685538173, 686531782, 686930656, 687123895, 687391460, 687541187, 687362254, 686923742, 686542511, 686333537, 685537934, 683511674, 681964159, 680567086, 679021060, 677360177, 675481498, 673939943, 672336519, 669740856, 667134404, 665134847, 663199544, 661219299, 659069180, 656610429, 653917909, 651241839, 648651540, 646109581, 643482864, 640526414, 637270749, 633984625, 630748034, 627390504, 624006510, 620736718, 616916597, 612232149, 608632684, 605961442, 602927268, 599763691, 596652389, 593737602, 591753125, 590586305, 589527309, 588703275, 588412464, 588592291, 589342535, 590904832, 593097687, 595141411]
1650.1E95141411K478599L398419K795636K764702L491938M192591M194141L705561
1666.4F22162998M140913M927099M662633M948378N333483M725277M459858N194664
1682.7F60555303O622672N623877M490197M453659L970563M081607M296243L877581
1699F97971702L741979K761185K060891J990497J959800K139628K285958K247512K108276
1717.4G19267428J725137J601458J898885K183318K174556K057969J836539J895368
1733.7G34640658K014339J930356K111494K090455J918137K051651K421260K892494
1750G52070844L053665K630115K315998K204359K175748K387345K295971J963615J673639
1768.4G72771299J415551J345098J396656J449823J405597J118898Q12173Q00967J024902
$$ y = [595141411, 597620010, 601018429, 603814065, 606578767, 610070705, 614263296, 618457437, 622162998, 626303911, 631231010, 635893643, 640842021, 646175504, 650900781, 655360639, 660555303, 667177975, 672801852, 677292049, 681745708, 685716271, 689797878, 694094121, 697971702, 701713681, 704474866, 706535757, 708526254, 710486054, 712625682, 714911640, 717159152, 719267428, 720992565, 722594023, 724492908, 726676226, 728850782, 730908751, 732745290, 734640658, 736654997, 738585353, 740696847, 742787302, 744705439, 746757090, 749178350, 752070844, 755124509, 757754624, 760070622, 762274981, 764450729, 766838074, 769134045, 771097660, 772771299, 774186850, 775531948, 776928604, 778378427, 779784024, 780902922, 781715095, 782516062, 783540964]
1786.7G83540964J254201J318157J099050O66976N24223P56681J127660J224816R38654
1805.1G92451382O09338M75526N94020Q52585J018583Q71480N30481L28958M30525
1823.4G98162878P37726R43125Q20636L89874R0838J47819M32849O77347O75619L57449
1843.8H03436160m6790r3638J80423N14447N71192L09646o437r5189J13904M70400
1864.2H05354118O21140L37422q3446j36853J16885M20630N91934M95195K52486Q8334
1884.6H08057845J38223L68655N63621M99785K05934n0843m4822J73151L82900M13955
1905H10708404K04384q4996j56761N2453L07738L66450K02477k7776j07169M5419K63214
1927.5H11773837L51548K48313J9610j61112j17778J22904L35396L26812J65462p569
$$ y = [783540964, 784795165, 786113322, 787212372, 787879348, 788403571, 789160252, 790287912, 791512728, 792451382, 793060720, 793536246, 794130266, 794982851, 796001434, 796872914, 797403395, 797732353, 798162878, 798900604, 799843729, 800664365, 801054239, 801145077, 801292896, 801725745, 802403092, 803078711, 803436160, 803389370, 803295732, 803476155, 803990602, 804561794, 804871440, 804865003, 804769814, 804883718, 805354118, 805975258, 806312680, 806229234, 806092381, 806209266, 806629896, 807221830, 807717025, 807969511, 808057845, 808196068, 808564723, 809128344, 809628129, 809834063, 809783220, 809738398, 809911549, 810294449, 810708404, 810912788, 810827792, 810671031, 810723484, 811031222, 811397672, 811600149, 811572373, 811465204, 811510623, 811773837, 812125385, 812373698, 812393308, 812232196, 812114418, 812237322, 812572718, 812899530, 813064992, 813057423]
1947.9H13057423o1095J04129L46363M38392K85506L8624n4657Q3386K81692L52502
1968.3H14872265K61545P7128q2731o6638J25826K85804K62320Q4042j00374j26302
1988.7H15592885M6432K07722J85311M1545j36257k26915j45912K6047Q0526p3433
2009H15597951l07858m51386m09245k50697k07484l70800o53863p80642m60029o1035
2029.4H11644912K980j45137l56555n17965m95731l09647j41441j17302k11120l16322
2049.8H09036672l28183j77085M4822J58072J01149m0770r2089O56J59263K44975J74642
2072.3H09282124N782r9004l8206R2745J84357J84536R1016j550J1683J13487K22564
2094.7H10049534K74360K10047N9366J2279J30713K52306K76327K08914J02878J3590
$$ y = [813057423, 812996328, 813100457, 813446820, 813885212, 814170718, 814209342, 814154685, 814238071, 814519763, 814872265, 815133810, 815210938, 815128207, 815061569, 815187395, 815473199, 815735519, 815819561, 815719187, 815592885, 815639317, 815847039, 816032350, 816073895, 815937638, 815710723, 815564811, 815590858, 815671384, 815597951, 815290093, 814838707, 814429462, 814178765, 813971281, 813600481, 812946618, 812165976, 811705947, 811644912, 811647892, 811502755, 811146200, 810628235, 810132504, 809822857, 809681416, 809564114, 809352994, 809036672, 808708489, 808531404, 808576226, 808734298, 808835447, 808794677, 808702588, 808703244, 808862507, 809107482, 809282124, 809287906, 809188902, 809150696, 809243441, 809427798, 809612334, 809703350, 809701800, 809713483, 809826970, 810049534, 810323894, 810533941, 810593307, 810605586, 810736299, 810988605, 811264932, 811473846, 811576724, 811590314]
2115.1H11590314m411N1558J19627J27554M0710n4002m3571M0948R9063J06156O4850
2137.5H12138796O676k2889Q703Q2492J16528Q4757L8863M1604R6917J77800K60890
2160H13031137L28124L25501K51233K27451L49343N36204O11126N43237M15563L16561
2180.4H16935480L26872M57227N81145N45323L77536K40922K45094L62217M90368N10156
2200.8H21072340L88265K36451K15471L54052N10037N27680L93033K55942K11179K59459
2221.2H24423909L82304M57168L56555J96993J47283J90378K92658L68298K97546J36197
2241.6H27249289L3021P8856K18153K89977K35915J32621P8499J15335K01642K62261
2262H28895569K37703J85609J64628J52648J81496K41875K34187J60873J12593J04845
$$ y = [811590314, 811585903, 811637461, 811757088, 811884642, 811925352, 811871350, 811827779, 811868727, 811967790, 812073946, 812138796, 812145472, 812122583, 812131286, 812213778, 812330306, 812415063, 812453926, 812495530, 812592447, 812770247, 813031137, 813359261, 813684762, 813935995, 814163446, 814512789, 815048993, 815660119, 816203356, 816618919, 816935480, 817262352, 817719579, 818300724, 818846047, 819223583, 819464505, 819709599, 820071816, 820562184, 821072340, 821460605, 821697056, 821912527, 822266579, 822776616, 823304296, 823697329, 823953271, 824164450, 824423909, 824806213, 825263381, 825619936, 825816929, 825964212, 826154590, 826447248, 826815546, 827113092, 827249289, 827282310, 827361166, 827579319, 827869296, 828105211, 828237832, 828316331, 828431666, 828633308, 828895569, 829133272, 829318881, 829483509, 829636157, 829817653, 830059528, 830293715, 830454588, 830567181, 830672026]
2282.3H30672026J20341J59026J88708J61886Q2731M113j9431K6822R7394J30177N7935
2304.8H31681728m7981o2406n067O8724R7454K6047j19030k03729j30534J788O5684
2327.2H31372678R54j55687k59579k66194k15054j65939j62661j76430j73151j40548
2347.6H29658389j30176j30773r1195j17958k94506l70324k15769o5386m4227j31726
2368H28066349k42591k69115j84834n8472L2723L6061r6858k46107k43307j41561n7458
2390.4H26594830p9692k50816l94821l72351k63512j57714j72078l55005n08249m92275
2410.8H23548317l83973k89798k95639m30167o12318o71625n60940m30405m01199n17726
2431.2H18954527o93440p47442o60837n51224n03540n59568o65963p07924o51896n35727
$$ y = [830672026, 830792367, 830951393, 831140101, 831301987, 831384718, 831388831, 831369400, 831396222, 831493616, 831623793, 831681728, 831633747, 831571341, 831566274, 831634998, 831732452, 831758499, 831639469, 831435740, 831305206, 831306994, 831372678, 831373632, 831217945, 830958366, 830692172, 830477118, 830311179, 830148518, 829972088, 829798937, 829658389, 829528213, 829397440, 829306245, 829188287, 828893781, 828523457, 828307688, 828242302, 828198075, 828066349, 827823758, 827554643, 827369809, 827311337, 827344060, 827380121, 827283263, 827037156, 826793849, 826652288, 826594830, 826515138, 826264322, 825869501, 825497150, 825233638, 825075924, 824903846, 824548841, 824040592, 823548317, 823164344, 822874546, 822578907, 822148740, 821536422, 820864797, 820303857, 819873452, 819472253, 818954527, 818261087, 817513645, 816852808, 816301584, 815798044, 815238476, 814572513, 813864589, 813212693, 812676966]
2451.6H12676966m58002n13255o59287p41721o81877n36501m27783m56869n80728o65248
2472H06955695o30617m89831l67224m05371n49078o34969n97655m52698l05414k87533
2492.4H02235305l88801m78506m66883l55065k42948k28107l31581m69446m68135l23296
2512.8G98482537k10404k58446m20987n50688n69284m82738m02391m38451n60165o89387
2533.2G93899596p70927p45296o45936n86450o21974p12991p40111o57737n64456n60343
2553.6G87293375o42837p43210p81894o99520n75006n64635o38008o77347o87122o75082
2574G80608714o15895n49913n66244o42895o58036o02722n30183m64678m49359n18144
2594.4G75010645n66542m78983l72827l74078m57645n89371p00354p01845o63996o88910
$$ y = [812676966, 812218964, 811705709, 811046422, 810304701, 809622824, 809086323, 808658540, 808201671, 807620943, 806955695, 806325078, 805835247, 805468023, 805062652, 804513574, 803878605, 803280950, 802828252, 802522838, 802235305, 801846504, 801367998, 800901115, 800546050, 800303102, 800074995, 799743414, 799273968, 798805833, 798482537, 798272133, 798013687, 797592700, 797042012, 796472728, 795989990, 795587599, 795149148, 794588983, 793899596, 793128669, 792383373, 791737437, 791150987, 790529013, 789816022, 789075911, 788418174, 787853718, 787293375, 786650538, 785907328, 785125434, 784425914, 783850908, 783286273, 782648265, 781970918, 781283796, 780608714, 779992819, 779442906, 778876662, 778233767, 777575731, 776973009, 776442826, 775978148, 775528789, 775010645, 774444103, 773965120, 773592293, 773218215, 772760570, 772171199, 771470845, 770769000, 770105004, 769416094]
2614.8G69416094p63118q75652j001060j048863r93788r58801j031995j139760j190185
2633.2G60412872j187861j156569j113534j149535j245379j274705j219928j133025
2649.5G50932336j089037j117229j146436j133978j109719j090885j071155j073479
2665.8G42100418j085937j064778j026332r86576r32098r04083r23276r35674r28759
2684.1G33312905r32157r30608r24110r59754j035094j093090j089036j043022j031101
2702.5G24274933j105606j216531j240313j170814j093865j054167j079619j147986
2718.8G15166032j126289r91345r01937q88407q89003r00448q99732q29458p36356
2737.2G07003057p25865p74503q11160q05855p74979p30276o85275o75976o90878o88195
$$ y = [769416094, 768652976, 767777324, 766776264, 765727401, 764733613, 763774812, 762742817, 761603057, 760412872, 759225011, 758068442, 756954908, 755805373, 754559994, 753285289, 752065361, 750932336, 749843299, 748726070, 747579634, 746445656, 745335937, 744245052, 743173897, 742100418, 741014481, 739949703, 738923371, 737936795, 737004697, 736100614, 735177338, 734241664, 733312905, 732380748, 731450140, 730526030, 729566276, 728531182, 727438092, 726349056, 725306034, 724274933, 723169327, 721952796, 720712483, 719541669, 718447804, 717393637, 716314018, 715166032, 714039743, 713048398, 712146461, 711258054, 710369051, 709468603, 708568871, 707739413, 707003057, 706277192, 705502689, 704691529, 703885674, 703110695, 702380419, 701695144, 701019168, 700328290, 699640095]
2757.6F99640095o52849o00398n42581n42522o39259p34747p45416p21216p55548q47221
2778F92858338r35614j000523j045168j068830j107395j215219j363516j452506j457214
2796.3F82212353j459480j533031j652002j759053j856744j928985j970410k010882
2812.6F68041766k040088k101005k214253k301454k364993k441406k524853k636790
2828.9F49416924k733768k781391k835512k927601l100693l318191l497660l698170
2845.3F24523938l914833l973186l805161l494382l126085k844691k792418l014088
2861.6E97559094l476142m062355m641175n095184n371928n574108n741536n667925
2877.9E57928741n254805m593074l760517k900958k150655j522422j018286o88612
$$ y = [699640095, 698987246, 698386848, 697844267, 697301745, 696662486, 695927739, 695182323, 694461107, 693705559, 692858338, 691922724, 690922201, 689877033, 688808203, 687700808, 686485589, 685122073, 683669567, 682212353, 680752873, 679219842, 677567840, 675808787, 673952043, 672023058, 670052648, 668041766, 666001678, 663900673, 661686420, 659384966, 657019973, 654578567, 652053714, 649416924, 646683156, 643901765, 641066253, 638138652, 635037959, 631719768, 628222108, 624523938, 620609105, 616635919, 612830758, 609336376, 606210291, 603365600, 600573182, 597559094, 594082952, 590020597, 585379422, 580284238, 574912310, 569338202, 563596666, 557928741, 552673936, 548080862, 544320345, 541419387, 539268732, 537746310, 536728024, 536039412]
2894.2E36039412n66125o31034p99775r95458j217067j499295j882196k373993k915323
2912.6E23159146l435909l891767m198551m233241l949165l422976k686768j731575
2928.9D95609194o47306N57601J904249L232688M346907N173206N692780N953312O102205
2947.2E27924836O230116O294250O242395O132483O041408N905151N607963N153000
2963.6E75531602M681945M275501L923296L732682L687679L620625L561258L480673
2979.9F06495261L221214K876937K604723K370894K148390J878262J517117J203179
2996.2F24315977R30011O09696L02077J7702k58684m97460p11739r81629j297236j560807
3016.6F20867908j761973j910567k009452k129793k252221k283335k269148k307237
$$ y = [536039412, 535473287, 534842253, 534042478, 533047020, 531829953, 530330658, 528448462, 526074469, 523159146, 519723237, 515831470, 511632919, 507399678, 503450513, 500027537, 497340769, 495609194, 494961888, 495519489, 497423738, 500656426, 505003333, 510176539, 515869319, 521822631, 527924836, 534154952, 540449202, 546691597, 552824080, 558865488, 564770639, 570378602, 575531602, 580213547, 584489048, 588412344, 592145026, 595832705, 599453330, 603014588, 606495261, 609716475, 612593412, 615198135, 617569029, 619717419, 621595681, 623112798, 624315977, 625245988, 625855684, 626157761, 626175463, 625916779, 625419319, 624707580, 623725951, 622428715, 620867908, 619105935, 617195368, 615185916, 613056123, 610803902, 608520567, 606251419, 603944182]
3032.9F03944182k484321k653539k601803k544164k676487k873838k956510k855718
3049.2E82297802k770424k837181k940178l029346l017426k877176k781152k771557
3065.5E59273362k870977l039002l058851k901494k731204k706409k867520l035307
3081.9E36062598l055930l006220k932012k898872k993285l033102k919614k827525
3098.2E12396038k878964k984107k953946k791524k726406k827347k789616k591819
3114.5D89852309k576768k748519k950430l063739k963394k761840k671957k717138
3130.8D67398524k767473k679289k482712k438932k634436k770186k674907k526969
3147.1D46423620k410382k313674k395033k604187k642363k517820k398491k311080
$$ y = [603944182, 601459861, 598806322, 596204519, 593660355, 590983868, 588110030, 585153520, 582297802, 579527378, 576690197, 573750019, 570720673, 567703247, 564826071, 562044919, 559273362, 556402385, 553363383, 550304532, 547403038, 544671834, 541965425, 539097905, 536062598, 533006668, 530000448, 527068436, 524169564, 521176279, 518143177, 515223563, 512396038, 509517074, 506532967, 503579021, 500787497, 498061091, 495233744, 492444128, 489852309, 487275541, 484527022, 481576592, 478512853, 475549459, 472787619, 470115662, 467398524, 464631051, 461951762, 459469050, 457030118, 454395682, 451625496, 448950589, 446423620, 444013238, 441699564, 439304531, 436700344, 434057981, 431540161, 429141670, 426830590]
3163.4D26830590k259344k277553k304673k257616k164185k117753k160877k166420
3179.8D09122169k097219k036840j994878j967728j954764j968652j973123j928746
3196.1C93200219j873195j817614j770348j747280j723617j716078j690954j621097
3212.4C79240036j572996j562208j560420j538932j516283j504391j467526j386017
3228.7C67131263j258075j215697j394897j537889j435161j286835j182854j101315
3245C56718540j136511j251370j245737j091421r90718j069189j136302j056463r80884
3263.4C46759945r35346q01176o77049q08805j033872j050711r64433r10163q83996
3281.7C38694394q72493q36939p55906o52790o44326p67946q91358r70364r32455p16835
$$ y = [426830590, 424571246, 422293693, 419989020, 417731404, 415567219, 413449466, 411288589, 409122169, 407024950, 404988110, 402993232, 401025504, 399070740, 397102088, 395128965, 393200219, 391327024, 389509410, 387739062, 385991782, 384268165, 382552087, 380861133, 379240036, 377667040, 376104832, 374544412, 373005480, 371489197, 369984806, 368517280, 367131263, 365873188, 364657491, 363262594, 361724705, 360289544, 359002709, 357819855, 356718540, 355582029, 354330659, 353084922, 351993501, 351002783, 349933594, 348797292, 347740829, 346759945, 345824599, 345023423, 344346374, 343537569, 342503697, 341452986, 340488553, 339578390, 338694394, 337821901, 336984962, 336229056, 335576266, 334931940, 334163994, 333272636, 332302272, 331369817, 330652982]
3302.1C30652982n50866o62655r67979j204908j193732j031578r36091r09388q84980
3320.5C22310805q33898q27253j000703j151979j071840r31233q30442p68632q85576
3338.8C14009249j057952j073868j060843r87381q04335q53687j145572j242131j046776
3357.2C04736704q47519q62449r23902p51793o21796q88854j236856j182407q80599
3375.5B96540529p62940p89732p96169p53402o26386l86446j58936k68877o45101p00474
3395.9B90652066k94238m4942l67224p31796n88000l03745k22027k76357m09872l88264
3416.3B87025601j58519n7667j06216m0769J44064K62797K45392L32028M40717K13742
3436.7B88301170j35094j33097J89692M62591M91709M13030M79132N86420O36399P61092
$$ y = [330652982, 330102116, 329439461, 328471482, 327266574, 326072842, 325041264, 324105173, 323195785, 322310805, 321476907, 320649654, 319648951, 318496972, 317425132, 316493899, 315663457, 314894825, 314009249, 312951297, 311877429, 310816586, 309829205, 309024870, 308171183, 307025611, 305783480, 304736704, 303889185, 303026736, 302102834, 301351041, 300729245, 299840391, 298603535, 297421128, 296540529, 295777589, 294987857, 294191688, 293438286, 292811900, 292425454, 292266518, 291997641, 291352540, 290652066, 290357828, 290312886, 289945662, 289213866, 288625866, 288322121, 288100094, 287823737, 287413865, 287025601, 286867082, 286809415, 286703199, 286662430, 286806494, 287069291, 287314683, 287646711, 288087428, 288301170, 288166076, 288032979, 288222671, 288685262, 289176971, 289590001, 290069133, 290655553, 291291952, 292053044]
3457.1B92053044Q53181P07984P05808J082063J225203Q42005M36157M74572P78020
3475.5B99158037J043439J045942Q15630Q22395J025170R88662Q78036R90749J156896
3493.8C07924956J208603J137913J112193J146882J027763Q85874R67056J180917J359433
3512.2C17951590J297891J085758J119852J366377J538098J407385J150042J087039
3528.5C28004032J230747J467705J649558J569718J386673J590460J889080J768321
3544.8C40556294J424908J440466J738280J893133J964479K128393K313375K356410
3561.1C55815738K207965K152592K609164L036439K884835K731025K910227L169298
3577.5C77517283L366411L516733L536344L389656L299237L520697L619462L623128
$$ y = [292053044, 292906225, 293614209, 294320017, 295402080, 296627283, 297469288, 297905445, 298380017, 299158037, 300201476, 301247418, 302063048, 302885443, 303910613, 304899275, 305777311, 306768060, 307924956, 309133559, 310271472, 311383665, 312530547, 313558310, 314444184, 315411240, 316592157, 317951590, 319249481, 320335239, 321455091, 322821468, 324359566, 325766951, 326916993, 328004032, 329234779, 330702484, 332352042, 333921760, 335308433, 336898893, 338787973, 340556294, 341981202, 343421668, 345159948, 347053081, 349017560, 351145953, 353459328, 355815738, 358023703, 360176295, 362785459, 365821898, 368706733, 371437758, 374347985, 377517283, 380883694, 384400427, 387936771, 391326427, 394625664, 398146361, 401765823, 405388951]
3593.8D05388951L851772M114210M124373M062504L997535L851741L962964M195064
3610.1D37549114M250318M259020M078657M082650M514068M444569M025787L764123
3626.4D70968306L990054M541606M408657M255444M247129M136056M068047M041016
3642.7E04656315L938973L840565M054368M332900M050195L804148M057705M087210
3659E36822379L690838L452421L450095L281415L127992L344893L151179K894699L171325
3677.4E66387236L155708L010631L042460K987623K795160K461075K273977K346277
3693.7E88460147K343893K207458K040327J987279K114236K141595J924395J668871
3710F04888201J710117J993179J942217J671732J474738J451611J478434J538277J737475
$$ y = [405388951, 409240723, 413354933, 417479306, 421541810, 425539345, 429391086, 433354050, 437549114, 441799432, 446058452, 450137109, 454219759, 458733827, 463178396, 467204183, 470968306, 474958360, 479499966, 483908623, 488164067, 492411196, 496547252, 500615299, 504656315, 508595288, 512435853, 516490221, 520823121, 524873316, 528677464, 532735169, 536822379, 540513217, 543965638, 547415733, 550697148, 553825140, 557170033, 560321212, 563215911, 566387236, 569542944, 572553575, 575596035, 578583658, 581378818, 583839893, 586113870, 588460147, 590804040, 593011498, 595051825, 597039104, 599153340, 601294935, 603219330, 604888201, 606598318, 608591497, 610533714, 612205446, 613680184, 615131795, 616610229, 618148506, 619885981]
3728.4F19885981J707316J443564J266063J395821J581490J350642P45654O72578J365602
3746.7F31414711J172126P41303J242161J623451J406908J141608J124621J109600
3763.1F40976489J048445J055181R27031R00030J091362J169502J112283R52005Q23498
3781.4F50055826P68602Q17120R49680R82523R50635Q76248P85470P81834O31392N68569
3801.8F58167899Q55386P86841P33971R53854R72271P52627O62923Q11577N39243M29213
3822.2F65665805P74861Q06093P28249P13885P88749R08017O26504J99497L36289O34432
3842.6F72182381P82490Q01265O62029K70307k52604L05116J095354R25422N61357
3861F77333117L44038M56213N68033L54409L70443N52714O53386O69718M73320M79996
$$ y = [619885981, 621593297, 623036861, 624302924, 625698745, 627280235, 628630877, 629376531, 630049109, 631414711, 632586837, 633328140, 634570301, 636193752, 637600660, 638742268, 639866889, 640976489, 642024934, 643080115, 644007146, 644907176, 645998538, 647168040, 648280323, 649232328, 650055826, 650824428, 651641548, 652591228, 653573751, 654524386, 655400634, 656186104, 656967938, 657599330, 658167899, 659023285, 659810126, 660544097, 661497951, 662470222, 663222849, 663885772, 664697349, 665236592, 665665805, 666440666, 667246759, 667975008, 668688893, 669477642, 670385659, 671012163, 671211660, 671547949, 672182381, 672964871, 673766136, 674428165, 674698472, 674445868, 674750984, 675846338, 676771760, 677333117, 677677155, 678133368, 678701401, 679055810, 679426253, 679978967, 680632353, 681302071, 681775391, 682255387]
3881.4F82255387N34058L49939L97205M01497K31504L63350N69582M87209K62379J57953
3901.8F86010063J83761L28481M62353M51923M30524L63052J87755J29997K51770K75374
3922.1F89075053K05874K59102L32892K61127K48313L76881L47435J98960J49370J96457
3942.5F91651464K87473L03983K66016K72453K24232J61827K04980K73169K70664J93358
3962.9F94109619J47164K19941K89976K96533K50221J42872Q1897J16110K62141L68297
3983.3F96284771K59936J00314M3869R9123K08378K62499K33233
3997.6F97492123
$$ y = [682255387, 682789445, 683139384, 683536589, 683938086, 684169590, 684532940, 685102522, 685589731, 685852110, 686010063, 686193824, 686522305, 686984658, 687436581, 687867105, 688230157, 688417912, 688547909, 688799679, 689075053, 689280927, 689540029, 689872921, 690134048, 690382361, 690759242, 691106677, 691305637, 691455007, 691651464, 691938937, 692242920, 692508936, 692781389, 693005621, 693167448, 693372428, 693645597, 693916261, 694109619, 694256783, 694476724, 694766700, 695063233, 695313454, 695456326, 695538223, 695654333, 695916474, 696284771, 696544707, 696645021, 696688890, 696788013, 696996391, 697258890, 697492123]
##END=$$ End of the data block
