##TITLE=$$ Begin of the data block
##JCAMP-DX=5.00 $$ ACD/SpecManager v 10.08
##SPECTROMETER/DATA SYSTEM=Alpha
##DATE=29 Dec 2014 15:06:02
##DATA TYPE=INFRARED SPECTRUM
##DATA CLASS=XYDATA
##ORIGIN=
##OWNER=
##NPOINTS=1765
##FIRSTX=399.76428223
##LASTX=3997.64306641
##MAXX=3997.64306641
##MINX=399.76428223
##MAXY=0.83288163
##MINY=0.22459635
##XFACTOR=1.0000000000
##YFACTOR=1.000000000000000e-9
##FIRSTY=0.55933142
##DELTAX=2.03961372
##XUNITS=1/CM
##YUNITS=ARBITRARY UNITS
##XYDATA=(X++(Y..Y))
399.8E59331417o058097n402326l836990j240313J104355K132654K067685J361370
416.1E49459755L35098q79586j497567k051592l120303l814935l880144l553688k753377
434.4E28243661j728535n10931J375258L515482M891813N231678M444421K785206J137733
452.8E49385786J69218k42353o79076j129627j997411l177643l934324l827154l163517
471.2E31403899k951383l031433k808750k384305j703083n77212N02170N73456l03447
489.5E18719912j206696j609445j568437j401126j628637k558113l355085l258467
505.8E02133906l095836l221333l528177m260511n087852n359232m767597l542781
522.1D69270587k347648j679689j197696m55647O95496K346606M118263N386085N774885
$$ y = [559331417, 553273320, 547870994, 544034004, 542793691, 543898046, 546030700, 548098385, 549459755, 549794853, 548915267, 547417700, 545366108, 542245805, 538430870, 534550726, 530997038, 528243661, 526515126, 526004195, 527379453, 530894935, 535786748, 541018426, 545462847, 548248053, 549385786, 549555004, 549312651, 548633575, 547503948, 545506537, 542328894, 538394570, 534567416, 531403899, 528452516, 525421083, 522612333, 520228028, 518524945, 517947733, 518449903, 519023359, 518719912, 517513216, 515903771, 514335334, 512934208, 511305571, 508747458, 505392373, 502133906, 499038070, 495816737, 492288560, 488028049, 482940197, 477580965, 472813368, 469270587, 466922939, 465243250, 464045554, 463589907, 464285403, 466632009, 470750272, 476136357, 481911242]
540.5D81911242N277574M113913K627343J078277m91261j918048k900094l340989l632992
558.9D82724965m327119n452662o732256p914930q173108o755501m028231j021713
575.2D38319445J440256L550828N804896P764817Q480101P636399N756020L607929
591.5D82360691J829713Q98570N01216O7621l83645o39200n77480n7340Q67606J662522
611.9D86530274J961172K030790K409845L277660M172980M643798M411638L531516
628.2E12969673K692520K431393K460778K397775K097369J477778Q42213P34329J132787
646.6E29236615J602053J769841J379073P87317P11501J148284J557469J622438J259387
664.9E41073978Q40425Q67844J344204J900792K333105K125859J388311Q90732J102865
$$ y = [481911242, 487188816, 491302729, 493930072, 495008349, 494517088, 492599040, 489698946, 486357957, 482724965, 478397846, 472945184, 466212928, 458297998, 450124890, 443369389, 439341158, 438319445, 439759701, 443310529, 449115425, 456880242, 465360343, 472996742, 478752762, 482360691, 484190404, 485088974, 485590190, 485657811, 485274166, 484634966, 484057486, 484000146, 484867752, 486530274, 488491446, 490522236, 492932081, 496209741, 500382721, 505026519, 509438157, 512969673, 515662193, 518093586, 520554364, 522952139, 525049508, 526527286, 527369499, 528103828, 529236615, 530838668, 532608509, 533987582, 534774899, 535486400, 536634684, 538192153, 539814591, 541073978, 541914403, 542782247, 544126451, 546027243, 548360348, 550486207, 551874518, 552765250, 553868115]
683.3E53868115J628756J725436J017689k47299j380146j893461k045273k318859k870799
701.6E47484159l430247l381908k196252j34409J922846L323198L996849M325747M972577
720E56882560O073058O954431P073105O266177M990458M061520L777862L763437L320992
738.3F03163600K109885L69191j190066k103388k605737l238022m275739n432725o017685
756.7E80779314n564868m257977k671779j256466J49847K074003M594862P188797R257555
775.1E90293288J0244429R759248Q317172P048369O478846O171941N473435M356921
791.4F48143649L440738L270745L971100M994869N259156M294217K796292J775563
807.7F77946329J621843J916885J851976J180112K24650n67138p94292p13527j151085
$$ y = [553868115, 555496871, 557222307, 558239996, 557992697, 556612551, 554719090, 552673817, 550354958, 547484159, 544053912, 540672004, 538475752, 538341343, 540264189, 543587387, 547584236, 551909983, 556882560, 562955618, 569910049, 576983154, 583249331, 588239789, 592301309, 596079171, 599842608, 603163600, 605273485, 605642676, 604452610, 602349222, 599743485, 596505463, 592229724, 586796999, 580779314, 575214446, 570956469, 568284690, 567028224, 567178071, 569252074, 573846936, 581035733, 590293288, 600537717, 610296965, 618614137, 625662506, 632141352, 638313293, 643786728, 648143649, 651584387, 654855132, 658826232, 663821101, 669080257, 673374474, 676170766, 677946329, 679568172, 681485057, 683337033, 684517145, 684741795, 684174657, 683380365, 682666838, 681515753]
826F81515753k407908m075647n444467n938708n650402n111455m881442n021393n133987
844.4F37850344m923701m390359l947616m159689n167782o337464o266474l465355
860.7E99191904J903296P469356J1059045J2559653J2816787J2129485J0376394P619500
877F75125420M068911K48909k923310m841447n523920n538761n589962n841673n990564
895.4F43193603n720079n106688m717171n168676o533564q195400r469449j0193825
911.7E88088751j0618150j0943175j0953128j0022640p827163m920423k286315n42224
928E29975533M93706J363754K381086L650487N026042O157518O456494N032837J582504
946.4E62119961k916873p105291j0412871j3006449j5087068j6633392j7601192j8202811
$$ y = [681515753, 679107845, 675032198, 669587731, 663649023, 657998621, 652887166, 648005724, 642984331, 637850344, 632926643, 628536284, 624588668, 620428979, 615261197, 608923733, 602657259, 599191904, 601095200, 608564556, 619623601, 632183254, 645000041, 657129526, 667505920, 675125420, 679194331, 679443240, 676519930, 671678483, 666154563, 660615802, 655025840, 649184167, 643193603, 637473524, 632366836, 627649665, 622480989, 615947425, 607752025, 598282576, 588088751, 577470601, 566527426, 555574298, 545551658, 537724495, 532804072, 530517757, 529975533, 530469239, 531832993, 534214079, 537864566, 542890608, 549048126, 555504620, 560537457, 562119961, 559203088, 552097797, 541684926, 528678477, 513591409, 496958017, 479356825, 461154014]
962.7D61154014j8823773j9678801k0712316k1622896k2029519k1824003k1085202
977C15377504j9776434j7855823j5421182j2621120r655729o833702m454851k629146
993.3B26129517j262143k71023M16980Q41036R57444O89805P4699o06700r49234o99878
1013.7B25320503J237Q93548J774877K536044L212601L859758M379273M598468M446209
1032B51022518L843099K826064J675398Q14884M67986N40704Q74966J495689K634794
1050.4B66196102M386842O408036Q146733R408027J0453492J1471480J1664629R250164
1066.7C37385505L007234n503804j1928916j2989372r549200m796565q73297J860350
1083B96611935L722399N011678O075829P052511P624478P362157O094932M120946K117902
$$ y = [461154014, 442330241, 422651440, 401939124, 380316228, 358286709, 336462706, 315377504, 295601070, 277745247, 262324065, 249702945, 240047216, 233213514, 228758663, 226129517, 224867374, 224596351, 225013331, 225854367, 226811811, 227501616, 227576315, 226969615, 226020381, 225320503, 225321740, 226215288, 227990165, 230526209, 233738810, 237598568, 241977841, 246576309, 251022518, 254865617, 257691681, 259367079, 260181963, 260649949, 261190653, 262065619, 263561308, 266196102, 270582944, 276990980, 285137713, 294545740, 304999232, 316470712, 328135341, 337385505, 340392739, 334888935, 322960019, 309970647, 300421447, 295624882, 294751585, 296611935, 300334334, 305346012, 311421841, 318474352, 326098830, 333460987, 339555919, 343676865, 345794767]
1101.4C45794767R09180J001566K187133L657967M651070M911959M593640L949404
1117.7C71656686L131032K308071J809299K080768L245086M716217N393446M387497
1134C98728102J666218j982361n483031q001655r229154r339898q631230p379114n721361
1152.4C44626516l753722j717865J91927J988113L890663O087899Q561731J1072963
1168.7C70948225J3256312J4779716J5509695J5608847J5427977J5123636J4579028
1183D75233436J3634562J2123406J0056198P769584N709887M114747K965033K154708
1199.3E33761561J681745J632035K003729K757967L779471M740774N291403N323410
1215.6E60972095M923462M138768K960384J492679J9372j138330j853645k164840k179981
$$ y = [345794767, 346703947, 347705513, 349892646, 353550613, 358201683, 363113642, 367707282, 371656686, 374787718, 377095789, 378905088, 380985856, 384230942, 388947159, 394340605, 398728102, 400394320, 398411959, 392928928, 384927273, 375698119, 366358221, 357726991, 350347877, 344626516, 340872794, 339154929, 339346856, 341334969, 345225632, 351313531, 359875262, 370948225, 384204537, 398984253, 414493948, 430102795, 445530772, 460654408, 475233436, 488867998, 500991404, 511047602, 518817186, 524527073, 528641820, 531606853, 533761561, 535443306, 537075341, 539079070, 541837037, 545616508, 550357282, 555648685, 560972095, 565895557, 570034325, 572994709, 574487388, 574506760, 573368430, 571514785, 569349945, 567169964]
1234E67169964k077818j955211j731395j240433l98695O62029J602411K133787K230882
1252.3E66395521K039671J695097J289785R53197Q34227J033842J541972K126575K362966
1270.7E80272853K015710J273990M24147l58582q83341j044452r90689r43839j004696
1289E78761101j212120j577080k001941k327084k465487k428472k334058k366364k456963
1307.4E59591532k264679j770377j337588j168132j256644j627922k299011l262043
1323.7E44605136m451990n565405o173551o083250n378187m220605k837598j491547
1340E08403003l85046L12865N93841N67317L64721J08063k07841n81086q76605r85742
1360.4E07313490r41336o79136l27229p3612K26617O84083J151740J300633J236796
$$ y = [567169964, 565092146, 563136935, 561405540, 560165107, 559766412, 560428441, 562030852, 564164639, 566395521, 568435192, 570130289, 571420074, 572373271, 573207498, 574241340, 575783312, 577909887, 580272853, 582288563, 583562553, 583986700, 583628118, 582744777, 581700325, 580709636, 579765797, 578761101, 577548981, 575971901, 573969960, 571642876, 569177389, 566748917, 564414859, 562048495, 559591532, 557326853, 555556476, 554218888, 553050756, 551794112, 550166190, 547867179, 544605136, 540153146, 534587741, 528414190, 522330940, 516952753, 512732148, 509894550, 508403003, 508017957, 508330822, 508924663, 509491980, 509856701, 509964764, 509756923, 509175837, 508299232, 507313490, 506372154, 505693018, 505365789, 505292177, 505518794, 506202877, 507354617, 508655250, 509892046]
1378.8E09892046J234770J573146K581834M065276M608869L679335K439797J052261
1395.1E31127334l17395j236022j564681j652181j986683k256095k388835k457917
1411.4E17267525k133906j500666j072943q37028l04580K95520P86126J310229J775682
1429.8E15585959J944065J930893K134799K243162J997828J994610J841664J222909
1446.1E30895889K20895p16031j126945j199603j738429k104461o25909R41038K568782
1464.5E27115226M216552N390882P281423J0351717J0847271R191393Q385063Q182645
1480.8E90962172P907629P045924O491006O440639O044030M958868M653514M921794
1497.1F39425576M234433L345549L039002L551841M226387K904892J970291J987517
$$ y = [509892046, 511126816, 512699962, 515281796, 519347072, 523955941, 527635276, 530075073, 531127334, 530809939, 529573917, 528009236, 526357055, 524370372, 522114277, 519725442, 517267525, 515133619, 513632953, 512560010, 511722982, 511418402, 511713922, 512500048, 513810277, 515585959, 517530024, 519460917, 521595716, 523838878, 525836706, 527831316, 529672980, 530895889, 531116784, 530400753, 529273808, 528074205, 526335776, 524231315, 523605406, 524546444, 527115226, 531331778, 536722660, 544004083, 554355800, 565203071, 574394464, 582779527, 590962172, 598869801, 605915725, 612406731, 618847370, 624891400, 629850268, 634503782, 639425576, 643660009, 647005558, 650044560, 653596401, 657822788, 660727680, 662697971, 664685488]
1513.4F64685488K172053K429843K479851K447247J941264J419663J350582J425862
1529.7F80351853J677156J712441J357854J230597J111329L07798P6413K28882J40250
1548.1F88194573j67847m05311l36826j33395p38025k149880j674891j446545j532972
1566.4F79608881j621067j895309j566886j589716k612889k668321k027511j918793
1582.8F63708389j969874k158642k462089k704144k697885k605736k555907k631187
1599.1F43922925k938986l245056l313481l248692l315627l363312l281533l809393
1615.4F17406845m681051l603756k664507l057122l167271l073693k896070j955986
1631.7E92307389j085460j007677q91983l38376K04742Q17538J647591K229572K071797
$$ y = [664685488, 666857541, 669287384, 671767235, 674214482, 676155746, 677575409, 678925991, 680351853, 682029009, 683741450, 685099304, 686329901, 687441230, 687749028, 687825441, 688054323, 688194573, 688026726, 687621415, 687284589, 687151194, 686413169, 684263289, 682588398, 681141853, 679608881, 677987814, 676092505, 674525619, 672935903, 670323014, 667654693, 665627182, 663708389, 661738515, 659579873, 657117784, 654413640, 651715755, 649110019, 646554112, 643922925, 640983939, 637738883, 634425402, 631176710, 627861083, 624497771, 621216238, 617406845, 612725794, 609122038, 606457531, 603400409, 600233138, 597159445, 594263375, 592307389, 591221929, 590214252, 589322269, 588983893, 589188635, 590006173, 591653764, 593883336, 595955133]
1650.1E95955133K549589L365576K711237K770781L543437M249990M241109L731251
1666.4F23118103M149138M914940M655719M953742N331278M732012M495681N255520
1682.7F61606133O640375N584538M449427M393875L936887M099906M318356L887773
1699F98917270L729880K749502K060712J977920J943171K122343K285659K279401K102435
1717.4G20168293J636505J530587J897931K222300K201259K076507J881122J911641
1733.7G35526145J946926J903057K137720K096474J909078K055049K449750K917111
1750G52941310L017247K580345K296328K191544K166033K387464K290547J963436J722336
1768.4G73556590J503229J351834J314997J406431J413167J138151Q14914P81715J014173
$$ y = [595955133, 598504722, 601870298, 604581535, 607352316, 610895753, 615145743, 619386852, 623118103, 627267241, 632182181, 636837900, 641791642, 647122920, 651854932, 656350613, 661606133, 668246508, 673831046, 678280473, 682674348, 686611235, 690711141, 695029497, 698917270, 702647150, 705396652, 707457364, 709435284, 711378455, 713500798, 715786457, 718065858, 720168293, 721804798, 723335385, 725233316, 727455616, 729656875, 731733382, 733614504, 735526145, 737473071, 739376128, 741513848, 743610322, 745519400, 747574449, 750024199, 752941310, 755958557, 758538902, 760835230, 763026774, 765192807, 767580271, 769870818, 771834254, 773556590, 775059819, 776411653, 777726650, 779133081, 780546248, 781684399, 782499313, 783281028, 784295201]
1786.7G84295201J294494J385748J094759O16848N34654P88152J097262J171887R30011
1805.1G93209016O24836M83990N81324Q19087J008987Q94487N29170L07024M42683
1823.4G98900604P73192R66012Q17836L56674N6505J32024M45128P19726P20739L60012
1843.8H04248452q7619j22487J63436M96566N70476L20077j9848j10388J38998N00381
1864.2H06098044O40869L66032p6234j70469O9975L89517N89132N08666K56240Q0646
1884.6H08752418J55985M18842N84662M75824J89721n2154n7757J59979L87132M22120
1905H11436772K20836p0692j97470j3232L07918M28140K52187j4722j42396j8716K32935
1927.5H12421560L63469K82765O7413j08421q9944J08898L15428L11792J31368n1975
$$ y = [784295201, 785589695, 786975443, 788070202, 788687050, 789221704, 790009856, 791107118, 792279005, 793209016, 793833852, 794317842, 794899166, 795718253, 796727240, 797621727, 798150897, 798457921, 798900604, 799673796, 800639808, 801457644, 801814318, 801870823, 802002847, 802447975, 803167701, 803888440, 804248452, 804160833, 804038346, 804201782, 804698348, 805268824, 805588901, 805569053, 805458665, 805597663, 806098044, 806738913, 807104945, 807028711, 806858242, 806928217, 807317734, 807906866, 808415532, 808671772, 808752418, 808908403, 809327245, 809911907, 810387731, 810577452, 810525298, 810467541, 810627520, 811014652, 811436772, 811657608, 811586916, 811389446, 811376214, 811684132, 812112272, 812364459, 812349737, 812207341, 812188625, 812421560, 812785029, 813067794, 813135207, 813026786, 812936842, 813045740, 813361168, 813672960, 813804328, 813752353]
1947.9H13752353p9095J20520L70562M49539K84254M2498l9041R3699K78950L42190
1968.3H15616429K28107M2677p8976m6432J49905L15786K75492O3479j24633j17242
1988.7H16324592N2571J91212J90436O7890j32084k40504j42515M2200Q6605q1896
2009H16358507l10779m14729l51965k47777k50995m01378o71089p90417m63903n9306
2029.4H12396169J8596j25885l46005m98294m80891l40461j67311q7082j84357l28064
2049.8H09856415l23057j45376O7651J80662J13606o7115j31249j1027J71483K57194
2070.2H09969187J64747k4915j21474m6372R9480K03192J93596Q7559q34K6703J34706
2092.7H10685575K33054K60711J99854Q7083L2186J11222K28942K68400K15113J11580
$$ y = [813752353, 813673258, 813793778, 814164340, 814613879, 814898133, 814940631, 814901590, 814995289, 815274239, 815616429, 815844536, 815887213, 815808237, 815761805, 815911710, 816227496, 816502988, 816566467, 816441834, 816324592, 816377163, 816568375, 816758811, 816826701, 816694617, 816454113, 816311598, 816353798, 816440403, 816358507, 816047728, 815632999, 815281034, 815033257, 814782262, 814380884, 813709795, 812919378, 812455475, 812396169, 812414765, 812288880, 811942875, 811444581, 810963690, 810623229, 810455918, 810368836, 810184479, 809856415, 809533358, 809387982, 809455633, 809636295, 809749901, 809682786, 809551537, 809540510, 809711993, 809969187, 810133934, 810109019, 809987545, 809941173, 810040653, 810243845, 810437441, 810525000, 810524166, 810550869, 810685575, 810918629, 811179340, 811379194, 811466277, 811498463, 811609685, 811838627, 812107027, 812322140, 812433720]
2113.1H12433720J5139O676Q3744J52767J31309J6451q7559o8545M7028J29759J41621
2135.5H13002110P9691j6332n6505r417Q9526J40845J04785N9605N0068O9618J60694
2157.9H13674688K82228L43979L13937K25187K13563L59953N52714O16908N31852M00722
2178.3H17515731L12924L40760M83930N77808N11050L68058K63989K70665L69489M73321
2198.7H21487725M85658L81530K46823K37524L76046M92990TL93689K68697K16782
2219.1H25080454K93017M29392M69923L34501J42395Q5950J83642L29256L93331K96772
2239.5H28038633J15991K8252J19031K67863K99930K20061J16229M5359Q1241J98007
2259.9H29530597K80261K60770J90795J55627J67013K05338K57849K53320J56939Q1897
$$ y = [812433720, 812448859, 812455535, 812539279, 812692046, 812823355, 812839806, 812752247, 812683702, 812730730, 812860489, 813002110, 813081801, 813065469, 813008964, 812999547, 813089073, 813229918, 813334703, 813394308, 813444376, 813513994, 813674688, 813956916, 814300895, 814614832, 814840019, 815053582, 815413535, 815966249, 816583157, 817115009, 817515731, 817828655, 818169415, 818653345, 819231153, 819742203, 820110261, 820374250, 820644915, 821014404, 821487725, 821973383, 822354913, 822601736, 822839260, 823215306, 823708296, 824201286, 824594975, 824863672, 825080454, 825373471, 825802863, 826272786, 826607287, 826749682, 826835632, 827019274, 827348530, 827741861, 828038633, 828154624, 828182876, 828301907, 828569770, 828869700, 829089761, 829205990, 829251349, 829332590, 829530597, 829810858, 830071628, 830262423, 830418050, 830585063, 830790401, 831048250, 831301570, 831458509, 831540406]
2280.3H31540406Q7142J37686J88649K01106J62602Q2075K027k7418K6643J09315J17540
2302.7H32627773L6359k5511k2709M17N6386J15395R3519l2961j62840j51396j6331
2325.2H32518101Q0347J0729j69695k73227k73109k19941j73986j95444k16365k15292
2345.6H30872118j73389j44840j29401l6359j6213k01404l64065l27349j22726L4631
2366H29391003q3328l01003l42429k35319r6619O854J4663j14918k70426k64466j32203
2388.4H27571809l9339p6234k41518l73304l54409k51591j58728j87575l47734m96447
2408.8H25044930n25594m11510k50519k54631m48942o42240o75201n46754m34339m35054
2429.2H20420146n22852o55353p14362o58631n63204m96984n30839o72638p71106o89208
$$ y = [831540406, 831627548, 831765234, 831953883, 832154989, 832317591, 832399666, 832401693, 832374275, 832400918, 832510233, 832627773, 832664132, 832638621, 832615912, 832616329, 832672715, 832788110, 832881629, 832848668, 832685828, 832534432, 832518101, 832598448, 832609177, 832439482, 832166255, 831893146, 831673205, 831499219, 831303775, 831087410, 830872118, 830698729, 830553889, 830424488, 830388129, 830371916, 830170512, 829806447, 829479098, 829356372, 829391003, 829307675, 829006672, 828664243, 828428924, 828332305, 828339159, 828353822, 828238904, 827968478, 827704012, 827571809, 827532470, 827456236, 827214718, 826841414, 826487005, 826235414, 826076686, 825889111, 825541377, 825044930, 824519336, 824107826, 823857307, 823602676, 823153734, 822511494, 821836293, 821289539, 820855200, 820420146, 819897294, 819241941, 818527579, 817868948, 817305744, 816808760, 816277921, 815605283, 814834177, 814144969]
2449.6H14144969n17547m40717n19395o74248p32243o35206m94898m02212m29213n79595
2470H08719695p01368o61373n00262l81768m28736n64456o14703n40674m39345l66748
2490.4H03520262l35693l91007m82678m79519l63410k40981k15710l11017m32193m64559
2510.8G99803495l90410k66850k49922m05073n41449n20527m36664m07457m61400n77450
2531.2G95546293p02321p67231p05779n81086n54204o41405p51376p78616o83784n83709
2551.6G88796782n73933o18338o87540p46727p10010o12974n86510o32286o71923o84798
2572G82271743o56307n66780n17428n92947o91593o85096o06596n24342m40300m32432
2592.4G76557922n25415n63263m72844l74854l72112m54604n80430o73831o75618o75023
$$ y = [814144969, 813627422, 813186705, 812667310, 811993062, 811260819, 810625613, 810130715, 809728503, 809299290, 808719695, 808018327, 807356954, 806856692, 806474924, 806046188, 805481732, 804867029, 804326355, 803887010, 803520262, 803184569, 802793562, 802310884, 801831365, 801467955, 801226974, 801011264, 800700247, 800268054, 799803495, 799413085, 799146235, 798896313, 798491240, 797949791, 797429264, 796992600, 796585143, 796123743, 795546293, 794843972, 794076741, 793370962, 792789876, 792235672, 791594267, 790842891, 790064275, 789380491, 788796782, 788222849, 787604511, 786916971, 786170244, 785460234, 784847260, 784260750, 783628464, 782956541, 782271743, 781615436, 781048656, 780531228, 779938281, 779246688, 778561592, 777954996, 777430654, 776990354, 776557922, 776032507, 775469244, 774996400, 774621546, 774249434, 773794830, 773214400, 772540569, 771864951, 771189928]
2612.8G71189928p36892q15392q96990r56118r80616r83774r96292j065731j149595
2631.1G62608528j184225j184642j157463j102090j122713j242339j282156j190424
2647.4G53142476j117885j104295j109243j152992j180649j132786j082182j066327
2663.7G44196117j054168j059592j070022j055002j006246r36866r08911r16362q95738
2682.1G35293210q87871r27985r32991r07362r36925j014471j090289j106083j057088
2700.5G26432145j033187j092911j185119j230776j215280j151561j069665j048744
2716.8G17404902j101017j103461j014232r49204r15349q78513q91268r08971q37445
2735.1G08805442p22408o94871p62284q05021p94708p86841p65741p10964o78241o68467
$$ y = [771189928, 770453036, 769637644, 768740654, 767784536, 766803920, 765820146, 764823854, 763758123, 762608528, 761424303, 760239661, 759082198, 757980108, 756857395, 755615056, 754332900, 753142476, 752024591, 750920296, 749811053, 748658061, 747477412, 746344626, 745262444, 744196117, 743141949, 742082357, 741012335, 739957333, 738951087, 738014221, 737105310, 736188948, 735293210, 734405339, 733477354, 732544363, 731637001, 730700076, 729685605, 728595316, 727489233, 726432145, 725398958, 724306047, 723120928, 721890152, 720674872, 719523311, 718453646, 717404902, 716303885, 715200424, 714186192, 713236988, 712321639, 711443126, 710551858, 709642887, 708805442, 708083034, 707388163, 706625879, 705820858, 705026150, 704239309, 703473568, 702762604, 702084363, 701415896]
2755.5G01415896o53743o46115o01232n07593m99427o37412p44641p35343p21991p71403
2775.9F94896996q59618r45389j034201j084447j071870j081049j172543j320064j427889
2794.3F84899926j477182j511395j552701j663446j806021j869261j885951j925707
2810.6F71208262j985490k055347k125919k210021k326011k411187k437592k491474
2826.9F53165221k601683k713501k787233k847492k946079l112853l329813l524602
2843.2F29301965l692865l868520l962398l830492l488899l102541k861976k862990
2859.5F01631284l078878l496349m055202m636765n116164n413831n607783n737603
2875.9E64488709n655170n253374m592359l784537k932549k152622j525581j043677
$$ y = [701415896, 700762153, 700116038, 699514806, 699007213, 698507786, 697870374, 697125733, 696390390, 695668399, 694896996, 694037378, 693091989, 692057788, 690973341, 689901471, 688820422, 687647879, 686327815, 684899926, 683422744, 681911349, 680358648, 678695202, 676889181, 675019920, 673133969, 671208262, 669222772, 667167425, 665041506, 662831485, 660505474, 658094287, 655656695, 653165221, 650563538, 647850037, 645062804, 642215312, 639269233, 636156380, 632826567, 629301965, 625609100, 621740580, 617778182, 613947690, 610458791, 607356250, 604494274, 601631284, 598552406, 595056057, 591000855, 586364090, 581247926, 575834095, 570226312, 564488709, 558833539, 553580165, 548987806, 545203269, 542270720, 540118098, 538592517, 537548840]
2892.2E37548840o98030n54800o39141q25762j021266j257062j539469j876771k310813
2910.5E26825726k851129l439426l932357m197657m208624l985703l483415k685696
2926.8D98041719j720905o63370N58257J931787L265380M341245N112529N648613N983472
2945.2E22498727O153703O237387O291449O283224O187320O062746N903065N629480
2961.5E71247101N222559M754364M304946L937006L760993L714800L624261L548383
2977.8F04114413L497780L286004K924919K611935K398014K196252J901329J525164
2994.2F24455810J216352R46819O17206L12388M7744k48611n10335p00116r52840j282394
3014.5F23902023j546920j715064j877427k025067k131582k237916k285838k308428
$$ y = [537548840, 536850810, 536296010, 535656869, 534831107, 533809841, 532552779, 531013310, 529136539, 526825726, 523974597, 520535171, 516602814, 512405157, 508196533, 504210830, 500727415, 498041719, 496320814, 495657444, 496215701, 498147488, 501412868, 505754113, 510866642, 516515255, 522498727, 528652430, 534889817, 541181266, 547464490, 553651810, 559714556, 565617621, 571247101, 576469660, 581224024, 585528970, 589465976, 593226969, 596941769, 600566030, 604114413, 607612193, 610898197, 613823116, 616435051, 618833065, 621029317, 622930646, 624455810, 625672162, 626618981, 627236187, 627548575, 627596319, 627347708, 626837373, 626137257, 625184417, 623902023, 622355103, 620640039, 618762612, 616737545, 614605963, 612368047, 610082209, 607773781]
3030.9F07773781k381265k518952k646685k595603k524615k646148k834916k916813
3047.2E86708784k838492k770663k837956k924442l017902l068328k950549k784610
3063.5E63515842k748847k893090l054202l047705k934038k782226k710819k844393
3079.8E40500522k999187l017247l003776k971708k942563l038764l090620k957940
3096.1E16478717k811908k818406k936423k917051k765954k767175k890468k793163
3112.4D93778169k563357k594352k806038k969294l029824k949238k781689k684325
3128.8D71400052k745211k828032k714872k464503k421707k653062k785355k682895
3145.1D50104415k553314k407103k282381k409190k668828k709657k533972k360910
$$ y = [607773781, 605392516, 602873564, 600226879, 597631276, 595106661, 592460513, 589625597, 586708784, 583870292, 581099629, 578261673, 575337231, 572319329, 569251001, 566300452, 563515842, 560766995, 557873905, 554819703, 551771998, 548837960, 546055734, 543344915, 540500522, 537501335, 534484088, 531480312, 528508604, 525566041, 522527277, 519436657, 516478717, 513666809, 510848403, 507911980, 504994929, 502228975, 499461800, 496571332, 493778169, 491214812, 488620460, 485814422, 482845128, 479815304, 476866066, 474084377, 471400052, 468654841, 465826809, 463111937, 460647434, 458225727, 455572665, 452787310, 450104415, 447551101, 445143998, 442861617, 440452427, 437783599, 435073942, 432539970, 430179060]
3161.4D30179060k305806k322942k295375k231807k215027k220333k202183k195805
3177.7D12189782k171040k123445k111018k070457j958102j890182j922011j950562
3194C95992965j939923j921862j874239j775175j693994j726776j804382j773178j637876
3212.4C79845560j544029j557410j587927j568943j538068j504898j455456j377136
3228.7C67711693j234591j201540j427204j569867j437723j274437j188487j151711
3245C57226133j179665j240522j220792j101256j025408j085252j143545j069992r47923
3263.4C47211778q65578p65712o97881q44180j034349j032770r59635r32753r05752
3281.7C39173168q54135q50618q26358o64860n93216p51048r20355r95726r38057p22439
$$ y = [430179060, 427873254, 425550312, 423254937, 421023130, 418808103, 416587770, 414385587, 412189782, 410018742, 407895297, 405784279, 403713822, 401755720, 399865538, 397943527, 395992965, 394053042, 392131180, 390256941, 388481766, 386787772, 385060996, 383256614, 381483436, 379845560, 378301531, 376744121, 375156194, 373587251, 372049183, 370544285, 369088829, 367711693, 366477102, 365275562, 363848358, 362278491, 360840768, 359566331, 358377844, 357226133, 356046468, 354805946, 353585154, 352483898, 351458490, 350373238, 349229693, 348159701, 347211778, 346346200, 345580488, 344882607, 344038427, 343004078, 341971308, 341011673, 340078920, 339173168, 338319033, 337468415, 336642057, 335977197, 335383981, 334632933, 333712578, 332716852, 331778795, 331056356]
3302.1C31056356n45978o60271r80109j205265j204372j042842r33916r39488r14216
3320.5C22629899q29458q27671r81122j105219j060367r56416q54134p86782r02354
3338.8C14326376j071900j086653j085341j008987p94649q60512j153410j203418j032173
3357.2C05029333r06200r45508r46492p35104o08772q33631j164436j168251r23812
3375.5B96797127q02458q25017q52645p71046n89668l66241j91748l16352o40303o48945
3395.9B90792704k54810o4701m34041p66307n51731k23666j54704k56628m11898m34905
3416.3B87239313k59191r9361o8694L755J69575K68340K42174L00795M09752K17348
3436.7B88423806j29163j34706K06113M94033N03957M01944M52548N75930O44416P64489
$$ y = [331056356, 330510378, 329850107, 328869998, 327664733, 326460361, 325417519, 324483603, 323544115, 322629899, 321800441, 320972770, 319991648, 318886429, 317826062, 316869646, 316015512, 315228730, 314326376, 313254476, 312167823, 311082482, 310073495, 309278846, 308418334, 307264924, 306061506, 305029333, 304123133, 303177625, 302231133, 301496029, 300887257, 300053626, 298889190, 297720939, 296797127, 295994669, 295169652, 294317007, 293545961, 292956293, 292590052, 292398304, 292081952, 291441649, 290792704, 290537894, 290473193, 290039152, 289272845, 288721114, 288497448, 288342744, 288086116, 287674218, 287239313, 286980122, 286880761, 286812067, 286815822, 286985397, 287253737, 287495911, 287796706, 288206458, 288423806, 288294643, 288159937, 288366050, 288860083, 289364040, 289765984, 290218532, 290794462, 291438878, 292203367]
3457.1B92203367Q76128P26641O60151R96500J174629Q32200M51684M87387P75188
3475.5B99183875J093835J105040P72983P72238J072258J015812Q34405J000971J231223
3493.8C08082640J263589J175046J152873J148730R69917Q72999J046598J269967J399129
3512.2C18381488J272202J029432J067936J332611J548678J421958J127958J105398
3528.5C28287661J319975J529425J629174J512736J369089J602352J899868J798600
3544.8C40948880J485944J509994J730323J838922J977474K173572K334655K380192
3561.1C56379956K259463K210200K629220L001929K871543K784550K953112L145904
3577.5C78235877L364563L598541L608852L394455L321469L564328L619760L627181
$$ y = [292203367, 293079495, 293806136, 294466287, 295462787, 296637416, 297469616, 297921300, 298408687, 299183875, 300277710, 301382750, 302155733, 302927971, 304000229, 305016041, 305850446, 306851417, 308082640, 309346229, 310521275, 311674148, 312822878, 313792795, 314665794, 315712392, 316982359, 318381488, 319653690, 320683122, 321751058, 323083669, 324632347, 326054305, 327182263, 328287661, 329607636, 331137061, 332766235, 334278971, 335648060, 337250412, 339150280, 340948880, 342434824, 343944818, 345675141, 347514063, 349491537, 351665109, 353999764, 356379956, 358639419, 360849619, 363478839, 366480768, 369352311, 372136861, 375089973, 378235877, 381600440, 385198981, 388807833, 392202288, 395523757, 399088085, 402707845, 406335026]
3593.8D06335026L860712M113466M151195M074514M012883L938555M038751M188419
3610.1D38713521M251510M339635M176199M063964M432798M451304M073531L808737
3626.4D72311199M023283M531682M376233M206478M198700M128486M092902M075885
3642.7E05944848L986538L925442M208803M440606M009962L695846L992200M115760
3659E38320005L722966L445208L451705L309905L148079L335476L180087K929151L114521
3677.4E67957103L111720L009022L021061K983332K833724K469778K258479K379120
3693.7E90023339K411067K260506K019883J881599K059043K203702K024174J715779
3710F06599092J641751J903176J930535J721203J539827J478553J476347J510441J653910
$$ y = [406335026, 410195738, 414309204, 418460399, 422534913, 426547796, 430486351, 434525102, 438713521, 442965031, 447304666, 451480865, 455544829, 459977627, 464428931, 468502462, 472311199, 476334482, 480866164, 485242397, 489448875, 493647575, 497776061, 501868963, 505944848, 509931386, 513856828, 518065631, 522506237, 526516199, 530212045, 534204245, 538320005, 542042971, 545488179, 548939884, 552249789, 555397868, 558733344, 561913431, 564842582, 567957103, 571068823, 574077845, 577098906, 580082238, 582915962, 585385740, 587644219, 590023339, 592434406, 594694912, 596714795, 598596394, 600655437, 602859139, 604883313, 606599092, 608240843, 610144019, 612074554, 613795757, 615335584, 616814137, 618290484, 619800925, 621454835]
3728.4F21454835J653731J460254J290262J448214J656115J440525Q58486O77228J226544
3746.7F33166194J106381P60079J198768J575351J402199J133979J139164J178503
3763.1F42660618J101255J027644Q58009Q63731J113414J227081J129031Q71897P40946
3781.4F51593626P61568Q46624R55344R58442R35913Q99732Q62300Q77976O64175N33223
3801.8F59888923Q48353P59304O50406R63330J057684P72536O18994Q00967N45502
3820.2F66905999M27365P67768Q36730Q16643P48694P38859Q66652O30796K39968L58939
3840.6F73338413O20544P81357P97093O48380K73108l03209J90974J092434R87947
3858.9F78427041O01053L87966M60923N39541M07696M29750N18858N69165N90026M32194
$$ y = [621454835, 623108566, 624568820, 625859082, 627307296, 628963411, 630403936, 631262422, 631939650, 633166194, 634272575, 635032654, 636231422, 637806773, 639208972, 640342951, 641482115, 642660618, 643761873, 644789517, 645647526, 646511257, 647624671, 648851752, 649980783, 650852680, 651593626, 652355194, 653201818, 654157162, 655115604, 656051517, 656951249, 657813549, 658691525, 659355700, 659888923, 660737276, 661496580, 662146986, 663110316, 664168000, 664940536, 665559530, 666360497, 666905999, 667333364, 668101132, 668937862, 669754505, 670503199, 671242058, 672108710, 672739506, 672979474, 673338413, 673958957, 674740314, 675537407, 676185787, 676458895, 676155686, 676346660, 677439094, 678427041, 679028094, 679416060, 679876983, 680416524, 680824220, 681253970, 681772828, 682341993, 682932019, 683364213]
3879.3F83364213M81605N58198L62813L68953L83913K81751M23253N88238M90725K57850
3899.7F87561512R4712J00434L23891M95553M77076M49180L68953K12729K05219L27826
3920.1F90617085L13401K06709K42710L19540K49148K47895L50774L00228K17021J90913
3940.5F93255424J61410K57492L36826K13742J46925K38359K99573L14951K97785K07424
3960.9F95729911J53065J76430K08318K43127K66731K48969J66416P8142J01089K46585
3981.3F97618783L39865K47896R7275O8962J56880K06291J99080K33650
3997.6F99168682
$$ y = [683364213, 683845818, 684404016, 684766829, 685135782, 685519695, 685801446, 686224699, 686812937, 687303662, 687561512, 687656224, 687756658, 688080549, 688576102, 689053178, 689502358, 689871311, 690084040, 690289259, 690617085, 690930486, 691137195, 691379905, 691699445, 691948593, 692196488, 692547262, 692847490, 693064511, 693255424, 693416834, 693674326, 694011152, 694224894, 694371819, 694610178, 694909751, 695224702, 695522487, 695729911, 695882976, 696059406, 696267724, 696510851, 696777582, 697026551, 697192967, 697271109, 697372198, 697618783, 697958648, 698206544, 698303819, 698372781, 698529661, 698735952, 698935032, 699168682]
##END=$$ End of the data block
