##TITLE=$$ Begin of the data block
##JCAMP-DX=5.00 $$ ACD/SpecManager v 10.08
##SPECTROMETER/DATA SYSTEM=Alpha
##DATE=29 Dec 2014 15:06:02
##DATA TYPE=INFRARED SPECTRUM
##DATA CLASS=XYDATA
##ORIGIN=
##OWNER=
##NPOINTS=1765
##FIRSTX=399.76428223
##LASTX=3997.64306641
##MAXX=3997.64306641
##MINX=399.76428223
##MAXY=0.83401865
##MINY=0.22438657
##XFACTOR=1.0000000000
##YFACTOR=1.000000000000000e-9
##FIRSTY=0.55545890
##DELTAX=2.03961372
##XUNITS=1/CM
##YUNITS=ARBITRARY UNITS
##XYDATA=(X++(Y..Y))
399.8E55458903n264759n114376l907442j323581J417458K891958K442658Q73983m82500
$$ 555458903 550194144 545079768 541172326 539848745 541266203 544158161 546600819 547474802 546992302
418.1E46992302j260996j398504j552105k394259l553569m120469l609479k609372
$$ 546992302 545731306 544332802 542780697 540386438 536832869 532712400 529102921 526493549
434.4E26493549j664400k40266J713633L703058M952133M895866M076660K914726J517296
$$ 526493549 524829149 524588883 526302516 530005574 534957707 539853573 543930233 546844959 548362255
452.8E48362255K85804n36024r17435j012266j775562l038049l852069l884078l401041
$$ 548362255 548648059 548112035 547194600 546182334 544406772 541368723 537516654 533632576 530231535
471.2E30231535k918005k720356k781450k531648j603305m07279M23908M69864k74956
$$ 530231535 527313530 524593174 521811724 519280076 517676771 517269492 517693400 518163264 517888308
489.5E17888308j116634j301706j274168j577676j936316k422750l036320l262878
$$ 517888308 516771674 515469968 514195800 512618124 510681808 508259058 505222738 501959860
505.8E01959860l281384l440679l856062m429758m837394n002141m732728l721267
$$ 501959860 498678476 495237797 491381735 486951977 482114583 477112442 472379714 468658447
522.1D68658447k515852j794189j195431l76791P41273K432645M332453N606204N895704
$$ 468658447 466142595 464348406 463152975 462776184 463517457 465950102 470282555 475888759 481784463
540.5D81784463N249590L969311K540857J089007m60416j867354k778471l317267l870636
$$ 481784463 487034053 491003364 493544221 494633228 494172812 492305458 489526987 486209720 482339084
558.9D82339084m472941n329698o601841p837832q157461o821216m166305j184851
$$ 482339084 477866143 472536445 465934604 458096772 449939311 443118095 438951790 437766939
575.2D37766939J485527L746897N892158P716745Q417368P677465N763322L518969
$$ 437766939 439252466 442999363 448891521 456608266 465025634 472703099 478466421 481985390
591.5D81985390J801789Q79973N24819K57105k85745q16703p69257p0662R59218J757264
$$ 481985390 483787179 484667152 485191971 485449076 485163331 484346628 483577371 483506709 484465927 486223191
611.9D86223191K027273K078563K405644L222346M179001M730701M506529L568887
$$ 486223191 488250464 490329027 492734671 495957017 500136018 504866719 509373248 512942135
628.2E12942135K635300K389253K544701K515316K096057J431048Q93831P95603J155734
$$ 512942135 515577435 517966688 520511389 523026705 525122762 526553810 527447641 528243244 529398978
646.6E29398978J612842J690209J319408Q79049P65741J091779J554906J656711J162529
$$ 529398978 531011820 532702029 534021437 534900486 535666227 536758006 538312912 539969623 541132152
664.9E41132152O48558R05156J530588J972020K287030K052545J429439J018941J179815
$$ 541132152 541780710 542685866 544216454 546188474 548475504 550528049 551957488 552976429 554156244
683.3E54156244J613438J676679J002907j83046j305997j922429k121925k336740k875448
$$ 554156244 555769682 557446361 558449268 558266222 556960225 555037796 552915871 550579131 547703683
701.6E47703683l432929l324211k153396j19090J980483L380716L985941M295171M961967
$$ 547703683 544270754 540946543 538793147 538674057 540654540 544035256 548021197 552316368 557278335
720E57278335O065011P003069P104456O225348M980385M046023L729880L800392L448725
$$ 557278335 563343346 570346415 577450871 583676219 588656604 592702627 596432507 600232899 603681624
738.3F03681624K134621K09332j343847k097547k500236l178239m349231n596757o136537
$$ 603681624 605816245 606025577 604681730 602584183 600083947 596905708 592556477 586959720 580823183
756.7E80823183n567908m217625k622545j148402K76982K106071M564524P236719R318828
$$ 580823183 575255275 571037650 568415105 567266703 567543685 569649756 574214280 581450999 590769827
775.1E90769827J0184288R667635Q329809P133067O508052O111920N429625M347623
$$ 590769827 600954115 610621750 618951559 626084626 632592678 638704598 644134223 648481846
791.4F48481846L382683L245115M081428N094886N194723M180313K764821J800418
$$ 648481846 651864529 655109644 659191072 664285958 669480681 673660994 676425815 678226233
807.7F78226233J672029J953244J842737J132608J88112n31792p61927p57277j215696
$$ 678226233 679898262 681851506 683694243 684826851 685014963 684483171 683721244 682963967 681748271
826F81748271k516150m217327n510450n933523n618036n079686m866421n051792n234897
$$ 681748271 679232121 675014794 669504344 663570821 657952785 652873099 648006678 642954886 637719989
844.4F37719989m979491m322350l879846m182517n214870o344616o204963l394127
$$ 637719989 632740498 628418148 624538302 620355785 615140915 608796299 602591336 599197209
860.7E99197209J907349P455289J1029482J2524247J2834728J2147546J0356366P589579
$$ 599197209 601104558 608559847 619589329 632113576 644948304 657095850 667452216 675041795
877F75041795M045009J98782l039599m938960n526840n499900n594969n907297o035030
$$ 675041795 679086804 679285586 676245987 671307027 665780187 660280287 654685318 648778021 642742991
895.4F42742991n725383n118668m784823n303800o617606q160054r383738j0116876
$$ 642742991 637017608 631898940 627114117 621810317 615192711 607032657 597648919 587532043
911.7E87532043j0592401j0973036j0966122r990215p778764m879773k268135n12660
$$ 587532043 576939642 565966606 555000484 545010269 537231505 532351732 530083597 529570937
928E29570937N33581J387715K402723L635526M984736O153226O458879M999399J532197
$$ 529570937 530104518 531492233 533894956 537530482 542515218 548668444 555127323 560126722 561658919
946.4E61658919k952993p121325j0439992j3053536j5117526j6639471j7628133j8269033
$$ 561658919 558705926 551584601 541144609 528091073 512973547 496334076 478705943 460436910
962.7D60436910j8858820j9653261k0685076k1593988k1998793k1799713k1032572
$$ 460436910 441578090 421924829 401239753 379645765 357646972 335847259 314814687
977C14814687j9756913j7882586j5371501j2494013r558722o809861m442707k579555
$$ 314814687 295057774 277175188 261803687 249309674 239750952 232941091 228498384 225918829
993.3B25918829j242920k89336M43086Q89346R54345O48856N3897n81070r11445o96048
$$ 225918829 224675909 224386573 224829659 225719005 226673350 227322206 227376103 226795033 225883588 225187540
1013.7B25187540J2115R42841J793399K495885L167168L847435M387810M593432M445315
$$ 225187540 225199655 226142496 227935895 230431780 233598948 237446383 241834193 246427625 250872940
1032B50872940L864169K803266J615435P98941M87685N51283Q52674J472891K670824
$$ 250872940 254737109 257540375 259155810 259954751 260442436 260993719 261846393 263319284 265990108
1050.4B65990108M451007O449312Q147597R395093J0470599J1441022J1563212R178757
$$ 265990108 270441115 276890427 285038024 294433117 304903716 316344738 327907950 337086707
1066.7C37086707K970100n505860j1859030j2892186r494066m788310q49217J901895
$$ 337086707 340056807 334550947 322691917 309799731 300305665 295517355 294668138 296570033
1083B96570033L732622N014985O067157P003993P575452P345259O103903M113198K090305
$$ 296570033 300302655 305317640 311384797 318388790 325964242 333309501 339413404 343526602 345616907
1101.4C45616907Q95351R82940K168358L670841M683495M952490M633129L975272L131062
$$ 345616907 346512258 347495198 349663556 353334397 358017892 362970382 367603511 371578783 374709845
1119.8C74709845K265095J776815K088636L251225M728317N409986M388153J657188
$$ 374709845 376974940 378751755 380840391 384091616 388819933 394229919 398618072 400275260
1136.1D00275260k000719n496919q011103r239316r322673q605123p368534n691886
$$ 400275260 398274541 392777622 384766519 375527203 366204530 357599407 350230873 344538987
1152.4C44538987l693194j663923K00510J966715L879070O108314Q603513J1077881
$$ 344538987 340845793 339181870 339382380 341349095 345228165 351336479 359939992 371017873
1168.7C71017873J3201446J4724880J5504599J5637099J5459359J5157998J4621496
$$ 371017873 384219319 398944199 414448798 430085897 445545256 460703254 475324750
1183D75324750J3654232J2088418J0001957P749677N714655M120529K971828K168417
$$ 475324750 488978982 501067400 511069357 518819034 524533689 528654218 531626046 533794463
1199.3E33794463J685679J599371J989245K803922L824830M733801N250812N296349
$$ 533794463 535480142 537079513 539068758 541872680 545697510 550431311 555682123 560978472
1215.6E60978472M907668M089057K893865J489580O8903j124263j866996k155006k157152
$$ 560978472 565886140 569975197 572869062 574358642 574427545 573303282 571436286 569281280 567124128
1234E67124128k059877j943051j711846j187205l26514O93440J560927K045452K164185
$$ 567124128 565064251 563121200 561409354 560222149 559895635 560589075 562150002 564195454 566359639
1252.3E66359639K037406J727045J324773R75191Q18432J027047J583278K137363K325118
$$ 566359639 568397045 570124090 571448863 572424054 573242486 574269533 575852811 577990174 580315292
1270.7E80315292K001047J286328M43220l26157q51512j049041j021862r48549r88364
$$ 580315292 582316339 583602667 584045887 583719730 582868218 581819177 580797315 579848766 578860402
1289E78860402j203358j568317j996816k332031k463460k407670k318561k362490k443731
$$ 578860402 577657044 576088727 574091911 571759880 569296420 566888750 564570189 562207699 559763968
1307.4E59763968k241969j757860j367390j223982j292050j637280k286553l229618
$$ 559763968 557521999 555764139 554396749 553172767 551880717 550243437 547956884 544727266
1323.7E44727266m420102n552590o180763o098092n380630m193902k796590j475573
$$ 544727266 540307164 534754574 528573811 522475719 517095089 512901187 510104597 508629024
1340E08629024m04298K92182O01351N78642L54528J00434j98960n60105q52048r86577
$$ 508629024 508224726 508516908 509118259 509696901 510051429 510151863 509952903 509392798 508540750 507554173
1360.4E07554173r73343o90163l07381p6890J94669O70910J159131J310707J256942
$$ 507554173 506580830 505890667 505583286 505506396 505701065 506371975 507531106 508841813 510098755
1378.8E10098755J240254J556635K557397M019320M563748L662110K434790J073956
$$ 510098755 511339009 512895644 515453041 519472361 524036109 527698219 530133009 531206965
1395.1E31206965k89857j281500j632392j636923j906752k194524k369285k463042
$$ 531206965 530917108 529635608 528003216 526366293 524459541 522265017 519895732 517432690
1411.4E17432690k138734j480758j025975q03411l09229L02196P95722J299262J767695
$$ 517432690 515293956 513813198 512787223 511983812 511674583 511976779 512772501 514071763 515839458
1429.8E15839458J940369J937032K153754K245963K004266K025544J877010J239061
$$ 515839458 517779827 519716859 521870613 524116576 526120842 528146386 530023396 531262457
1446.1E31262457K02835p44343j143157j187802j662731k051115o87063Q45075K519786
$$ 531262457 531465292 530720949 529577792 528389990 526727259 524676144 523989081 524834156 527353942
1464.5E27353942M244328N423605P279635J0338545J0866046R230852Q387029Q133292
$$ 527353942 531598270 537021875 544301510 554640055 565506101 574736953 583123982 591257274
1480.8E91257274P856608P029473O520570O484091O040871M937649M647076M933298
$$ 591257274 599113882 606143355 612663925 619148016 625188887 630126536 634773612 639706910
1497.1F39706910M246890L343046L057897L617406M272997K881885J941979J977563
$$ 639706910 643953800 647296846 650354743 653972149 658245146 661127031 663069010 665046573
1513.4F65046573K187967K447963K490043K454520J922726J396954J374245J485527
$$ 665046573 667234540 669682503 672172546 674627066 676549792 677946746 679320991 680806518
1529.7F80806518J720130J708150J315176J177907J097560L60906R9898K20179J30654
$$ 680806518 682526648 684234798 685549974 686727881 687825441 688186347 688286245 688506424 688637078
1548.1F88637078j92404m32372l38435j34588p52031k130032j651764j454174j563013
$$ 688637078 688444674 688012302 687673867 687539279 686787248 684657216 683005452 681551278 679988265
1566.4F79988265j640618j896381j564980j573682k586722k663076k042353j939774
$$ 679988265 678347647 676451266 674886286 673312604 670725882 668062806 666020453 664080679
1582.8F64080679j985907k159596k447784k706587k714693k596319k543032k642930
$$ 664080679 662094772 659935176 657487392 654780805 652066112 649469793 646926761 644283831
1599.1F44283831k966761l271044l313124l240585l322900l360808l255426l782154
$$ 644283831 641317070 638046026 634732902 631492317 628169417 624808609 621553183 617771029
1615.4F17771029m658401l584682k652467l042042l171563l098309k909482j963198
$$ 617771029 613112628 609527946 606875479 603833437 600661874 597563565 594654083 592690885
1631.7E92690885j098216r83417q16583k95997K16544Q42154J705229K308488K112806
$$ 592690885 591592669 590609252 589792669 589496672 589713216 590555370 592260599 594569087 596681893
1650.1E96681893K541840L371835K754271K803087L566980M262507M234374L731072
$$ 596681893 599223733 602595568 605349839 608152926 611719906 615982413 620216787 623947859
1666.4F23947859M181742M982532M702806M948378N309343M721761M506230N289674
$$ 623947859 628129601 633112133 637814939 642763317 648072660 652794421 657300651 662590325
1682.7F62590325O650388N540848M402280M371702L923536M092097M339337L903926
$$ 662590325 669240713 674781561 679183841 683555543 687479079 691571176 695910513 699814439
1699F99814439L699362K707541K045631J961709J908063K110064K307475K297044K088129
$$ 699814439 703513801 706221342 708266973 710228682 712136745 714246809 716554284 718851328 720939457
1717.4G20939457J628220J541257J887858K205968K220631K096832J863181J876354
$$ 720939457 722567677 724108934 725996792 728202760 730423391 732520223 734383404 736259758
1733.7G36259758J934469J891315K109349K085686J919090K066195K450347K884269
$$ 736259758 738194227 740085542 742194891 744280577 746199667 748265862 750716209 753600478
1750G53600478K967656K569914K330661K243816K212108K406060K295435J973748J701355
$$ 753600478 756568134 759138048 761468709 763712525 765924633 768330693 770626128 772599876 774301231
1768.4G74301231J458168J350880J344859J410842J400113J133144Q21412P87496J007438
$$ 774301231 775759399 777110279 778455138 779865980 781266093 782399237 783220649 784008145 785015583
1786.7G85015583J284778J376033J077771O01471N14269P81834J131594J201868R21488
$$ 785015583 786300361 787676394 788754165 789355636 789869905 790651739 791783333 792985201 793906689
1805.1G93906689O07907M94183O17027Q49843R97484Q50379N07951L10659M54843Q11279
$$ 793906689 794514596 795008779 795625806 796475649 797473133 798323512 798831463 799142122 799596965 800408244
1825.5H00408244R98676Q17895L45886N2273J38104M46975P09117P17103L60489j02103
$$ 800408244 801406920 802224815 802570701 802622974 802761078 803208053 803917170 804634273 804994762 804892659
1845.9H04892659j24872J85609N17130N71132L09765j1801j00196J22965M95731O53744
$$ 804892659 804767787 804953396 805470526 806041658 806351423 806339622 806239426 806362391 806858122 807511866
1866.3H07511866L46482j20640j90973Q5354M43101O48617N12719K12849M8101J46567
$$ 807511866 807858348 807737708 807546735 807632089 808075190 808723807 809236526 809449375 809497476 809644043
1886.7H09644043M23253O06239N08785K10762o5386q9228J36316L78608M21226K11120
$$ 809644043 810067296 810673535 811182320 811393082 811327696 811238468 811374784 811753392 812174618 812385738
1907.1H12385738p1347j61588M0054L43859M31061K30730m1843j65879l2485K35260
$$ 812385738 812314391 812152803 812192857 812536716 812967777 813198507 813156664 812990785 812958300 813193560
1927.5H13193560L76701K87414N2154j42634r9004J63794L77059L20673J15812n0187
$$ 813193560 813570261 813857675 813909829 813767195 813668191 813831985 814209044 814529717 814645529 814595342
1947.9H14595342p1347J15454L62635M30882K52783L9637o258J11341K76744L66509
$$ 814595342 814523995 814639449 815002084 815432966 815685749 815725386 815719128 815830469 816107213 816473722
1968.3H16473722K58387K5808j10030m8458J56402L20494K79010O1869j11162r3580
$$ 816473722 816732109 816757917 816647887 816599429 816755831 817076325 817355335 817417204 817306042 817212462
1988.7H17212462O4493J94609J73986K9623j46270k13921r9897Q0407R8049j03354
$$ 817212462 817276955 817471564 817645550 817675173 817528903 817314982 817215085 817295492 817393541 817290187
2009H17290187l54588m57406l70383k42293k23935l73006o67453p89582m48347m8339
$$ 817290187 816935599 816478193 816107810 815865517 815641582 815268576 814601123 813811541 813363194 813314855
2029.4H13314855J8418j28090l51429n25237n09560l32534j60575j00851j89602l26872
$$ 813314855 813333273 813205183 812853754 812328517 811818957 811486423 811325848 811224997 811035395 810708523
2049.8H10708523l16739j33395O6757J43408Q1540l0220o0737K2650J41322K03014
$$ 810708523 810391784 810258389 810325146 810468554 810550094 810519874 810459137 810481787 810623109 810826123
2070.2H10826123J70946M2975q0943o5744O8366K10703K24173Q9764j3828K5988J40548
$$ 810826123 810997069 811040044 810959101 810893357 810961723 811172426 811396599 811486363 811472535 811498523 811639071
2092.7H11639071K34246K59638K16126J00791J4723R3996K40446K82943K00569P8261
$$ 811639071 811873317 812132955 812349081 812449872 812464595 812558591 812799037 813081980 813282549 813360810
2113.1H13360810o55J3351R1851J55389J34111K2351p6353m8816O2525J18673J11580
$$ 813360810 813360155 813373506 813465357 813620746 813754857 813777208 813700855 813652039 813714564 813833237 813944817
2135.5H13944817P0333p093n8770n96J17719J57595J10924M5419J5318O9559J94490
$$ 813944817 814015150 814008057 813949287 813948691 814066410 814224005 814334929 814380348 814395666 814465225 814659715
2157.9H14659715L04222L52382L19899K24232J99318L45051N53966O23107N31316L99232
$$ 814659715 814963937 815316319 815636218 815860450 816059768 816404819 816958785 817581892 818113208 818512440
2178.3H18512440L20971L52740M78685N91576N49376L70741K42114K57075L67760M79222
$$ 818512440 818833411 819186151 819664836 820256412 820805788 821176529 821418643 821675718 822043478 822522700
2198.7H22522700M84526L64006K44736K63393M00007N22554N09202L69907K54214K44200
$$ 822522700 823007226 823371232 823615968 823879361 824279368 824801922 825311124 825681031 825935245 826179445
2219.1H26179445L19481M20510M47214L19123J38462R4593K02119L51429L87788K62677
$$ 826179445 826498926 826919436 827366650 827685773 827824235 827918828 828120947 828472376 828860164 829122841
2239.5H29122841J14203O2704J31845K38419K68161K25127J43886O5863Q7142K11477
$$ 829122841 829237044 829299748 829431593 829670012 829938173 830163300 830307186 830373049 830460191 830671668
2259.9H30671668L03268K58267J62721J38223J67668K12371K65062K52247J46330Q0525
$$ 830671668 830974936 831233203 831395924 831534147 831701815 831914186 832179248 832431495 832577825 832658350
2280.3H32658350J22190J60158J58429J71602J52945Q0407O258j2815M8936J27673
$$ 832658350 832780540 832940698 833099127 833270729 833423674 833504081 833510339 833497524 833546460 833674133
2300.7H33674133J44422O9976n901j4544j3828J5140P6770P2480k7418j50681j42992
$$ 833674133 833818555 833888531 833882630 833868086 833854258 833869398 833946168 834018648 833991230 833840549 833697557
2323.1H33697557J2756Q0824k7716j93716l02135l23177k43485j28150j22428j98483
$$ 833697557 833710313 833791137 833763421 833569705 833267570 832944393 832700908 832572758 832450330 832251847
2343.5H32251847k17617j54435j21355q3268N305m3094k57075l40522k35498j32262
$$ 832251847 832034230 831879795 831758440 831675172 831680477 831637383 831380308 831039786 830804288 830672026
2363.9H30672026p9811j53184k76089k74896k03729r2924K5094Q702j56641k91466
$$ 830672026 830592215 830439031 830162942 829888046 829684317 829591393 829616487 829625189 829468548 829177082
2384.3H29177082k61605j29998l1233o9976k60114m14133l74318k25365j20818j63973
$$ 829177082 828915477 828785479 828754246 828684270 828424156 828010023 827635705 827410340 827289522 827125549
2404.7H27125549l51846n33104n45680m00544k42173k56598m48883o19531o49094n45740
$$ 827125549 826773703 826240599 825694919 825294375 825052202 824795604 824346721 823727190 823078096 822532356
2425.1H22532356m50850m64439n56469o77228p12633o15418m97163m66406n54323p05600
$$ 822532356 822081506 821617067 821060598 820383370 819670737 819055319 818558156 818091750 817537427 816831827
2445.5H16831827p66635o65188n17964m70400n51224o68823p09892o39259n03660m06205
$$ 816831827 816065192 815400004 814882040 814411640 813860416 813191593 812481701 811842442 811338782 810932577
2465.9H10932577m45485n85378o62207n93007m88162m41194m63604n43952o00815n56648
$$ 810932577 810487092 809901714 809239507 808646500 808158338 807717144 807253540 806709588 806108773 805552125
2486.3H05552125m54605l80695l46958l58701m11928m31001l51667k57373k53975l22223
$$ 805552125 805097520 804716825 804369867 804011166 803599238 803168237 802816570 802559197 802305222 801982999
2506.7H01982999m14431m51744l74913k51114k55585m31955n78284n52357m30345l67165
$$ 801982999 801568568 801116824 800741911 800490797 800235212 799803257 799224973 798672616 798242271 797875106
2527.1G97875106m32729n84126p28130p68781o77109n59032n53846o44863p55906q02219
$$ 797875106 797442377 796858251 796130121 795361340 794684231 794125199 793571353 792926490 792170584 791368365
2547.5G91368365o97493n60642n27977n65410o75798p76052p16269o07252n93245o40333
$$ 791368365 790670872 790110230 789582253 789016843 788341045 787564993 786848724 786241472 785648227 785007894
2567.9G85007894p01129p20919o57796n69225n40077n69106o27577o61552o24061n49614
$$ 785007894 784306765 783585846 782928050 782358825 781818748 781249642 780622065 779960513 779336452 778786838
2588.3G78786838m75705m68194n29647n24521m20153l35753l67522m95136o23941o91176
$$ 778786838 778311133 777842939 777313292 776788771 776368618 776032865 775665343 775170207 774546266 773855090
2608.7G73855090o74069o50584p22886q39173r20713r57549r58800r62973j006305
$$ 773855090 773181021 772530437 771807551 770968378 770047665 769090116 768131316 767168343 766162038
2627G66162038j081646j131832j145363j163662j166224j151443j166761j212298j233340
$$ 766162038 765080392 763948560 762803197 761639535 760473311 759321868 758155107 756942809 755709469
2645.4G55709469j189947j112103j072228j110971j174569j189173j169383j122058
$$ 755709469 754519522 753407419 752335191 751224220 750049651 748860478 747691095 746569037
2661.7G46569037j045107j022757j065731j057803r95100r61840r44555r18328r13322
$$ 746569037 745523930 744501173 743435442 742377639 741382539 740420699 739476144 738557816 737644494
2680.1G37644494r31740r36687r06766q83281q98302r57548j041711j078844j062572
$$ 737644494 736712754 735776067 734869301 733986020 733087718 732130170 731088459 730009615 728947043
2698.4G28947043j042425j062811j136422j202225j222969j197636j136541j086891
$$ 728947043 727904618 726841807 725705385 724503160 723280191 722082555 720946014 719859123
2714.7G19859123j070440j082420j068056j005649r62615r26972r03427r00567q63194
$$ 719859123 718788683 717706263 716638207 715632558 714669943 713742971 712839544 711938977 711075783
2733.1G11075783p86007p12812p21275p86961q20159q10504p65562o92726o58452p12872
$$ 711075783 710289776 709576964 708855689 708068728 707248569 706438065 705672503 704979777 704321325 703608453
2753.5G03608453p53641p05540o30796n54383n00738n51105o78480p46190p22349p07328
$$ 703608453 702854812 702149272 701518476 700964093 700463355 699912250 699233770 698487580 697765231 697057903
2773.9F97057903p65622q46207r11176r97305j053810j056075j102746j232922j369357
$$ 697057903 696292281 695446074 694534898 693537593 692483783 691427708 690324962 689092040 687722683
2792.2F87722683j445115j480698j503706j541198j642525j788139j858831j845896
$$ 687722683 686277568 684796870 683293164 681751966 680109441 678321302 676462471 674616575
2808.6F74616575j894176k007425k090334k142311k205610k294958k382874k440989
$$ 674616575 672722399 670714974 668624640 666482329 664276719 661981761 659598887 657157898
2824.9F57157898k514958k649725k771377k812088k840161k933562l089428l306091
$$ 657157898 654642940 651993215 649221838 646409750 643569589 640636027 637546599 634240508
2841.2F34240508l550529l743232l880620l942847l832281l548026l188729k891004
$$ 634240508 630689979 626946747 623066127 619123280 615290999 611742973 608554244 605663240
2857.5F05663240k826095l067374l521085m070699m661560n156636n439282n624652
$$ 605663240 602837145 599769771 596248686 592177987 587516427 582359791 576920509 571295857
2873.8E71295857n780637n707979n272508m581451l784120k964437k185822j529693
$$ 571295857 565515220 559807241 554534733 549953282 546169162 543204725 541018903 539489210
2890.1E39489210j044453p25209n82338o38544q01325r69768j203477j538038j904011
$$ 539489210 538444757 537719548 537137210 536498666 535697341 534727573 533524096 531986058 530082047
2908.5E30082047k318025k845108l431201l937364m227221m241407l989279l468454
$$ 530082047 527764022 524918914 521487713 517550349 513323128 509081721 505092442 501623988
2924.8E01623988k693146j750559o86794N79059J979977L252446M290641N124926N706787
$$ 501623988 498930842 497180283 496493489 497072548 499052525 502304971 506595612 511720538 517427325
2943.2E17427325O018162O150425O238758O323755O300986O178438O090939N983591
$$ 517427325 523445487 529595912 535834670 542158425 548459411 554637849 560728788 566712379
2959.5E66712379N689979N224705M719436M279554L990531L850400L750801L651917
$$ 566712379 572402358 577627063 582346499 586626053 590616584 594466984 598217785 601869702
2975.8F01869702L602624L527880L278792K935171K659380K441347K224147J921237
$$ 601869702 605472326 609000206 612278998 615214169 617873549 620314896 622539043 624460280
2992.1F24460280J543760J235187R58383O51598L67821Q7320k21848m88341o81817
$$ 624460280 626004040 627239227 628197610 628849208 629217029 629304349 629082501 628594160 627912343
3010.5F27912343r23932j242578j531184j753509j916826k013027k108574k228439
$$ 627912343 626988411 625745833 624214649 622461140 620544314 618531287 616422713 614194274
3026.8F14194274k287328k312482k365172k502858k631009k564371k526283k695322
$$ 614194274 611906946 609594464 607229292 604726434 602095425 599531054 597004771 594309449
3043.1E94309449k868831k912581k851367k812266k856851k916157k996624l046631
$$ 594309449 591440618 588528037 585676670 582864404 580007553 577091396 574094772 571048141
3059.4E71048141k952934k802193k747297k857030l037870l085851k965212k793670
$$ 571048141 568095207 565293014 562545717 559688687 556650817 553564966 550599754 547806084
3075.7E47806084k731740k878905l054738l075599l025830k940715k904713l021478
$$ 547806084 545074344 542195439 539140701 536065102 533039272 530098557 527193844 524172366
3092.1E24172366l072203k948045k829850k875447l004194k960443k777994k744734
$$ 524172366 521100163 518152118 515322268 512446821 509442627 506482184 503704190 500959456
3108.4E00959456k872437k818853k593160k591610k791792k957225l027230k954125
$$ 500959456 498087019 495268166 492675006 490083396 487291604 484334379 481307149 478353024
3124.7D78353024k800525k732515k799183k858490k728879k485514k442688k671689
$$ 478353024 475552499 472819984 470020801 467162311 464433432 461947918 459505230 456833541
3141D56833541k825200k720028k547860k406002k309233k404838k638936k694279k542079
$$ 456833541 454008341 451288313 448740453 446334451 444025218 441620380 438981444 436287165 433745086
3159.4D33745086k413004k375722k338589k296656k279609k238512k190829k176493
$$ 433745086 431332082 428956360 426617771 424321115 422041506 419802994 417612165 415435672
3175.7D15435672k177268k175004k166718k115309k032787j982570j971960j966178
$$ 415435672 413258404 411083400 408916682 406801373 404768586 402786016 400814056 398847878
3192C98847878j961261j957715j916200j861572j810252j751543j712888j730800j734405
$$ 398847878 396886617 394928902 393012702 391151130 389340878 387589335 385876447 384145647 382411242
3210.3C82411242j659185j612723j603097j584708j584203j561284j499950j463682
$$ 382411242 380752057 379139334 377536237 375951529 374367326 372806042 371306092 369842410
3226.7C69842410j401633j251996j239091j466483j568466j420647j292378j195728
$$ 369842410 368440777 367188781 365949690 364483207 362914741 361494094 360201716 359005988
3243C59005988j086533j139254j299351j272589j091928j026719j079679j102567j086771
$$ 359005988 357919455 356780201 355480850 354208261 353116333 352089614 351009935 349907368 348820597
3261.3C48820597j066297r86487p86603o34670p88420j038045j087367j038224r61304
$$ 348820597 347754300 346767813 345981210 345346540 344558120 343520075 342432708 341394484 340433180
3279.7C40433180q80927q76873q75652p85589o48529o22987p63506r17703r96113r43869
$$ 340433180 339552253 338675380 337799728 337014139 336365610 335742623 334979117 334061414 333065301 332121432
3300.1C32121432p53373n86569o54757r42350j184732j211166j081705r79751r45747
$$ 332121432 331368059 330781490 330126733 329184383 327999651 326788485 325706780 324727029 323781282
3318.4C23781282r07749q44151q31604r95517j156181j086861r37104q53390q19832
$$ 323781282 322873533 322029382 321197778 320202261 319046080 317959219 317022115 316168725 315348893
3336.8C15348893q95530j015722j061261j105756j021802q16196r09329j176208j176774
$$ 315348893 314453363 313437641 312376380 311270624 310248822 309432626 308523297 307347089 306170315
3355.2C06170315r94504r09448r96887r94504p31498n98728q68410j213521j198530
$$ 306170315 305175811 304266363 303269476 302274972 301543474 300944746 300076336 298862815 297664285
3373.5B97664285r18687p67648p86334q59946q45373o87092l99918j00821k03848o10650
$$ 297664285 296745598 295977950 295191616 294331670 293486297 292799205 292399287 292298466 292094618 291483968
3393.9B91483968o68942l01570j20759m57406p57814n35190k23696j92076k82794m08113
$$ 291483968 290815026 290513456 290392697 289935291 289177477 288642287 288418591 288226515 287943721 287535608
3414.3B87535608m06534j96308r3162j30713k8133J98811L11703K30163K61694L99649
$$ 287535608 287129074 286932766 286839604 286708891 286680758 286879569 287191272 287421435 287683129 288082778
3434.7B88082778K36690q7469r9778J93893M58658M93378L97026M36604N61446O51509
$$ 288082778 288319468 288231999 288132221 288326114 288784772 289278150 289675176 290111780 290673226 291324735
3455.1B91324735P87675Q57025O74248O71268J087904J243829Q44926M56661M79221
$$ 291324735 292112410 292969435 293643683 294314951 295402855 296646684 297491610 297948271 298427492
3473.4B98427492P28310J027315J098603Q60095Q34346J033336R80914Q70019J015812
$$ 298427492 299155802 300183117 301281720 302141815 302976161 304009497 304990411 305860430 306876242
3491.8C06876242J190186J241326J186490J161486J167804J006424Q80987J024753
$$ 306876242 308066428 309307754 310494244 311655730 312823534 313829958 314710945 315735698
3508.1C15735698J241237J384556J296192J052559J099258J419485J637250J454681
$$ 315735698 316976935 318361491 319657683 320710242 321809500 323228985 324866235 326320916
3524.4C26320916J121015J093119J315475J525163J626164J532435J413405J638920
$$ 326320916 327441931 328535050 329850525 331375688 333001852 334534287 335947692 337586612
3540.8C37586612J914590J819790J524001J534730J768828J889556J957089K123058
$$ 337586612 339501202 341320992 342844993 344379723 346148551 348038107 349995196 352118254
3557.1C52118254K349049K424359K280325K239823K703607L047645K843708K762228
$$ 352118254 354467303 356891662 359171987 361411810 364115417 367163062 370006770 372768998
3573.4C72768998K973408L192335L418624L626973L647208L484190L383547L574788
$$ 372768998 375742406 378934741 382353365 385980338 389627546 393111736 396495283 400070071
3589.7D00070071L649771L648520L871530M146010M170239M111081M083365L980399
$$ 400070071 403719842 407368362 411239892 415385902 419556141 423667222 427750587 431730986
3606D31730986M063457M238278M288405M338175M177242M079789M445225M501730M178226
$$ 431730986 435794443 440032721 444321126 448659301 452836543 456916332 461361557 465863287 470041513
3624.4D70041513L878892M009515M548818M427016M175424M144669M156381M136890
$$ 470041513 473920405 477929920 482478738 486905754 491081178 495225847 499382228 503519118
3640.7E03519118M105627M049480L952742M123807M367471M016816L726840M015506
$$ 503519118 507624745 511674225 515626967 519750774 524118245 528135061 531861901 535877407
3657E35877407M105866L728866L459335L412663L265202L197134L490746L299773K928734
$$ 535877407 539983273 543712139 547171474 550584137 553849339 557046473 560537219 563836992 566765726
3675.4E66765726L053963L066599K978087L023088L034234K889335K462208K200484
$$ 566765726 569819689 572886288 575864375 578887463 581921697 584811032 587273240 589473724
3691.7E89473724K339661K410293K264023K019465J933157K112627K205611K054691
$$ 589473724 591813385 594223678 596487701 598507166 600440323 602552950 604758561 606813252
3708F06813252J788974J653671J833439J893043J769126J592159J450837J425564J517356
$$ 606813252 608602226 610255897 612089336 613982379 615751505 617343664 618794501 620220065 621737421
3726.4F21737421J696586J704455J545488J347185J367032J531303J344681P48753
$$ 621737421 623434007 625138462 626683950 628031135 629398167 630929470 632274151 633022904
3742.7F33022904O05703J334667J263142Q37564J260281J614332J365185J026749J068771
$$ 633022904 633628607 634963274 636226416 637063980 638324261 639938593 641303778 642330527 643399298
3761F43399298J198888J127660J017154Q43942Q68916J099885J166820J089752R40680
$$ 643399298 644598186 645725846 646743000 647586942 648455858 649555743 650722563 651812315 652752995
3779.4F52752995Q62659Q04245P68304Q95679J047671J048982Q89718P84994Q42034
$$ 652752995 653615654 654419899 655188203 656083882 657131553 658180535 659070253 659855247 660697281
3797.7F60697281O60062N27144Q49008P87318P00891R71138J015842P34985O16551
$$ 660697281 661357343 661884487 662733495 663520813 664221704 665192842 666208684 666943669 667560220
3816.1F67560220Q11338N45442M31180P66933P76589P60436P99775Q29220R04381O22988
$$ 667560220 668371558 668917000 669348180 670115113 670891702 671652138 672451913 673281133 674185514 674808502
3836.5F74808502K12312L32415N90563P30812P89226P30693M15206j67191J29699R18627
$$ 674808502 675020814 675353229 675943792 676674604 677463830 678194523 678609729 678442538 678572237 679490864
3856.9F79490864R50635O98626M64558M98355N67853L22163L14057N39303O67572P04408
$$ 679490864 680441499 681140125 681604683 682103038 682670891 682993054 683307111 683846414 684513986 685218394
3877.3F85218394M79221L96729M74333L68357M12703L96847K50042L92616N50329M40717
$$ 685218394 685697615 686094344 686568677 686937034 687349737 687746584 687996626 688389242 688939571 689380288
3897.7F89380288K72691J58847Q5175K83301N22196N01633M32491L72648K24173J60218
$$ 689380288 689652979 689811826 689897001 690180302 690702498 691204131 691636622 692009270 692233443 692393661
3918.1F92393661K81512L33131K29418K04503L09527K91825K43127L33190L17633K28763
$$ 692393661 692675173 693008304 693237722 693442225 693751752 694043577 694286704 694619894 694937527 695166290
3938.5F95166290J97410J46270K30491L55959K75910K03133K14219K11060K53558K90871
$$ 695166290 695363700 695509970 695740461 696096420 696372330 696575463 696789682 697000742 697254300 697545171
3958.9F97545171K53737K01046J64271J75774K35080K83361K68638J76430J25408J54912
$$ 697545171 697798908 697999954 698164225 698339999 698575079 698858440 699127078 699303508 699428916 699583828
3979.3F99583828K32816K85268K23100J21296P5459J46926K45452K56836K48074
$$ 699583828 699816644 700101912 700325012 700446308 700521767 700668693 700914145 701170981 701419055
3997.6G01419055
$$ 701419055
##END=$$ End of the data block
