##TITLE=$$ Begin of the data block
##JCAMP-DX=5.00 $$ ACD/SpecManager v 10.08
##SPECTROMETER/DATA SYSTEM=Alpha
##DATE=29 Dec 2014 15:06:02
##DATA TYPE=INFRARED SPECTRUM
##DATA CLASS=XYDATA
##ORIGIN=
##OWNER=
##NPOINTS=1765
##FIRSTX=399.76428223
##LASTX=3997.64306641
##MAXX=3997.64306641
##MINX=399.76428223
##MAXY=0.84190696
##MINY=0.30838591
##XFACTOR=1.0000000000
##YFACTOR=1.000000000000000e-9
##FIRSTY=0.57889158
##DELTAX=2.03961372
##XUNITS=1/CM
##YUNITS=ARBITRARY UNITS
##XYDATA=(X++(Y..Y))
$$ plain form
399.8 578891575 573822379 569800317 567240179 566863894 568216324 570115685 571908832 573553801 575004160
418.1 575004160 574968874 573363483 571110487 568236709 565261722 562568903 560134590 558129907 556584597
436.5 556584597 555956662 557585359 561766982 566517234 570009172 572279572 573973119 575147808 575257897
454.8 575257897 574339628 572898805 571191072 569139779 566550374 563434005 560147464 557074547 554338634
473.2 554338634 551889718 549701035 547936857 546967268 546895623 547162712 547177792 546819091 546199441 545310080
493.6 545310080 543795884 541564047 539252758 537248611 535137117 532533765 529351056 525806308
509.9 525806308 522310197 518935442 515421867 511572242 507769823 504764676 503022373 502526402 502642632
528.3 502642632 502974570 504011393 506467879 510585070 515745223 520987093 525613844 529186308 531396806
$$ packed form
399.8E78891575n069196m022062k560138l76285J352430J899361J793147J644969J450359
418.1E75004160l5286j605391k252996k873778k974987k692819k434313k004683j545310
436.5E56584597o27935J628697M181623M750252L491938K270400J693547J174689J10089
454.8E75257897r18269j440823j707733k051293k589405l116369l286541l072917k735913
473.2E54338634k448916k188683j764178r69589p1645K67089J5080l58701o19650q89361
493.6E45310080j514196k231837k311289k004147k111494k603352l182709l544748
509.9E25806308l496111l374755l513575l849625l802419l005147j742303m95971J16230
528.3E02642632L31938J036823K456486M117191N160153N241870M626751L572464K210498
$$ plain form
546.6 531396806 532042861 531335175 529808581 527890384 525522530 522294164 518271506 513727784 508575737
565 508575737 502792060 496888548 491846114 488759130 488378286 490479320 494286358 499414533 505564034
583.3 505564034 512146950 518342674 523231983 526259840 527620137 528197944 528508782 528295696 527492285
601.7 527492285 526715577 526609004 527159452 527967572 528848708 530014873 531869531 534640670 538014054
620 538014054 541424394 544761121 548200667 551568627 554477632 556736290 558483064 560138881 561850965
638.4 561850965 563331068 564377844 565206051 566111684 567272007 568620443 569771409 570617199 571527839
656.8 571527839 572637081 573624134 574173331 574317038 575373232 578002393 579448998 580201328 581430674
675.1 581430674 582941175 584520280 586123943 587588787 588646948 589326978 589803159 589990675 589566767
$$ packed form
546.6E31396806O46055p07686j526594j918197k367854l228366m022658m543722n152047
565E08575737n783677n903512n042434l086984l80844K101034L807038N128175O149501
583.3E05564034O582916O195724M889309L027857J360297N77807L10838k13086q03411
601.7E27492285p76708j06573N50448Q08120Q81136J166165J854658K771139L373384
620E38014054L410340L336727L439546L367960K909005K258658J746774J655817J712084
638.4E61850965J480103J046776Q28207R05633J160323J348436J150966Q45790R10640
656.8E71527839J109242R87053N49197J43707J056194K629161J446605P52330J229346
675.1E81430674J510501J579105J603663J464844J058161O80030M76181J87516m23908
$$ plain form
693.5 589566767 588270426 586184442 583643138 580942810 578348875 576210320 574956894 574927211 576262236
711.8 576262236 578855276 582349181 586506188 591377437 596844256 602550089 608119726 613145173
728.1 613145173 617543340 621544778 625210404 628275871 630417287 631677091 632249415 632037759 630670011
746.5 630670011 628008664 624280870 619899571 615323365 610813677 606527150 602800786 600163162
762.8 600163162 599086940 599800289 602263033 606433511 612308562 619601429 627711356 635859668 643376052
781.2 643376052 650021195 655944943 661201954 665618718 669225931 672498643 675994098 679885626
797.5 679885626 683920026 687714159 691030443 693786383 695881665 697119534 697622597 697876334 698176324
815.8 698176324 698414147 698326826 697699547 696420670 694504559 691862226 688265741 683740079 678646147
$$ packed form
693.5E89566767j296341k085984k541304k700328k593935k138555j253426k9683J335025
711.8E76262236K593040L493905M157007M871249N466819N705833N569637N025447
728.1F13145173M398167M001438L665626L065467K141416J259804N72324k11656j367748
746.5F30670011k661347l727794m381299m576206m509688m286527l726364k637624
762.8F00163162j076222P13349K462744M170478N875051P292867Q109927Q148312P516384
781.2F43376052O645143N923748N257011M416764L607213L272712L495455L891528
797.5F79885626M034400L794133L316284K755940K095282J237869N03063K53737K99990
815.8F98176324K37823q7321o27279j278877j916111k642333l596485m525662n093932
$$ plain form
834.2 678646147 673441172 668459475 663717568 659104824 654702127 650665343 646876156 642924130
850.5 642924130 638500154 633608103 628460824 623840868 621480465 623158455 629187644 638376176
866.8 638376176 649293303 660659850 671099842 679433465 685036123 687697589 687387645 684456170
883.2 684456170 679717004 674041331 668009222 661956251 656081259 650543869 645421982 640488029
899.5 640488029 635299563 629505277 622955739 615566730 607265711 598024189 588001788 577787399
915.8 577787399 568294346 560400009 554618299 550957620 549073696 548514247 548936069 550216377 552294970
934.1 552294970 555093944 558617294 562796414 566988766 569700122 569237351 564724505 556369066 544991553
952.5 544991553 531504989 516730964 501325071 485598624 469517380 453006178 436162233
$$ packed form
834.2F78646147n204975m981697m741907m612744m402697m036784l789187l952026
850.5F42924130m423976m892051n147279m619956k360403J677990O029189R188532
866.8F38376176J0917127J1366547J0439992Q333623N602658K661466l09944k931475
883.2F84456170m739166n675673o032109o052971n874992n537390n121887m933953
899.5F40488029n188466n794286o549538p389009q301019r241522j0022401j0214389
915.8E77787399r493053p894337n781710l660679j883924n59449M21822J280308K078593
934.1E52294970K798974L523350M179120M192352K711356m62771m512846q355439j1377513
952.5E44991553j3486564j4774025j5405893j5726447j6081244j6511202j6843945
$$ plain form
966.8 436162233 419209301 402327448 385663360 369596750 354731590 341591239 330573708
981.1 330573708 321925342 315618217 311463624 309179842 308385909 308649004 309542179 310769707 312205374
999.4 312205374 313711107 315040261 315930635 316270471 316179842 315950632 315908343 316245556 317052245 318408787
1019.8 318408787 320385218 322942287 325902879 329046816 332226753 335317671 338044167 340081185
1036.1 340081185 341298044 341887712 342209846 342576861 343159080 344131887 345903575 348957986 353460103
1054.5 353460103 359141797 365705669 373157948 381584197 390399724 397621334 400294751 396730512
1070.8 396730512 388498425 379506230 372970074 369720608 369172156 370612413 373460770 377217323
1087.1 377217323 381578147 386468887 391755670 396979094 401425093 404505819 406149298 406893283
$$ packed form
966.8D36162233j6952932j6881853j6664088j6066610j4865160j3140351j1017531
981.1C30573708q648366o307125m154593k283782p93933K63095Q93175J227528J435667
999.4C12205374J505733J329154Q90374L39836r0629k29210m2289L37213Q06689J356542
1019.8C18408787J976431K557069K960592L143937L179937L090918K726496K037018
1036.1C40081185J216859N89668L22134L67015N82219R72807J771688L054411M502117
1054.5C53460103N681694O563872P452279Q426249Q815527P221610K673417l564239
1070.8C96730512q232087q992195o536156l249466n48452J440257K848357L756553
1087.1C77217323M360824M890740N286783N223424M445999L080726J643479P43985
$$ plain form
1103.4 406893283 407607853 409050763 411550254 414990366 418936223 422854155 426277280 428936124
1119.8 428936124 430927366 432636142 434628159 437447995 441287041 445671111 449480861 451490849
1136.1 451490849 450856030 447397679 441723496 434892029 427839369 421181113 415354729 410744697
1152.4 410744697 407576263 405779004 405141383 405596048 407376468 410833180 416119009 423132867 431686431
1170.7 431686431 441579729 452579439 464320421 476345271 488329440 500100017 511456788
1185 511456788 521977782 531099737 538465023 544096649 548267305 551317871 553548217 555269301
1201.3 555269301 556892395 558831155 561363637 564565659 568401515 572815001 577603221 582297623
1217.7 582297623 586268961 589036405 590525866 590975106 590628386 589616537 588090718 586331606 584640145
$$ packed form
1103.4D06893283P14570J442910K499491L440112L945857L917932L423125K658844
1119.8D28936124J991242J708776J992017K819836L839046M384070L809750K009988
1136.1D51490849o34819l458351n674183o831467p052660o658256n826384m610032
1152.4D10744697l168434j797259o37621M54665J780420L456712N285829P013858Q553564
1170.7D31686431R893298J0999710J1740982J2024850J1984169J1770577J1356771
1185E11456788J0520994R121955P365286N631626M170656L050566K230346J721084
1201.3E55269301J623094J938760K532482L202022L835856M413486M788220M694402
1217.7E82297623L971338K767444J489461M49240l46720j011849j525819j759112j691461
$$ plain form
1236 584640145 583165050 581936300 581062794 580777526 581306577 582653403 584489524 586404979 588193178
1254.4 588193178 589807212 591198266 592312098 593203902 594157696 595605493 597733557 600159764 602208257
1272.7 602208257 603525162 604207933 604436457 604281545 603810608 603184104 602580070 602002263 601262093
1291.1 601262093 600120664 598480344 596519291 594509006 592537880 590522587 588405192 586262941
1307.4 586262941 584348559 582868874 581678331 580520093 579420745 578355432 576894283 574541509
1323.7 574541509 570988953 566332579 561184883 556195438 551710010 548017740 545517564 544309855
1340 544309855 543908358 543923020 544227600 544548154 544684291 544629872 544355273 543689787 542595685 541544378
1360.4 541544378 540949643 540362060 539516449 538836420 538509071 538902044 540089250 541098177 541676223
$$ packed form
1236E84640145j475095j228750q73506k85268N29051J346826J836121J915455J788199
1254.4E88193178J614034J391054J113832Q91804R53794J447797K128064K426207K048493
1272.7F02208257J316905O82771K28524j54912m70937o26504o04034n77807p40170
1291.1F01262093j141429j640320j961053k010285j971126k015293k117395k142251
1307.4E86262941j914382j479685j190543j158238j099348j065313j461149k352774
1323.7E74541509l552556m656374n147696m989445m485428l692270k500176j207709
1340E44309855m01497J4662L04580L20554J36137n4419k74599o65486j094102j051307
1360.4E41544378n94735n87583q45611o80029l27349L92973J187206J008927N78046
$$ plain form
1378.8 541676223 542285979 543272316 545342863 549208164 553420126 556136310 558031678 559512138 559858203
1397.1 559858203 559196949 557870626 556306124 554842532 553075135 550967336 548859000 546818197
1413.5 546818197 544943690 543879509 543717504 543288708 543027401 543373108 544041634 545259476 546469986
1431.8 546469986 547461927 549749792 552678049 554096341 555082202 556178033 557116568 557692468 557201266
1450.2 557201266 555535853 553545654 552612245 552400649 551196277 550555110 552300930 555574000 558762848
1468.5 558762848 563673854 572703302 582741678 590759039 597694635 604407907 610951900 616823196
1484.9 616823196 622723520 629467428 635674059 639651716 643289566 648281813 652859509 655688524
1501.2 655688524 657557964 660665154 666260123 669702888 671149611 672724724 674851179 677369058
$$ packed form
1378.8E41676223O09756R86337K070547L865301M211962K716184J895368J480460L46065
1397.1E59858203o61254j326323j564502j463592j767397k107799k108336k040803
1413.5E46818197j874507j064181j62005m28796k61307L45707O68526J217842J210510
1431.8E46469986R91941K287865K928257J418292R85861J095831R38535N75900m91202
1450.2E57201266j665413j990199r33409k11596j204372o41167J745820L273070L188848
1468.5E58762848M911006R029448J0038376Q017361O935596O713272O543993N871296
1484.9F16823196N900324O743908O206631L977657L637850M992247M577696K829015
1501.2F55688524J869440L107190N594969L442765J446723J575113K126455K517879
$$ plain form
1517.5 677369058 679838300 682720661 685078919 686710954 688406944 689657569 690961540 692595840
1533.8 692595840 693353057 693965495 696152568 697951019 698107839 697865605 697671354 697664320 697511256 696993649
1554.2 696993649 696390629 696656287 696258843 694232047 692164600 690323651 688652635 686776638 684487045
1572.6 684487045 682363570 680334747 677854717 675310969 672881603 670440972 667955041 665527463
1588.9 665527463 663142204 660789549 658437848 656020164 653596818 651232123 648868024 646385789
1605.2 646385789 643818557 641141713 638222635 635201216 632581532 630108535 627244174 624622762
1621.5 624622762 622425139 620113492 617684960 615243673 612909853 611670375 612188399 612378776 611671746
1639.9 611671746 611239433 611566067 613692641 616298735 617108285 619774997 625798702 628630579 630211592
$$ packed form
1517.5F77369058K469242K882361K358258J632035J695990J250625J303971J634300
1533.8F92595840P57217O12438K187073J798451J56820k42234j94251p034j53064n17607
1554.2F96993649o03020K65658l97444k026796k067447j840949j671016j875997k289593
1572.6F84487045k123475k028823k480030k543748k429366k440631k485931k427578
1588.9F65527463k385259k352655k351701k417684k423346k364695k364099k482235
1605.2F46385789k567232k676844k919078l021419k619684k472997k864361k621412
1621.5F24622762k197623k311647k428532k441287k333820j239478N18024J90377p07030
1639.9F11671746m32313L26634K126574K606094Q09550K666712O023705K831877J581013
$$ plain form
1658.2 630211592 633020401 637289762 641604483 644914448 649180889 654621243 658887565 663438916
1674.5 663438916 668676615 672717214 676141500 680823922 687686503 692642570 695883393 699179053
1690.9 699179053 702003419 705388069 709227324 712683082 716159284 718136907 719605148 721387863
1707.2 721387863 722732127 723796844 724927247 726512551 728818953 730468869 731175184 732039392 733301580
1725.5 733301580 734776497 736395895 738096237 740513980 742663264 743990958 745887220 748088419
1741.9 748088419 749998450 752027094 754590809 757822931 760930479 763305664 765735447 768420339
1758.2 768420339 771014035 773609579 775643468 777296424 779118836 781097770 783115327 784566939
1774.5 784566939 785527706 786657274 787992477 789173305 790163219 791014373 791857243 793053448 794438243
$$ packed form
1658.2F30211592K808809M269361M314721L309965M266441N440354M266322M551351
1674.5F63438916N237699M040599L424286M682422O862581M956067L240823L295660
1690.9F99179053K824366L384650L839255L455758L476202J977623J468241J782715
1707.2G21387863J344264J064717J130403J585304K306402J649916P06315Q64208J262188
1725.5G33301580J474917J619398J700342K417743K149284J327694J896262K201199
1741.9G48088419J910031K028644K563715L232122L107548K375185K429783K684892
1758.2G68420339K593696K595544K033889J652956J822412J978934K017557J451612
1774.5G84566939R60767J129568J335203J180828R89914Q51154Q42870J196205J384795
$$ plain form
1792.8 794438243 795307696 795916438 796765864 797830224 798766792 799445927 800068259 800847828 801789463
1811.2 801789463 802600861 803205967 803767920 804380059 805071771 805858612 806556106 807037234 807563424 808138251
1831.6 808138251 808639109 809080124 809399962 809613049 809991181 810661733 811138153 811231613 811291695 811515570
1852 811515570 811867058 812166214 812303126 812402844 812628865 812983572 813359201 813621938 813711226 813848495
1872.4 813848495 814211845 814598739 814814389 814975023 815283000 815754771 816234112 816579282 816763282 816972315
1892.8 816972315 817359626 817759275 817932785 817935228 817999184 818260014 818581402 818732917 818691790 818653822
1913.2 818653822 818843424 819204986 819399953 819377363 819384813 819544733 819820642 820020497 820025325 820006549 820158124
1935.6 820158124 820431709 820656598 820742548 820727289 820838273 821125507 821361065 821435094 821469605 821648717
$$ packed form
1792.8G94438243Q69453O08742Q49426J064360R36568O79135O22332P79569R41635
1811.2H01789463Q11398O05106N61953O12139O91712P86841O97494M81128N26190N74827
1831.6H08138251N00858M41015L19838K13087L78132O70552M76420R3460O0082K23875
1852H11515570L51488K99156J36912R9718K26021L54707L75629K62737Q9288J37269
1872.4H13848495L63350L86894K15650J60634L07977M71771M79341L45170J84000K09033
1892.8H16972315L87311L99649J73510K443O3956K60830L21388J51515m1127l7968
1913.2H18653822J89602L61562J94967k2590P450J59920K75909J99855M828j8776J51575
1935.6H20158124K73585K24889Q5950j5259J10984K87234K35558P4029L4511J79112
$$ plain form
1956 821648717 821973026 822262585 822392285 822462380 822642028 822922647 823151052 823243439 823255956 823329329 823533177
1978.5 823533177 823756993 823871076 823863924 823841691 823921263 824086308 824169517 824128985 824114978 824199617 824311018
2000.9 824311018 824301422 824118257 823901057 823799133 823757410 823609054 823314786 822957993 822574735 822170436
2021.3 822170436 821673393 821102083 820757031 820653379 820528269 820310175 820008636 819652379 819333732 819095075
2041.7 819095075 818884373 818664849 818424702 818200529 818066359 818050742 818093836 818094134 818052232 818069041 818189323
2064.1 818189323 818345845 818462014 818504393 818544984 818684340 818862081 818933964 818899214 818894982 819005728 819195807
2086.6 819195807 819358766 819455266 819543242 819691539 819900453 820095539 820232153 820347786 820528090 820787370
2106.9 820787370 821012318 821115911 821172833 821297526 821489632 821637869 821662307 821640909 821700752 821847737
$$ packed form
1956H21648717L24309K89559J29700P0095J79648K80619K28405R2387J2517P3373K03848
1978.5H23533177K23816J14083p152k2233P9572J65045Q3209m0532j4007Q4639J11401
2000.9H24311018r596j83165k17200j01924m1723j48356k94268l56793l83258m04299
2021.3H22170436m97043n71310l45052j03652j25110k18094l01539l56257l18647k38657
2041.7H19095075k10702k19524k40147k24173j34170j5617M3094K98m1902J6809J20282
2064.1H18189323J56522J16169M2379M0591J39356J77741P1883l4750m232J10746J90079
2086.6H19195807J62959R6500Q7976J48297K08914J95086J36614J15633J80304K59280
2106.9H20787370K24948J03593N6922J24693J92106J48237K4438k1398N9843J46985
$$ plain form
2127.3 821847737 821970761 821983278 821943998 821983635 822112679 822209477 822192967 822140753 822179794 822316349 822459638
2149.8 822459638 822541237 822588205 822706997 822974622 823315084 823597491 823807597 824037611 824380875 824860454
2170.2 824860454 825363398 825758219 826135695 826643705 827232122 827732146 828078985 828412890 828859329 829350352
2190.6 829350352 829767644 830085754 830387592 830773234 831207693 831581175 831877887 832181811 832571089 833028495
2211 833028495 833434343 833720088 834000945 834383070 834799588 835144222 835398257 835614622 835882664 836213827
2231.4 836213827 836495221 836675942 836822867 837022841 837297022 837562084 837733805 837854326 838011146 838232517
2251.8 838232517 838474989 838640928 838744640 838897884 839130640 839361489 839500308 839594424 839778483 840066075
2272.2 840066075 840366423 840586603 840674460 840730608 840916574 841194630 841371357 841411650 841446459 841558933
$$ packed form
2127.3H21847737J23024J2517l9280L9637J29044R6798j6510n2214L9041J36555J43289
2149.8H22459638Q1599M6968J18792K67625L40462K82407K10106K30014L43264M79579
2170.2H24860454N02944L94821L77476N08010N88417N00024L46839L33905M46439M91023
2190.6H29350352M17292L18110L01838L85642M34459L73482K96712L03924L89278M57406
2211H33028495M05848K85745K80857L82125M16518L44634K54035K16365K68042L31163
2231.4H36213827K81394J80721J46925J99974K74181K65062J71721J20521J56820K21371
2251.8H38232517K42472J65939J03712J53244K32756K30849J38819R4116J84059K87592
2272.2H40066075L00348K20180Q7857N6148J85966K78056J76727M0293L4809J12474
$$ plain form
2292.5 841558933 841724336 841813266 841774523 841725528 841768622 841872036 841906965 841808140 841688395 841682613 841791093
2315 841791093 841889024 841815531 841599405 841463268 841485620 841472685 841285706 841034830 840872407 840804935 840710223
2337.4 840710223 840484321 840222478 840155184 840207458 840092063 839807928 839482546 839180470 838950515 838795483
2357.8 838795483 838582218 838297904 838114560 838125408 838214457 838206828 838122785 838107944 838175237 838232994 838211179
2380.2 838211179 838079870 837916970 837801933 837689400 837507069 837258935 837006569 836806357 836647689 836441398
2400.6 836441398 836114526 835714519 835375547 835129559 834848285 834432364 833954990 833552241 833203971 832783163
2421 832783163 832266688 831704974 831140935 830626845 830138743 829593241 828990221 828415573 827895284 827371180
2441.4 827371180 826816857 826224029 825607836 825001895 824412942 823842347 823288977 822728276 822142541 821597159
$$ packed form
2292.5H41558933J65403Q8930l8743m8995M3094J03414L4929r8825j19745n782J08480
2315H41791093R7931p3493k16126j36137K2352j2935j86979k50876j62423o7472r4712
2337.4H40710223k25902k61843o7294N2274j15395k84135l25382l02076k29955j55032
2357.8H38795483k13265k84314j83344J0848Q9049p629q4043j4841O7293N7757k1815
2380.2H38211179j31309j62900j15037j12533j82331k48134k52366k00212j58668k06291
2400.6H36441398l26872m00007l38972k45988k81274m15921m77374m02749l48270m20808
2421H32783163n16475n61714n64039n14090m88102n45502o03020n74648n20289n24104
2441.4H27371180n54323n92828o16193o05941n88953n70595n53370n60701n85735n45382
$$ plain form
2461.8 821597159 821135342 820658505 820100307 819539785 819041133 818594635 818150938 817624032 817045152 816545963
2482.2 816545963 816145599 815759778 815329611 814858973 814407170 814061940 813803554 813508749 813144624 812786162
2502.6 812786162 812500000 812241673 811923862 811535060 811135948 810821652 810568810 810239673 809762418 809217393
2523 809217393 808761299 808387041 807935357 807357967 806734383 806153297 805643559 805105984 804433286 803702295
2543.4 803702295 803073883 802560806 802009046 801318586 800603986 800001979 799500704 798993051 798367500 797679603
2563.8 797679603 797068775 796547234 796031773 795434713 794757426 794101238 793535829 793029249 792500675 791913390
2584.2 791913390 791327775 790813744 790367723 789924502 789445937 788997531 788621962 788244426 787791967 787294209
2604.6 787294209 786807239 786304832 785716355 785025537 784268677 783469141 782661319 781855941 781000078 780059934
$$ packed form
2461.8H21597159m61817m76837n58198n60522m98652m46498m43697n26906n78880m99189
2482.2H16545963m00364l85821m30167m70638m51803l45230k58386k94805l64125l58462
2502.6H12786162k86162k58327l17811l88802l99112l14296k52842l29137m77255n45025
2523H09217393m56094l74258m51684n77390o23584n81086n09738n37575o72698p30991
2543.4H03702295o28412n13077n51760o90460p14600o02007n01275n07653o25551o87897
2563.8G97679603o10828n21541n15461n97060o77287o56188n65409n06580n28574n87285
2584.2G91913390n85615n14031m46021m43221m78565m48406l75569l77536m52459m97758
2604.6G87294209m86970n02407n88477o90818p56860p99536q07822q05378q55863r40144
$$ plain form
2625 780059934 779056370 778035164 776996672 775911987 774800181 773690104 772589207 771501839 770425737
2643.4 770425737 769342542 768237889 767147303 766087413 765010118 763910472 762841582 761816919
2659.7 761816919 760799825 759788096 758795619 757804751 756830037 755908787 755020082 754121661 753227413
2678 753227413 752372921 751576722 750797868 749942303 749026060 748148382 747308910 746438563 745488167 744473934
2698.4 744473934 743483365 742527843 741509438 740413070 739312768 738236010 737183809 736173093 735187054
2716.8 735187054 734197319 733232498 732328892 731475532 730647743 729821205 729013920 728287756 727637231 726956546
2737.2 726956546 726181865 725412667 724754095 724146485 723456085 722672880 721939087 721353173 720836461 720273733
2757.6 720273733 719666600 719069660 718523920 718017697 717467606 716805518 716060758 715355933 714712739 713976622
$$ packed form
2625G80059934j003564j021206j038492j084685j111806j110077j100897j087368j076102
2643.4G70425737j083195j104653j090586j059890j077295j099646j068890j024663
2659.7G61816919j017094j011729r92477r90868r74714r21250q88705q98421q94248
2678G53227413q54492p96199p78854q55565r16243q77678q39472q70347r50396j014233
2698.4G44473934r90569r55522j018405j096368j100302j076758j052201j010716r86039
2716.8G35187054r89735r64821r03606q53360q27789q26538q07285p26164o50525o80685
2737.2G26956546p74681p69198o58572o07610o90400p83205p33793n85914n16712n62728
2757.6G20273733o07133n96940n45740n06223n50091o62088p44760p04825o43194p36117
$$ plain form
2778 713976622 713079035 712092578 711095512 710116148 709097266 707968533 706727505 705436349 704146683
2796.3 704146683 702789605 701251209 699568450 697902977 696315348 694675982 692857683 690910459
2812.6 690910459 688949347 687013805 685042262 682939708 680695236 678390265 676094592 673776031
2828.9 673776031 671350539 668805480 666195452 663531721 660726249 657667935 654326260 650752187
2845.3 650752187 647052169 643354475 639798999 636572897 633793056 631356061 628997207 626408279
2861.6 626408279 623352945 619767368 615737677 611405194 606850028 602071702 597176194 592451453
2877.9 592451453 588180840 584498942 581420362 578947127 577105165 575847685 575012684 574401319 573832572
2896.3 573832572 573202133 572525680 571779668 570810139 569485545 567817867 565871298 563541412 560643971
$$ packed form
2778G13976622q97587r86457r97066r79364j018882j128733j241028j291156j289666
2796.3G04146683j357078j538396j682759j665473j587629j639366j818299j947224
2812.6F90910459j961112j935542j971543k102554k244472k304971k295673k318561
2828.9F73776031k425492k545059k610028k663731k805472l058314l341675l574073
2845.3F50752187l700018l697694l555476l226102k779841k436995k358854k588928
2861.6F26408279l055334l585577m029691m332483m555166m778326m895508m724741
2877.9E92451453m270613l681898l078580k473235j841962j257480q35001o11365n68747
2896.3E73832572o30439o76453p46012r69529j324594j667678j946569k329886k897441
$$ plain form
2914.6 560643971 557232082 553594887 550058126 546903312 544325471 542441189 541335762 541092396
2930.9 541092396 541870177 543787539 546727955 550478518 554910839 559840679 564972639 570103645
2947.2 570103645 575250387 580528140 585884213 591161013 596322358 601358473 606197000 610732436
2963.6 610732436 614896178 618698835 622186542 625538707 628928363 632301569 635595739 638775468
2979.9 638775468 641697228 644321382 646767974 649025381 651027620 652760386 654136419 655212283
2996.2 655212283 656084299 656632900 656823397 656803071 656654537 656333923 655776441 654925227 653761446 652371168
3016.6 652371168 650819182 649085045 647226274 645286620 643241823 641193449 639191806 637099564
3032.9 637099564 634808004 632407010 630095124 627832949 625405788 622816622 620227516 617707074
$$ packed form
2914.6E60643971l411889l637195l536761l154814k577841j884282j105427k43366
2930.9E41092396P77781J917362K940416L750563M432321M929840N131960N131006
2947.2E70103645N146742N277753N356073N276800N161345N036115M838527M535436
2963.6F10732436M163742L802657L487707L352165L389656L373206L294170L179729
2979.9F38775468K921760K624154K446592K257407K002239J732766J376033J075864
2996.2F55212283Q72016N48601J90497k0326j48534l20614n57482q51214j163781j390278
3016.6F52371168j551986j734137j858771j939654k044797k048374k001643k092242
3032.9F37099564k291560k400994k311886k262175k427161k589166k589106k520442
$$ plain form
3049.2 617707074 615162909 612544179 609945476 607343793 604686022 602067947 599547923 597090423
3065.5 597090423 594573498 591914356 589218378 586623907 584202349 581887603 579467356 576885700
3081.9 576885700 574256063 571601450 568976343 566435099 563824952 561135232 558604062 556288958
3098.2 556288958 553992331 551522255 548954904 546521187 544200838 541819990 539491355 537367344
3114.5 537367344 535252631 532951593 530447304 527808726 525232017 522864640 520641685 518424392
3130.8 518424392 516174674 513958335 511872232 509841621 507656395 505359411 503129065 500988066
3147.1 500988066 499014258 497250378 495377809 493203819 490993530 488938838 487004906 485119671
3163.4 485119671 483212620 481287509 479387224 477545351 475761145 474009395 472284049 470555067
$$ packed form
3049.2F17707074k544165k618730k598703k601683k657771k618075k520024k457500
3065.5E97090423k516925k659142k695978k594471k421558k314746k420247k581656
3081.9E76885700k629637k654613k625107k541244k610147k689720k531170k315104
3098.2E56288958k296627k470076k567351k433717k320349k380848k328635k124011
3114.5E37367344k114713k301038k504289k638578k576709k367377k222955k217293
3130.8E18424392k249718k216339k086103k030611k185226k296984k230346k140999
3147.1E00988066j973808j763880j872569k173990k210289k054692j933932j885235
3163.4D85119671j907051j925111j900285j841873j784206j751750j725346j728982
$$ plain form
3179.8 470555067 468826383 467168421 465578645 463985175 462337554 460648715 458999068 457436860
3196.1 457436860 455903918 454361022 452869594 451424688 449973434 448541909 447144389 445791543
3212.4 445791543 444493949 443197221 441887230 440570384 439238071 437938184 436713308 435589373
3228.7 435589373 434581339 433558047 432318985 430956721 429676861 428467572 427408427 426571250
3245 426571250 425677270 424524635 423328966 422357321 421531081 420619309 419644147 418718934 417848200 417055696
3265.4 417055696 416393042 415807635 415097475 414212048 413288683 412361264 411484927 410723150 409985572 409243912
3285.8 409243912 408599555 408092409 407560349 406808734 405909032 404995710 404122263 403414369 402876168 402278543
3306.2 402278543 401412517 400285721 399112731 398053169 397078633 396123797 395177126 394285619 393413097
$$ packed form
3179.8D70555067j728684j657962j589776j593470j647621j688839j649647j562208
3196.1D57436860j532942j542896j491428j444906j451254j431525j397520j352846
3212.4D45791543j297594j296728j309991j316846j332313j299887j224876j123935
3228.7D35589373j008034j023292j239062j362264j279860j209289j059145q37177
3245D26571250q93980j152635j195669r71645q26240r11772r75162r25213q70734p92504
3265.4D17055696o62654n85407p10160q85427r23365r27419q76337p61777p37578p41660
3285.8D09243912o44357n07146n32060p51615q99702r13322q73447p07894n38201n97625
3306.2D02278543q66026j126796j172990j059562r74536r54836r46671q91507q72522
$$ plain form
3324.6 393413097 392384648 391191691 390024960 388956487 388014972 387203187 386283904 385155290 383993745
3342.9 383993745 382810026 381641269 380662113 379637837 378298849 376925498 375799984 374831825 373807281
3361.3 373807281 372752368 371904641 371127725 370042652 368630469 367215931 366038144 365063965 364139646
3379.6 364139646 363161564 362236112 361472666 360909790 360629529 360346228 359619111 358774036 358381778 358202785
3400 358202785 357623875 356655806 355912745 355557680 355264574 354912758 354426205 353832394 353496432 353469193
3420.4 353469193 353354961 353152215 353179604 353433609 353699178 353992462 354338825 354446113 354208142 354046822
3440.8 354046822 354204744 354698747 355498880 356065005 356302679 356695890 357311189 358058274 358925343 359768420
3461.2 359768420 360565096 361596346 362796903 363606930 363946289 364388257 365151912 366082400 367181182
$$ packed form
3324.6C93413097j028449j192957j166731j068473r41515q11785r19283j128614j161545
3342.9C83993745j183719j168757r79156j024276j338988j373351j125514r68159j024544
3361.3C73807281j054913q47727p76916j085073j412183j414538j177787r74179r24319
3379.6C64139646r78082r25452p63446n62876k80261k83301p27117q45075l92258j78993
3400C58202785n78910r68069p43061l55065k93106l51816m86553n93811l35962k7239
3420.4C53469193j14232k02746K7389K54005K65569K93284L46363J07288k37971j61320
3440.8C54046822J57922M94003Q00133N66125K37674L93211O15299P47085Q67069Q43077
3461.2C59768420P96676J031250J200557Q10027L39359M41968P63655R30488J098782
$$ plain form
3479.6 367181182 368228287 369014084 369888932 370976955 371947974 372800589 373841047 375074416 376052946
3497.9 376052946 376891017 378237993 379578173 380229980 381003171 382329375 383641958 384694934 385619789
3516.3 385619789 386533916 387630880 389185548 390761197 391942501 393139690 394366413 395485401
3532.6 395485401 396918654 398555547 399759591 400793672 402375460 404605001 406555772 407681257
3548.9 407681257 409028351 410924971 412563413 414070994 415889978 417550027 418797672 421208590
3565.2 421208590 425583094 428960115 430477202 432160676 434628427 437434763 440370679 443039626
3581.5 443039626 445334613 448692024 453529269 457107008 459300339 462346911 466176033 469867468
3597.9 469867468 473647296 477148503 479822874 482796639 487040460 491380632 495275110 498828739
$$ packed form
3479.6C67181182J047105P85797Q74848J088023R71019Q52615J040458J233369R78530
3497.9C76052946Q38071J346976J340180O51807P73191J326204J312583J052976R24855
3516.3C85619789R14127J096964J554668J575649J181304J197189J226723J118988
3532.6C95485401J433253J636893J204044J034081J581788K229541J950771J125485
3548.9D07681257J347094J896620J638442J507581J818984J660049J247645K410918
3565.2D21208590M374504L377021J517087J683474K467751K806336K935916K668947
3581.5D43039626K294987L357411M837245L577739K193331L046572L829122L691435
3597.9D69867468L779828L501207K674371K973765M243821M340172L894478L553629
$$ plain form
3614.2 498828739 502061725 506627321 511846721 514916360 516426206 519168139 525432885 531471252
3630.5 531471252 534574091 537568390 540939569 544284642 547631085 550411761 552740932 556517541
3646.8 556517541 563170016 568728566 570877910 573421776 577632725 581241369 583969474 586412609
3663.1 586412609 588478625 590960562 594843864 598182261 600681543 604915619 608693242 610645592
3679.4 610645592 612405598 614026427 615830839 619139612 623282135 625727117 627042890 628489733
3695.8 628489733 630114615 632136226 634568810 636305571 637318611 638661563 641126752 644061506
3712.1 644061506 645702183 646526158 647563934 648905158 650330245 651811481 653119266 653890312 654649973
3730.4 654649973 656254768 658792853 661090732 661807477 661626339 662481427 664482653 665474236 666527867
$$ packed form
3614.2D98828739L232986M565596N219400L069639J509846K741933O264746O038367
3630.5E31471252L102839K994299L371179L345073L346443K780676K329171L776609
3646.8E56517541O652475N558550K149344K543866M210949L608644K728105K443135
3663.1E86412609K066016K481937L883302L338397K499282M234076L777623J952350
3679.4F10645592J760006J620829J804412L308773M142523K444982J315773J446843
3695.8F28489733J624882K021611K432584J736761J013040J342952K465189K934754
3712.1F44061506J640677Q23975J037776J341224J425087J481236J307785P71046P59661
3730.4F54649973J604795K538085K297879P16745j81138Q55088K001226R91583J053631
$$ plain form
3748.8 666527867 668901205 670495152 670848072 671515882 672896028 674000561 674674034 675545216 676693916
3767.1 676693916 678147256 679350019 679890335 680367947 681401849 682763815 683639824 684285939 685128272
3785.5 685128272 685943007 686663866 687210679 687768161 688533127 689145565 690175056 691591024 692208827
3803.9 692208827 692978382 694001079 694207430 694171965 694843948 695912004 696654856 697878778 699063420
3822.2 699063420 699343920 699553311 699859858 700311482 700976014 701720595 702668130 703543723 704104781 704774559
3842.6 704774559 705320597 705193937 704627275 704761684 706753135 708595693 708595574 708309114 708514333 709189713
3863 709189713 709672749 709917963 710639298 711497784 712067366 712316692 712373257 712824762 713356614 713935018
3883.4 713935018 714787483 715081692 715237677 715825021 716073871 715945542 716127157 716767669 717652261 718478680
$$ packed form
3748.8F66527867K373338J593947L52920O67810J380146J104533O73473Q71182J148700
3767.1F76693916J453340J202763N40316M77612J033902J361966Q76009O46115Q42333
3785.5F85128272Q14735P20859N46813N57482P64966O12438J029491J415968O17803
3803.9F92208827P69555J022697K06351l5465O71983J068056P42852J223922J184642
3822.2F99063420K80500K09391L06547M51624O64532P44581R47535Q75593N61058O69778
3842.6G04774559N46038j26660n66662J34409J991451J842558j19k86460K05219O75380
3863G09189713M83036K45214P21335Q58486N69582K49326N6565M51505N31852N78404
3883.4G13935018Q52465K94209J55985N87344K48850j28329J81615O40512Q84592Q26419
$$ plain form
3903.8 718478680 718840241 718846560 718888044 718984365 719159961 719585538 720044255 720214784 720351756 720676780
3924.2 720676780 720878065 720981121 721366942 721897542 722205639 722325385 722394705 722569704 722895265 723142445
3944.6 723142445 723378837 723736286 724024057 724192798 724369645 724586427 724850893 725146353 725393236 725538611
3965 725538611 725622654 725767314 725989997 726224363 726441920 726631165 726824343 727079630 727351964 727534235
3985.4 727534235 727663517 727862418 728088140 728215933 728318870 728523672
3997.6 728523672
$$ packed form
3903.8G18478680L61561O319M1484R6321J75596M25577M58717J70529J36972L25024
3924.2G20676780K01285J03056L85821N30600L08097J19746O9320J74999L25561K47180
3944.6G23142445K36392L57449K87771J68741J76847K16782K64466K95460K46883J45375
3965G25538611Q4043J44660K22683K34366K17557J89245J93178K55287K72334J82271
3985.4G27534235J29282J98901K25722J27793J02937K04802
3997.6G28523672
##END=$$ End of the data block
